{
  "environment": "local",
  "baseurl": "https://localhost:4200/",
  "webapi": {
    "http": "{{ cookiecutter.dev_api_endpoint }}"
  },
  "auth": {
    "issuerUrl": "{{ cookiecutter.dev_oauth_issuer_url }}",
    "requireTls": false,
    "clientId": "{{ cookiecutter.dev_oauth_client_id }}"
  },
  "applicationInsights": null
}
