

{
  "results": [
    {
      "category": "General Knowledge",
      "type": "multiple",
      "difficulty": "medium",
      "question": "What is the unit of currency in Laos?",
      "correct_answer": "Kip",
      "incorrect_answers": [
        "Ruble",
        "Konra",
        "Dollar"
      ]
    },
    {
      "category": "Geography",
      "type": "boolean",
      "difficulty": "medium",
      "question": "Vietnam is the only country in the world that starts with V. ",
      "correct_answer": "False",
      "incorrect_answers": [
        "True"
      ]
    },
    {
      "category": "General Knowledge",
      "type": "boolean",
      "difficulty": "easy",
      "question": "In 2010, Twitter and the United States Library of Congress partnered together to archive every tweet by American citizens.",
      "correct_answer": "True",
      "incorrect_answers": [
        "False"
      ]
    },
    {
      "category": "Science: Computers",
      "type": "boolean",
      "difficulty": "medium",
      "question": "The last Windows operating system to be based on the Windows 9x kernel was Windows 98.",
      "correct_answer": "False",
      "incorrect_answers": [
        "True"
      ]
    },
    {
      "category": "Science: Computers",
      "type": "multiple",
      "difficulty": "hard",
      "question": "Which kind of algorithm is Ron Rivest not famous for creating?",
      "correct_answer": "Secret sharing scheme",
      "incorrect_answers": [
        "Hashing algorithm",
        "Asymmetric encryption",
        "Stream cipher"
      ]
    }
  ]
}
