{
  "project_info": {
    "project_number": "194774147946",
    "firebase_url": "https://dwarpal-26012020.firebaseio.com",
    "project_id": "dwarpal-26012020",
    "storage_bucket": "dwarpal-26012020.appspot.com"
  },
  "client": [
    {
      "client_info": {
        "mobilesdk_app_id": "1:194774147946:android:4fb58157e3be9b2351bb13",
        "android_client_info": {
          "package_name": "com.janani.dwarpal"
        }
      },
      "oauth_client": [
        {
          "client_id": "194774147946-kp11fcamv00qucsjea38aq6b5tkt121t.apps.googleusercontent.com",
          "client_type": 3
        }
      ],
      "api_key": [
        {
          "current_key": "AIzaSyDl3H_HyFl0MyHOG5gaqe_E79Mcp86EZZI"
        }
      ],
      "services": {
        "appinvite_service": {
          "other_platform_oauth_client": [
            {
              "client_id": "194774147946-kp11fcamv00qucsjea38aq6b5tkt121t.apps.googleusercontent.com",
              "client_type": 3
            },
            {
              "client_id": "194774147946-opsmprqua4rkobb66ubrqc0denger586.apps.googleusercontent.com",
              "client_type": 2,
              "ios_info": {
                "bundle_id": "com.janani.dwarpal"
              }
            }
          ]
        }
      }
    }
  ],
  "configuration_version": "1"
}