module gitlab.com/nx-lab/caddy-gatekeeper/plugin/v2

go 1.15

require (
	github.com/Masterminds/sprig v2.22.0+incompatible
	github.com/caddyserver/caddy/v2 v2.4.0
	github.com/containerd/containerd v1.5.1 // indirect
	github.com/docker/docker v20.10.6+incompatible
	github.com/docker/go-connections v0.4.0 // indirect
	github.com/fsnotify/fsnotify v1.4.9
	github.com/moby/term v0.0.0-20201216013528-df9cb8a40635 // indirect
	github.com/morikuni/aec v1.0.0 // indirect
	github.com/stretchr/testify v1.7.0
	go.uber.org/zap v1.16.0

)
