<?xml version="1.0" standalone="no"?>
<!DOCTYPE svg PUBLIC "-//W3C//DTD SVG 20010904//EN"
 "http://www.w3.org/TR/2001/REC-SVG-20010904/DTD/svg10.dtd">
<svg version="1.0" xmlns="http://www.w3.org/2000/svg"
 width="512.000000pt" height="512.000000pt" viewBox="0 0 512.000000 512.000000"
 preserveAspectRatio="xMidYMid meet">
<metadata>
Created by potrace 1.14, written by Peter Selinger 2001-2017
</metadata>
<g transform="translate(0.000000,512.000000) scale(0.100000,-0.100000)"
fill="#000000" stroke="none">
<path d="M3065 4271 c-151 -54 -273 -128 -371 -225 -164 -164 -192 -358 -85
-591 16 -33 55 -102 89 -153 33 -50 70 -118 82 -150 48 -125 28 -245 -55 -321
-50 -46 -45 -49 52 -26 198 47 317 166 316 315 -1 85 -17 136 -96 300 -96 199
-116 264 -122 395 -7 156 43 270 175 401 41 41 72 74 70 73 -3 0 -27 -8 -55
-18z"/>
<path d="M2438 3702 c-27 -17 -72 -63 -117 -117 -80 -96 -101 -244 -48 -340
36 -64 67 -98 154 -168 39 -31 80 -69 91 -84 37 -53 46 -128 21 -176 -18 -32
-2 -31 48 5 96 69 132 156 99 241 -11 28 -51 79 -117 148 -129 134 -163 198
-164 309 0 65 4 85 31 138 17 34 30 62 30 62 -1 0 -13 -8 -28 -18z"/>
<path d="M540 2745 c0 -21 165 -341 242 -469 74 -123 234 -357 257 -376 3 -3
22 -25 42 -50 95 -117 277 -301 373 -375 21 -16 48 -38 60 -49 80 -69 318
-217 458 -284 283 -136 613 -221 953 -247 69 -5 423 -6 460 -1 17 3 59 7 95
11 159 14 335 43 495 81 11 3 31 7 45 10 135 27 599 184 633 214 5 4 -38 -3
-95 -15 -57 -13 -121 -26 -143 -29 -22 -4 -78 -13 -125 -21 -242 -40 -382 -50
-685 -50 -233 0 -344 5 -470 19 -414 49 -802 163 -1180 349 -156 77 -445 255
-540 334 -5 4 -30 24 -55 43 -25 19 -50 39 -56 45 -6 5 -36 30 -65 55 -93 78
-301 289 -404 411 -51 60 -187 242 -239 318 -31 46 -56 80 -56 76z"/>
<path d="M1508 2602 c-51 -6 -53 -17 -52 -318 1 -254 10 -365 32 -423 8 -22
64 -65 187 -145 50 -33 102 -68 117 -78 15 -10 30 -18 33 -18 3 0 24 -12 47
-26 131 -83 417 -209 636 -280 101 -33 110 -35 167 -24 98 18 266 79 321 115
74 48 153 128 217 217 30 43 57 83 59 89 3 9 47 13 144 14 169 1 221 16 294
82 192 172 130 473 -114 559 -22 8 -75 15 -116 16 -112 1 -107 -3 -108 81 0
111 0 115 -24 129 -18 9 -230 12 -918 12 -492 1 -907 0 -922 -2z m2080 -371
c77 -39 121 -150 93 -234 -17 -50 -76 -105 -130 -120 -36 -10 -174 -15 -213
-8 -3 0 0 21 7 46 21 68 27 120 27 230 0 55 2 103 4 107 3 4 42 6 87 4 60 -3
95 -10 125 -25z"/>
<path d="M471 2445 c-1 -6 8 -38 19 -70 144 -419 374 -767 670 -1016 36 -30
67 -56 70 -59 44 -45 243 -172 372 -238 139 -71 189 -92 320 -136 208 -69 375
-106 228 -51 -175 66 -224 88 -374 163 -379 192 -694 458 -957 807 -51 68
-149 212 -149 219 0 3 -13 24 -29 48 -24 36 -117 222 -159 318 -6 14 -11 20
-11 15z"/>
</g>
</svg>
