<?xml version="1.0" encoding="UTF-8"?>
<svg width="16px" height="16px" viewBox="0 0 16 16" version="1.1" xmlns="http://www.w3.org/2000/svg" xmlns:xlink="http://www.w3.org/1999/xlink">
    <!-- Generator: Sketch 48.2 (47327) - http://www.bohemiancoding.com/sketch -->
    <title>Combined Shape</title>
    <desc>Created with Sketch.</desc>
    <defs></defs>
    <g id="Landingpage" stroke="none" stroke-width="1" fill="none" fill-rule="evenodd" transform="translate(-463.000000, -8098.000000)">
        <g id="Group-19" transform="translate(0.000000, 7009.000000)" fill="#FFFFFF" fill-rule="nonzero">
            <g id="Group-38" transform="translate(103.000000, 1086.000000)">
                <g id="Group-7" transform="translate(360.000000, 0.000000)">
                    <path d="M12.627199,12.9415323 C12.2997998,12.6021505 11.9048955,12.4206989 11.4863644,12.4206989 C11.0712086,12.4206989 10.6729291,12.5987903 10.3320288,12.938172 L9.26544974,13.9966398 C9.17769323,13.9495968 9.08993672,13.905914 9.00555546,13.8622312 C8.88404645,13.8017473 8.76928794,13.7446237 8.67140568,13.6841398 C7.67233159,13.0524194 6.76438926,12.2291667 5.89357468,11.1639785 C5.4716684,10.6330645 5.18814737,10.1861559 4.9822571,9.73252688 C5.25902763,9.48051075 5.51554665,9.21841398 5.76531517,8.96639785 C5.85982218,8.87231183 5.95432919,8.77486559 6.0488362,8.68077957 C6.75763876,7.97513441 6.75763876,7.06115591 6.0488362,6.35551075 L5.12739286,5.43817204 C5.02276011,5.33400538 4.9147521,5.22647849 4.81349459,5.11895161 C4.61097957,4.91061828 4.3983388,4.69556452 4.17894753,4.49395161 C3.85154825,4.17137097 3.46001921,4 3.04823868,4 C2.63645814,4 2.23817861,4.17137097 1.90065357,4.49395161 C1.89727832,4.49731183 1.89727832,4.49731183 1.89390307,4.50067204 L0.746317971,5.65322581 C0.314285933,6.08333333 0.0678926606,6.60752688 0.0138886557,7.21572581 C-0.0671173515,8.1969086 0.223154175,9.1108871 0.445920694,9.70900538 C0.992711244,11.1774194 1.80952182,12.5383065 3.02798718,13.9966398 C4.50634681,15.7540323 6.28510372,17.1418011 8.3170044,18.1196237 C9.09331197,18.4858871 10.1295138,18.9193548 11.2872247,18.9932796 C11.3581049,18.9966398 11.4323604,19 11.4998654,19 C12.2795483,19 12.9343468,18.7211022 13.4473849,18.1666667 C13.4507601,18.1599462 13.4575106,18.156586 13.4608859,18.1498656 C13.6363989,17.938172 13.8389139,17.7466398 14.0515547,17.5416667 C14.1966904,17.4038978 14.3452014,17.2594086 14.4903372,17.1081989 C14.824487,16.7620968 15,16.358871 15,15.9455645 C15,15.5288978 14.8211117,15.1290323 14.4802115,14.7930108 L12.627199,12.9415323 Z M13.7457271,16.406879 C13.7423978,16.406879 13.7423978,16.4101911 13.7457271,16.406879 C13.6158864,16.5459873 13.4827164,16.6718471 13.3395587,16.8109554 C13.1231575,17.0163057 12.903427,17.2315924 12.6970136,17.4733758 C12.3607594,17.8310828 11.9645787,18 11.4452159,18 C11.3952771,18 11.3420091,18 11.2920704,17.9966879 C10.3032834,17.933758 9.38441061,17.5495541 8.69525602,17.2216561 C6.81090097,16.3141401 5.15626412,15.0257325 3.7812842,13.3928662 C2.64601022,12.0315924 1.8869414,10.7729936 1.38422477,9.42165605 C1.07460459,8.59694268 0.961410118,7.9543949 1.01134886,7.34828025 C1.04464135,6.96076433 1.19445756,6.63949045 1.47078525,6.36458599 L2.60605923,5.23515924 C2.76919244,5.08280255 2.9423134,5 3.11210511,5 C3.32184781,5 3.49163951,5.12585987 3.59817549,5.23184713 C3.60150474,5.23515924 3.60483399,5.23847134 3.60816324,5.24178344 C3.81124744,5.43057325 4.00434389,5.62598726 4.20742809,5.83464968 C4.31063482,5.94063694 4.41717079,6.0466242 4.52370677,6.15592357 L5.4325918,7.06012739 C5.78549222,7.41121019 5.78549222,7.73579618 5.4325918,8.08687898 C5.33604357,8.18292994 5.2428246,8.27898089 5.14627637,8.37171975 C4.86661944,8.65656051 4.6002795,8.92152866 4.31063482,9.17987261 C4.30397632,9.18649682 4.29731782,9.18980892 4.29398857,9.19643312 C4.00767314,9.48127389 4.06094113,9.75949045 4.12086761,9.94828025 C4.12419686,9.95821656 4.12752611,9.96815287 4.13085536,9.97808917 C4.36723206,10.5477707 4.70015698,11.0843312 5.20620286,11.7235669 L5.20953211,11.726879 C6.12840489,12.8529936 7.0972164,13.7307006 8.1659054,14.4030573 C8.30240462,14.489172 8.44223308,14.5587261 8.57540305,14.6249682 C8.69525602,14.684586 8.8084505,14.7408917 8.90499872,14.8005096 C8.91831572,14.8071338 8.93163272,14.8170701 8.94494971,14.8236943 C9.05814419,14.88 9.16468016,14.9064968 9.27454539,14.9064968 C9.55087307,14.9064968 9.72399403,14.7342675 9.78059126,14.6779618 L10.9191945,13.5452229 C11.032389,13.4326115 11.2121684,13.2968153 11.4219111,13.2968153 C11.6283246,13.2968153 11.7981163,13.4259873 11.901323,13.5385987 C11.9046523,13.5419108 11.9046523,13.5419108 11.9079815,13.5452229 L13.7423978,15.3701911 C14.0853105,15.7080255 14.0853105,16.0557962 13.7457271,16.406879 Z M8.38910308,6.93782741 C8.12998649,6.89580493 7.96191086,6.64717195 8.00743134,6.39153523 C8.05295182,6.13589851 8.29456054,5.96430673 8.55367713,6.00632921 C9.6636766,6.19543035 10.6756319,6.72071129 11.4774928,7.52264019 C12.2793536,8.32456909 12.8045899,9.33661036 12.993675,10.4467041 C13.0356939,10.7058427 12.8641167,10.9509738 12.6050001,10.9929963 C12.5769875,10.9964981 12.5524765,11 12.5244639,11 C12.2968614,11 12.0972716,10.8389138 12.0587543,10.6077902 C11.9011834,9.69029953 11.4704896,8.85685377 10.8051902,8.19149791 C10.1398909,7.52614206 9.30651589,7.09190982 8.38910308,6.93782741 Z M15.9926719,10.4443599 C16.0389587,10.704371 15.8609328,10.9536967 15.601015,10.9928764 C15.5725309,10.9964382 15.5476073,11 15.5191231,11 C15.2876895,11 15.08474,10.8361574 15.0455743,10.6010789 C14.7642934,8.94128215 13.9809796,7.42751903 12.7775248,6.22363212 C11.5740699,5.02330701 10.06085,4.23615018 8.40164891,3.95476833 C8.13817063,3.90846499 7.96370528,3.66270109 8.00643149,3.39912822 C8.05271821,3.13911714 8.29839391,2.96102736 8.55831168,3.0073307 C10.4169017,3.32433051 12.1081475,4.20053222 13.454023,5.54689096 C14.7998986,6.89324969 15.6757859,8.58510259 15.9926719,10.4443599 Z" id="Combined-Shape"></path>
                </g>
            </g>
        </g>
    </g>
</svg>