[
  {
    "id": 1,
    "createBy": "admin",
    "modifyBy": "admin",
    "description": "ADMIN",
    "name": "ROLE_ADMIN"
  },
  {
    "id": 2,
    "createBy": "admin",
    "modifyBy": "admin",
    "description": "USER",
    "name": "ROLE_USER"
  },
  {
    "id": 3,
    "createBy": "admin",
    "modifyBy": "admin",
    "name":"ROLE_MANAGE",
    "description":"MANAGE"

  }
]
