<svg width="16" height="17" viewBox="0 0 16 17" fill="none" xmlns="http://www.w3.org/2000/svg">
<g clip-path="url(#clip0_1046_4717)">
<path fill-rule="evenodd" clip-rule="evenodd" d="M8.00033 1.87744C8.55366 1.87744 9.04433 2.26211 9.40366 2.64811C9.67366 2.93744 9.93099 3.30211 10.143 3.72144C10.7518 3.4068 11.4217 3.22802 12.1063 3.19744C12.8223 3.16411 13.2877 3.73611 13.3303 4.32144L13.3337 4.40944V5.87744C13.3336 7.14757 12.8803 8.37599 12.0555 9.34179C11.2306 10.3076 10.0881 10.9474 8.83366 11.1461L8.66699 11.1694V13.2161C9.38433 12.7701 10.4417 12.2468 11.839 11.8974C11.9245 11.8745 12.0137 11.8688 12.1014 11.8807C12.1891 11.8926 12.2735 11.9219 12.3498 11.9668C12.4261 12.0116 12.4927 12.0713 12.5457 12.1422C12.5987 12.213 12.637 12.2938 12.6585 12.3796C12.68 12.4655 12.6841 12.5548 12.6707 12.6423C12.6573 12.7298 12.6266 12.8137 12.5804 12.8892C12.5343 12.9647 12.4735 13.0303 12.4017 13.082C12.3299 13.1338 12.2485 13.1708 12.1623 13.1908C11.2582 13.4116 10.3897 13.7586 9.58233 14.2214L9.35233 14.3601L9.24699 14.4268L9.05633 14.5548L8.89233 14.6714L8.75566 14.7754L8.64499 14.8641L8.52899 14.9628C8.37366 15.1014 8.21966 15.2108 8.00033 15.2108C7.81433 15.2108 7.67499 15.1321 7.54166 15.0234L7.36166 14.8694L7.25299 14.7814L7.11633 14.6781L6.95366 14.5608L6.86166 14.4988L6.65833 14.3661L6.54633 14.2974L6.30166 14.1554C5.52695 13.7261 4.69858 13.4017 3.83833 13.1908C3.75286 13.17 3.67235 13.1325 3.60143 13.0805C3.53051 13.0285 3.47059 12.963 3.42511 12.8877C3.37962 12.8124 3.34949 12.7289 3.33643 12.6419C3.32337 12.555 3.32765 12.4663 3.34902 12.3809C3.3704 12.2956 3.40844 12.2154 3.46096 12.1448C3.51348 12.0743 3.57943 12.0148 3.65503 11.9699C3.73063 11.925 3.81437 11.8954 3.90144 11.883C3.9885 11.8705 4.07717 11.8755 4.16233 11.8974C5.46566 12.2234 6.47366 12.7014 7.18566 13.1261L7.33366 13.2161V11.1694C6.07442 11.0106 4.91309 10.4079 4.05825 9.46972C3.2034 8.53155 2.71107 7.31932 2.66966 6.05077L2.66699 5.87744V4.40011C2.66699 3.79344 3.12833 3.16677 3.87166 3.18677C4.36099 3.20011 5.10766 3.29877 5.87166 3.69544C6.06428 3.31473 6.30834 2.96231 6.59699 2.64811C6.95699 2.26211 7.44633 1.87744 8.00033 1.87744ZM4.00033 4.52811V5.87744C4.00045 6.82276 4.33525 7.7375 4.94539 8.45954C5.55553 9.18159 6.40161 9.66429 7.33366 9.82211C7.32366 7.30144 6.63166 6.01877 5.92633 5.35544C5.32033 4.78544 4.62299 4.59344 4.10699 4.53744L4.00033 4.52877V4.52811ZM12.0003 4.54144C11.475 4.59144 10.719 4.78144 10.0697 5.39944C9.36299 6.07077 8.67699 7.34744 8.66699 9.82211C9.57116 9.66903 10.3953 9.21003 11.0015 8.52192C11.6077 7.83381 11.9591 6.95836 11.997 6.04211L12.0003 5.87744V4.54144ZM8.00033 3.21744C7.83366 3.28677 7.69299 3.42744 7.57233 3.55677C7.35366 3.79077 7.13233 4.11677 6.96299 4.50344C7.36833 4.91544 7.72633 5.43811 8.00833 6.09411C8.29099 5.45211 8.64766 4.93877 9.04966 4.53144C8.89921 4.17373 8.68911 3.84415 8.42833 3.55677C8.30833 3.42744 8.16699 3.28677 8.00033 3.21744Z" fill="#E35120"/>
</g>
<defs>
<clipPath id="clip0_1046_4717">
<rect width="16" height="16" fill="white" transform="translate(0 0.543945)"/>
</clipPath>
</defs>
</svg>
