{
  "users": [
    {
      "id": 1,
      "login": "test",
      "passwd": "test"
    },
    {
      "login": "asd",
      "passwd": "asd",
      "id": 2
    },
    {
      "login": "asd",
      "passwd": "asd",
      "id": 3
    },
    {
      "login": "asd",
      "passwd": "asd",
      "id": 4
    },
    {
      "login": "asd",
      "passwd": "asd",
      "id": 5
    },
    {
      "login": "asd",
      "passwd": "asd",
      "id": 6
    },
    {
      "login": "test",
      "passwd": "test",
      "id": 7
    },
    {
      "login": "asd",
      "passwd": "asd",
      "id": 8
    },
    {
      "login": "asd",
      "passwd": "asd",
      "id": 9
    },
    {
      "login": "asd",
      "passwd": "asd",
      "id": 10
    },
    {
      "login": "aqq",
      "passwd": "aqq",
      "id": 11
    },
    {
      "login": "asd",
      "passwd": "asd",
      "id": 12
    },
    {
      "login": "asdf",
      "passwd": "asdf",
      "id": 13
    },
    {
      "login": "asd",
      "passwd": "asd",
      "id": 14
    },
    {
      "login": "asd",
      "passwd": "asd",
      "id": 15
    },
    {
      "login": "qwer",
      "passwd": "qwer",
      "id": 16
    }
  ]
}