{
  "images" : [
    {
      "filename" : "dkfkiv2cviffbs0e0gt303oncb-0827aa678c7446831b26d4e0e59bda19.png",
      "idiom" : "universal",
      "scale" : "1x"
    },
    {
      "filename" : "dkfkiv2cviffbs0e0gt303oncb-0827aa678c7446831b26d4e0e59bda19-1.png",
      "idiom" : "universal",
      "scale" : "2x"
    },
    {
      "filename" : "dkfkiv2cviffbs0e0gt303oncb-0827aa678c7446831b26d4e0e59bda19-2.png",
      "idiom" : "universal",
      "scale" : "3x"
    }
  ],
  "info" : {
    "author" : "xcode",
    "version" : 1
  }
}
