<svg width="15" height="12" viewBox="0 0 15 12" fill="none" xmlns="http://www.w3.org/2000/svg">
<path d="M5.61117 10.8611L14.3611 2.1115L14.3612 2.11146C14.4899 1.98249 14.5622 1.80766 14.5621 1.62541C14.5621 1.44316 14.4896 1.26839 14.3608 1.13953C14.2319 1.01066 14.0571 0.938238 13.8749 0.938179C13.6926 0.93812 13.5178 1.01043 13.3888 1.13921L13.3888 1.13924L5.12496 9.40277L1.23604 5.5142L1.19253 5.55772L1.23604 5.5142C1.1722 5.45037 1.0964 5.39973 1.01299 5.36519C0.929579 5.33065 0.84018 5.31287 0.749897 5.31288C0.659615 5.31289 0.570219 5.33068 0.486812 5.36524C0.403405 5.39979 0.327621 5.45044 0.263788 5.51428C0.199954 5.57813 0.149321 5.65392 0.114779 5.73733C0.0802365 5.82075 0.0624617 5.91015 0.0624695 6.00043C0.0624773 6.09071 0.0802673 6.18011 0.114824 6.26351C0.149381 6.34692 0.200027 6.4227 0.26387 6.48654L4.63881 10.8611L5.61117 10.8611Z" fill="white" stroke="white" stroke-width="0.125"/>
</svg>
