 FILENAME,  S1A_EW_VISIBILITY_SEGMENTS_20230226_000000_20230306_000000_0001.CSV,,
 CREATION_DATE,  2023-03-09T07:12:55,,
 EXECUTABLE_NAME_VERSION,  AeolusBalloonPass_v1.1,,
 MISSION,  SENTINEL1A,,
 ORBIT_FILE,  S1A_OPER_MPL_ORBSCT_20140507T150704_99999999T999999_0024.EOF,,
 SWATH_FILE,  SDF_SARWEW.S1,,
 SWATH_ID,  EW,,
 BALLOON_TRAJECTORY_FILE,  2023-JUDY_15P__trajectory.txt,,
 RADIUS[m],  100000.000000,,
 TIME_REFERENCE_DATE,  2000-01-01T00:00:00,,
 TIME_DIFFERENCE[days],  0.080000,,
 BALLOON_FILETYPE,  SEC_SINCE_REF_DATE_LON_LAT_H,,
 VALIDITY_START,  2023-02-26T00:00:00,,
 VALIDITY_STOP,  2023-03-06T00:00:00,,
 BALLOON_ID,   BALLOON_LON[deg],   BALLOON_LAT[deg],   BALLOON_ALT[m],   BALLOON_RADIUS[km],   BALLOON_UTC_TIME,   PASS,    ASCENDING/DESCENDING PASS,   UTC_TIME,   ABS_ORBIT,       REL_ORBIT,    SECONDS_SINCE_ANX[s],   DISTANCE_TO_MID_SWATH[km],   MID_SWATH_TOPOCENTRIC_AZIMUTH[deg],    MID_SWATH_TOPOCENTRIC_ELEVATION[deg],  TIME_DIFFERENCE_OBS_VS_BALLOON[days],
BALLOON_00022,-173.000000,-029.000000,+0000.000,100.000000,2023-03-04T06:00:00,   1,   ASC,   2023-03-04T06:21:05,   47490, 168,  5417.715374,  +000247.081971,  +255.135161,  +053.429358,  +000.014646,
BALLOON_00026,-162.200000,-031.300000,+0000.000,100.000000,2023-03-05T06:00:00,   1,   ASC,   2023-03-05T05:23:07,   47504, 007,  5395.215585,  +000154.936219,  +254.924655,  +053.462505,  -000.025615,
EOF,,,,,,,,