{
    "fields":
    [
        {"bytes":"eb2981df04ea2954aca086449a8a742edf25a02b239bd464669791cb"},
        {"bytes":"3664346535393538"},
        {"bytes":"1fa8ed49599a9ae7ba273283b2b7aada864bd7e45ac0ffec334a48e8"},
        {"bytes":"1fa8ed49599a9ae7ba273283b2b7aada864bd7e45ac0ffec334a48e8"},
        {"int":1668775946000}
        
        ]
        ,
        "constructor":0
}
