,links,class,general prob,binary,agree,disagree,disuss,unrelated
0,https://www.snopes.com/fact-check/slaves-build-us-capitol/,1.0,0.19999854397982,1.0,3.3763122e-06,2.4600563e-06,3.8639459e-06,0.99999022
1,https://www.snopes.com/fact-check/4000-vaccinated-massachusetts/,1.0,0.0670874343,1.0,0.25545964,0.30590621,0.40910316,0.029530933
2,https://www.snopes.com/fact-check/matt-gaetz-tweet-defund-fbi/,1.0,0.0455852959,1.0,0.31236377,0.19133848,0.45970976,0.036588009
3,https://www.snopes.com/fact-check/florida-university-surveys/,1.0,0.021563625099999997,1.0,0.12364473,0.07467629,0.76853716,0.033141851
4,https://www.snopes.com/fact-check/pre-stained-wet-pants-denim/,1.0,0.0242169407,1.0,0.57581824,0.10287157,0.30309704,0.018213117
5,https://www.snopes.com/fact-check/florida-doctor-wrong-testicle/,1.0,0.0329064722,1.0,0.28007343,0.13559063,0.55539423,0.028941752
6,https://www.snopes.com/fact-check/carl-nassib-republican-voter/,1.0,0.0510905756,1.0,0.34648767,0.24225506,0.39805946,0.013197826
7,https://www.snopes.com/fact-check/sesame-street-two-dads/,1.0,0.019061047799999998,1.0,0.45541468,0.049382385,0.44928008,0.045922853
8,https://www.snopes.com/fact-check/united-states-redesign-flag/,1.0,0.02873151700000001,1.0,0.39580333,0.1268754,0.46053907,0.01678217
9,https://www.snopes.com/fact-check/lion-foot-massage/,1.0,0.0430688886,1.0,0.36644593,0.17831735,0.41820964,0.037027106
10,https://www.snopes.com/fact-check/grass-red-creeping-thyme/,1.0,0.0270146121,1.0,0.20475,0.076435894,0.66017693,0.058637157
11,https://www.snopes.com/fact-check/is-a-turtle-shell-really-modified-ribs/,1.0,0.0328139198,1.0,0.32173675,0.12413671,0.51419365,0.039932888
12,https://www.snopes.com/fact-check/slave-owners-paid-reparations/,1.0,0.0127262636,1.0,0.16652505,0.042976998,0.76984364,0.020654328
13,https://www.snopes.com/fact-check/mike-pence-called-traitor/,1.0,0.018567424200000005,1.0,0.17334807,0.043072429,0.73381484,0.049764723
14,https://www.snopes.com/fact-check/clyde-fanone-handshake/,1.0,0.061231627999999996,1.0,0.32392699,0.28559715,0.36991486,0.02056098
15,https://www.snopes.com/fact-check/biden-trump-putin/,1.0,0.07075804470000001,1.0,0.41985705,0.33320937,0.22635269,0.020580817
16,https://www.snopes.com/fact-check/montana-wildfire-photo/,1.0,0.025461275400000007,1.0,0.43828553,0.071301006,0.43440807,0.056005348
17,https://www.snopes.com/fact-check/yes-scream-5-is-happening/,1.0,0.19998744248249,1.0,5.3514887e-05,1.2931449e-05,9.2917371e-06,0.9999243
18,https://www.snopes.com/fact-check/ostriches-pulled-off-own-heads/,1.0,0.026448075000000005,1.0,0.39661795,0.089171216,0.4711417,0.043069184
19,https://www.snopes.com/fact-check/british-soldiers-in-drag-nazis/,1.0,0.009552413700000007,1.0,0.07491897,0.021329563,0.87731898,0.026432524
20,https://www.snopes.com/fact-check/disney-world-guns-customers/,1.0,0.020874085560000002,1.0,0.22159949,0.095705509,0.67403013,0.0086649666
21,https://www.snopes.com/fact-check/is-this-pink-fairy-armadillo-real/,1.0,0.006691778399999993,1.0,0.7692343,0.015441497,0.1973068,0.018017387
22,https://www.snopes.com/fact-check/muhammad-ali-suicidal-man/,1.0,0.016662896800000004,1.0,0.10787963,0.065939113,0.80880588,0.017375365
23,https://www.snopes.com/fact-check/slaves-build-us-capitol/,0.0,0.19999854397982,1.0,3.3763122e-06,2.4600563e-06,3.8639459e-06,0.99999022
24,https://www.snopes.com/fact-check/4000-vaccinated-massachusetts/,0.0,0.0670874343,1.0,0.25545964,0.30590621,0.40910316,0.029530933
25,https://www.snopes.com/fact-check/matt-gaetz-tweet-defund-fbi/,0.0,0.0455852959,1.0,0.31236377,0.19133848,0.45970976,0.036588009
26,https://www.snopes.com/fact-check/florida-university-surveys/,0.0,0.021563625099999997,1.0,0.12364473,0.07467629,0.76853716,0.033141851
27,https://www.snopes.com/fact-check/pre-stained-wet-pants-denim/,0.0,0.0242169407,1.0,0.57581824,0.10287157,0.30309704,0.018213117
28,https://www.snopes.com/fact-check/florida-doctor-wrong-testicle/,0.0,0.0329064722,1.0,0.28007343,0.13559063,0.55539423,0.028941752
29,https://www.snopes.com/fact-check/carl-nassib-republican-voter/,0.0,0.0510905756,1.0,0.34648767,0.24225506,0.39805946,0.013197826
30,https://www.snopes.com/fact-check/sesame-street-two-dads/,0.0,0.019061047799999998,1.0,0.45541468,0.049382385,0.44928008,0.045922853
31,https://www.snopes.com/fact-check/united-states-redesign-flag/,0.0,0.02873151700000001,1.0,0.39580333,0.1268754,0.46053907,0.01678217
32,https://www.snopes.com/fact-check/lion-foot-massage/,0.0,0.0430688886,1.0,0.36644593,0.17831735,0.41820964,0.037027106
33,https://www.snopes.com/fact-check/grass-red-creeping-thyme/,0.0,0.0270146121,1.0,0.20475,0.076435894,0.66017693,0.058637157
34,https://www.snopes.com/fact-check/is-a-turtle-shell-really-modified-ribs/,0.0,0.0328139198,1.0,0.32173675,0.12413671,0.51419365,0.039932888
35,https://www.snopes.com/fact-check/slave-owners-paid-reparations/,0.0,0.0127262636,1.0,0.16652505,0.042976998,0.76984364,0.020654328
36,https://www.snopes.com/fact-check/mike-pence-called-traitor/,0.0,0.018567424200000005,1.0,0.17334807,0.043072429,0.73381484,0.049764723
37,https://www.snopes.com/fact-check/clyde-fanone-handshake/,0.0,0.061231627999999996,1.0,0.32392699,0.28559715,0.36991486,0.02056098
38,https://www.snopes.com/fact-check/biden-trump-putin/,0.0,0.07075804470000001,1.0,0.41985705,0.33320937,0.22635269,0.020580817
39,https://www.snopes.com/fact-check/montana-wildfire-photo/,0.0,0.025461275400000007,1.0,0.43828553,0.071301006,0.43440807,0.056005348
40,https://www.snopes.com/fact-check/yes-scream-5-is-happening/,0.0,0.19998744248249,1.0,5.3514887e-05,1.2931449e-05,9.2917371e-06,0.9999243
41,https://www.snopes.com/fact-check/ostriches-pulled-off-own-heads/,0.0,0.026448075000000005,1.0,0.39661795,0.089171216,0.4711417,0.043069184
42,https://www.snopes.com/fact-check/british-soldiers-in-drag-nazis/,0.0,0.009552413700000007,1.0,0.07491897,0.021329563,0.87731898,0.026432524
43,https://www.snopes.com/fact-check/disney-world-guns-customers/,0.0,0.020874085560000002,1.0,0.22159949,0.095705509,0.67403013,0.0086649666
44,https://www.snopes.com/fact-check/is-this-pink-fairy-armadillo-real/,0.0,0.006691778399999993,1.0,0.7692343,0.015441497,0.1973068,0.018017387
45,https://www.snopes.com/fact-check/muhammad-ali-suicidal-man/,0.0,0.016662896800000004,1.0,0.10787963,0.065939113,0.80880588,0.017375365
