{
  "name": "testing-news-score",
  "human_readable": "News Score",
  "type": "SNet AI service",
  "version": "0.0.1",
  "snet_service_id": "fakenews-service",
  "src_repo": "https://gitlab.com/nunet/fake-news-detection/fake_news_score",
  "description": "News score is an AI service that orchestrates all other services constituting to fake news warning application. It implements an ensemble function which combines weighted results of other services and outputs the general probability estimation (in %) that an article contains fake news. News score is extendable and can include other services (provided by community or third party developers) into an ensemble if they contribute to higher quality of the application.",
  "update_timestamp": 1617272413,
  "image": "registry.gitlab.com/nunet/fake-news-detection/fake_news_score/fake_news_score_module:test",
  "declarations": {
    "protobuf_definition": "",
    "input": "",
    "function":"",
    "service_stub":"",
    "service_input_params":"",

    "output": "",
    "functional": "?",
    "reputation": [
      {
        "source": "aigents",
        "score": 5
      }
    ]
  },
  "resource_requirements": {
    "cpu_max": 500, 
    "ram_max": 128, 
    "cpu_usage": 1.4,    
    "ram_usage": 200,    
    "time": 100000,  
    "net_usage": 1200,         
    "net_max": 2400   
  },
  "ntx_price":"27",
  "payment_parameters": {
    "type": "per single call",
    "amount": 25,
    "unit": "agi",
    "deployment": "included in price",
    "public_key": "0xB617FeB5178e92f2804068F772d924fC725705F2"
  },
  "constraints": {
    "deployment": "only on machines powered by green energy"
  },

  "services": []

}
