{
    "BLOCKCHAIN_NETWORK_SELECTED": "ropsten",
    "DAEMON_END_POINT": "0.0.0.0:7030",
    "ETHEREUM_JSON_RPC_ENDPOINT": "https://ropsten.infura.io/v3/e7732e1f679e461b9bb4da5653ac3fc2",
    "IPFS_END_POINT": "http://ipfs.singularitynet.io:80",
   
    "PASSTHROUGH_ENABLED": true,
    "PASSTHROUGH_ENDPOINT": "http://195.201.197.25:7031",
    "ORGANIZATION_ID": "nunet-org",
    "SERVICE_ID": "fake-news-score-service",

    "metering_end_point": "https://ropsten-marketplace.singularitynet.io",
    "pvt_key_for_metering":    "44afe70436396df77f8ec2bcebc060d85683d10d5940d253a277e24daddca6e3",

    "payment_channel_ca_path": "/opt/singnet/.certs/ca.pem",
    "payment_channel_cert_path": "/opt/singnet/.certs/client.pem",
    "payment_channel_key_path": "/opt/singnet/.certs/client-key.pem",
    

    "PAYMENT_CHANNEL_STORAGE_SERVER": {
        "id": "storage-ropsten",
        "host": "127.0.0.1",
        "client_port": 2386,
        "peer_port": 2387,
        "token": "unique-token",
        "cluster": "storage-ropsten=http://127.0.0.1:2387",
        "data_dir": "/opt/singnet/etcd/ropsten",
        "enabled": true
    },

    "log": {
        "level": "debug",
        "output": {
            "current_link": "./snetd-ropsten.log",
            "file_pattern": "./snetd-ropsten.%Y%m%d.log",
            "rotation_count": 0,
            "rotation_time_in_sec": 8640,
            "type": "file"
        }
    }
}
