two.user.domain tom |tom pass|
two.user.domain jerry |jerry pass|
single.user.domain forever@alone.com |alone pass|
multi.line.domain multi@line.user |one
word
on
each
line|
|!@#$%^&*()_-+=||\][{}/?;:'"<>,.| | *&yghgO*&| 87yUYH*O7yo8
huge.secret.domain paranoid@user.com |b83BY7wBZZTfSxGFVfG2gKMeG4k9S5 lXRmIytITBGh7iwfbr9Lj2CWjCq9hLkT Ex0uiRRO5r4ZQRa4FQ2HGmm6BWTRPNip HSNXxiKstjdsH1OM3NMOQ1hbUIx5Bjoa fEs6hFaLxXQGlGfk3rDx9aECxyT5f7iP 6TMDN7o1hWoedTtOAReERF5OaOOgef SwuJoeySQHQCg2fLYYxKiOlwKERSvFJ 4mrbMPwt0aZR4Ci9QOPpXJ6YdUkOrayS 5Al5p5TcSefEOHMmW0xY469ALlwG3Ny5 Z3FZDWR252rEtgxawGRE5T6bBMPFsbIy W7iyHZYLaFlegTD62JEjBGZJ6sVxvFb2 qGooOGsrTPOeNUMm005By4i6R4d7j4jV 6cJQkPPrdTgXC75EWfeNfWfrBKgqJVT NOe3MB2VS8dgsWoeA0L7gORUDjSPykpc Oi3ZNP2ectgMxSR5WgLqJq0LPgAFf6I5 qfoOVwWYOQdf8Lf4N3gwAfWNgtNjrp 9ZgH3QCZJ7o23YE56K0tsWeRCOl3t9sK 3Q1jXMYljkWF1m24LUFHNGHC1h6fRXoY yX3SOQGAA7OioLpIcOzKu2GtyMZGZ15 qOk1eu31VwgOSvGExw4ECaUkh6AjHPEI 7Sv13WRFNCQ2gxlgjPgrYz2Vxqz88a9 ZSmBhGzHmGfNxvIRCXWUEJlv26KBlP3v wxgNVpWzyNR1Zjqf6Pg1Vpszpv8Iwr1f 7AotUu5mH2Bxk9ujs6OEVRpjIaY3Ciy GNErm66wiWQphw6RsS1tmZpjCaM6qscF Oh2obLF7hUBT9UHWGwcvOOZgKtalUa8 bGBPaMrr2Bt7Ge3KU3Z6pBvWFamQrjuu fh6aj08VQLIbOuITTmsiFCqldzFrUQh Yguf29REJliTlaCjthFUDJFBJ2vfLbki G7b48mWTTkxSVzg0lCIMXCal0cy1v2R rp1JmEZ56W2XNvySsVsKkOIT36SjD040 RRl0YmRK9QPjiA9QGix3EsgpmaqN9uL il8prwW5xHiPO4t5fIbLebDchJrLAE2S fGpgHG6eo2DYCUXWjrPrkYY4WBl2bN 28a58E6LGaai3a6f7Q6Xhatxc759MNfa jqxr9pE2XNNiJ7zLaMQNTLiC7zr4Toc2 01JxWWxLgo3k3ltdWhYstUxi230R6J at5LyZEY8OgFVbGE68mWL6f56BK283AS 9xboBHQMla7XoUi06vI0EQeWcaFJDrw cysVfHqK05zqvLTIrequTh2BfbM7iIxd HU62dyw5FgJXt83B9YbkOTQBTuFUu OZviiIK2lm2JwzgqVdGQaDck2MPhvzBb E29Odt3SbU2N2ELikCHScozrPASPX8 HLid78GfEC7EkMl8DWFOyugAOjzKCjfb 2c4038I1c5kpepoWhvWhJ0fMeAkTrq8 DlUaMblEzqp5rwzQDKONZFpBZ9uxCQt7 9qiECkFrKPjz1Fi1QcybGVlyeBKLL4eb gvfLfT14Ouf9d9pxULSk6s5SDjHtHSt TjG8bw8s7vLa2SuTUBKwv9aWrLbAspWa e2RFjktxVEj7DGOSTM43YScNPj0tKabf s5GYzA8SqF6JN0oZBVYBPSJUOzlzLEtb dR8DMNfFvQtLg8aso73SxFBcpX4tNw a7o4USNQRkfplIJr5dqMW4MIDby50WtP MQHpMvQEPv4qeLem57awAUIWhNxZ0UJv 55WMkVEHdNKPPLOJpRqLxPvUeqdXIhgD xZcp1dNxJhTdCBWVfG7L56ZyMrNiGcSF 6Abh91QIbBaRei5dBOf5A02NjjjEcslE FazOVmMJMsKrGjhCyZfpJZT9Kf4Bsjpt cFdfHR12oJ3iubp8FafSzGNFs5jHSfTS vm64SF769uCBo6CMmr5t73EZ0a8m4kWT 45MFg3mps5A9Xvs9ui1OtawuxUBB5RiR HYW4jlvs3VBXVHCI2YgKRThQT35kcO9 vk3tSrbkTUjaOPQcP8qySiAsH6LDssb jWqzZAhkGfMTqslPvFdhiDWIxV6JNAg tlLiv8CHiRZgElBVCcZHjm9vi9DaxHL s1l0WBPoqu9AV0ASD66fh0X7OiQuZtKs oN9iW04XkVxmE0dlw1DoJ7506XcbchU hq9OsmRFB69WAxHq6Y96Dmo63Qb6hA3 UkzA6L1oWqblPA1iIbKCoQtrplgCO2K 76r8FyHORT3JtO0jLTMWEYKSQhkX3Cxs pk0dc4MVIkSXH77WfhJoJpB4eR8CJHQ9 v4jeuqPoJeqwsHl6w75scNjPb7B4ZEB5 XOV60SmCoBPaeaKTdsPyUD3jxbP6lhYt 9xvbcrsziE0ogVfGTBsg8FJY2dlph8B wy41Tq7mt4Jp6tRRfeR1JHgy3DZAA0Ah t0dZLGH0wU7HiwmsAqPHJXWMooHGCpJv fyRjyOGaf23MsAsWALx07ZBlvboVQNRC X9scrHu5epS8AHF7ooYSBcQ58uIVgEWD IldZBJbZgjsx7uyMLpc6H33KQUgUhFdy kJlWyKbegOq3hPghyKkgTsdcjFAIdoFR WPmHhZFGUxSlgfhL3Vcu5qVKIBqZbLKK 4S6NLIrZetTm88GfFjDaaB9Yo2sad9mS iSdUogvgNc7XrPC9Pt6FpELv5vIixBW y1TZxbtQc4dj2i0QqW1tsiruR3Go6iW KkpAedBZ3KQUvzdgQkx9HXoJbdIM3MLu dhMjjs3SD76m3SlGpHdaacwLHs99Seek jPOWeMdrFUYM6NlopNkAazRTb9FgRdC twq38cb8Tlp2BsfHWQO9PYIvEyhTaAZ FHqplTgpVkcicwoZOJyQBeBLVWHoVrfG|
