<?xml version="1.0" encoding="UTF-8" standalone="no"?>
<!-- Created with Inkscape (http://www.inkscape.org/) -->

<svg
   xmlns:dc="http://purl.org/dc/elements/1.1/"
   xmlns:cc="http://creativecommons.org/ns#"
   xmlns:rdf="http://www.w3.org/1999/02/22-rdf-syntax-ns#"
   xmlns:svg="http://www.w3.org/2000/svg"
   xmlns="http://www.w3.org/2000/svg"
   xmlns:sodipodi="http://sodipodi.sourceforge.net/DTD/sodipodi-0.dtd"
   xmlns:inkscape="http://www.inkscape.org/namespaces/inkscape"
   width="30"
   height="30"
   viewBox="0 0 30 30"
   version="1.1"
   id="svg822"
   inkscape:version="0.92.4 (f8dce91, 2019-08-02)"
   sodipodi:docname="grid-circular.svg">
  <defs
     id="defs816" />
  <sodipodi:namedview
     id="base"
     pagecolor="#ffffff"
     bordercolor="#666666"
     borderopacity="1.0"
     inkscape:pageopacity="0.0"
     inkscape:pageshadow="2"
     inkscape:zoom="19.610429"
     inkscape:cx="22.75527"
     inkscape:cy="15.406273"
     inkscape:document-units="px"
     inkscape:current-layer="layer1"
     showgrid="true"
     units="px"
     inkscape:window-width="1366"
     inkscape:window-height="713"
     inkscape:window-x="0"
     inkscape:window-y="0"
     inkscape:window-maximized="1"
     showguides="false"
     inkscape:guide-bbox="true">
    <sodipodi:guide
       position="21.126168,22.794393"
       orientation="1,0"
       id="guide1575"
       inkscape:locked="false" />
    <sodipodi:guide
       position="22.682243,23.285047"
       orientation="1,0"
       id="guide1635"
       inkscape:locked="false" />
    <sodipodi:guide
       position="22.682243,7.6455921"
       orientation="0,1"
       id="guide1639"
       inkscape:locked="false" />
    <sodipodi:guide
       position="18.859863,18.859863"
       orientation="1,0"
       id="guide1242"
       inkscape:locked="false" />
    <inkscape:grid
       type="xygrid"
       id="grid1103" />
  </sodipodi:namedview>
  <metadata
     id="metadata819">
    <rdf:RDF>
      <cc:Work
         rdf:about="">
        <dc:format>image/svg+xml</dc:format>
        <dc:type
           rdf:resource="http://purl.org/dc/dcmitype/StillImage" />
        <dc:title />
      </cc:Work>
    </rdf:RDF>
  </metadata>
  <g
     inkscape:label="Layer 1"
     inkscape:groupmode="layer"
     id="layer1"
     transform="translate(0,-289.0625)">
    <path
       style="fill:#000000;fill-opacity:1;stroke:none;stroke-width:0.5;stroke-miterlimit:4;stroke-dasharray:none;stroke-opacity:1"
       d="M 15 3 A 12 12 0 0 0 11 3.7011719 L 11 9 L 19 9 L 19 3.7011719 A 12 12 0 0 0 15 3 z M 21 4.6191406 L 21 9 L 25.375 9 A 12 12 0 0 0 21 4.6191406 z M 9 4.625 A 12 12 0 0 0 4.6191406 9 L 9 9 L 9 4.625 z M 3.7011719 11 A 12 12 0 0 0 3 15 A 12 12 0 0 0 3.7011719 19 L 9 19 L 9 11 L 3.7011719 11 z M 11 11 L 11 19 L 19 19 L 19 11 L 11 11 z M 21 11 L 21 19 L 26.298828 19 A 12 12 0 0 0 27 15 A 12 12 0 0 0 26.298828 11 L 21 11 z M 4.625 21 A 12 12 0 0 0 9 25.380859 L 9 21 L 4.625 21 z M 11 21 L 11 26.298828 A 12 12 0 0 0 15 27 A 12 12 0 0 0 19 26.298828 L 19 21 L 11 21 z M 21 21 L 21 25.375 A 12 12 0 0 0 25.380859 21 L 21 21 z "
       transform="translate(0,289.0625)"
       id="path857" />
  </g>
</svg>
