<?xml version="1.0" encoding="UTF-8" standalone="no"?>
<!-- Created with Inkscape (http://www.inkscape.org/) -->

<svg
   xmlns:dc="http://purl.org/dc/elements/1.1/"
   xmlns:cc="http://creativecommons.org/ns#"
   xmlns:rdf="http://www.w3.org/1999/02/22-rdf-syntax-ns#"
   xmlns:svg="http://www.w3.org/2000/svg"
   xmlns="http://www.w3.org/2000/svg"
   xmlns:xlink="http://www.w3.org/1999/xlink"
   xmlns:sodipodi="http://sodipodi.sourceforge.net/DTD/sodipodi-0.dtd"
   xmlns:inkscape="http://www.inkscape.org/namespaces/inkscape"
   width="30"
   height="30"
   viewBox="0 0 30 30"
   version="1.1"
   id="svg822"
   inkscape:version="0.92.4 (f8dce91, 2019-08-02)"
   sodipodi:docname="nuinalp.svg">
  <defs
     id="defs816">
    <linearGradient
       inkscape:collect="always"
       id="linearGradient1474">
      <stop
         style="stop-color:#00427c;stop-opacity:1"
         offset="0"
         id="stop1470" />
      <stop
         style="stop-color:#0072cd;stop-opacity:1"
         offset="1"
         id="stop1472" />
    </linearGradient>
    <linearGradient
       gradientTransform="matrix(42.666664,0,0,42.666664,-33.864981,-1119.9762)"
       inkscape:collect="always"
       xlink:href="#linearGradient1474"
       id="linearGradient1496"
       x1="133.41331"
       y1="296.54651"
       x2="136.76405"
       y2="29.69532"
       gradientUnits="userSpaceOnUse" />
    <linearGradient
       inkscape:collect="always"
       xlink:href="#linearGradient1474"
       id="linearGradient1672-7"
       gradientUnits="userSpaceOnUse"
       gradientTransform="matrix(4.6931737,0,0,4.6931737,-2.8345259,164.06255)"
       x1="133.41331"
       y1="296.54651"
       x2="136.76405"
       y2="29.69532" />
  </defs>
  <sodipodi:namedview
     id="base"
     pagecolor="#ffffff"
     bordercolor="#666666"
     borderopacity="1.0"
     inkscape:pageopacity="0.0"
     inkscape:pageshadow="2"
     inkscape:zoom="17.833333"
     inkscape:cx="7.4859812"
     inkscape:cy="15"
     inkscape:document-units="px"
     inkscape:current-layer="layer1"
     showgrid="true"
     units="px"
     inkscape:window-width="1366"
     inkscape:window-height="713"
     inkscape:window-x="0"
     inkscape:window-y="0"
     inkscape:window-maximized="1">
    <inkscape:grid
       type="xygrid"
       id="grid816" />
  </sodipodi:namedview>
  <metadata
     id="metadata819">
    <rdf:RDF>
      <cc:Work
         rdf:about="">
        <dc:format>image/svg+xml</dc:format>
        <dc:type
           rdf:resource="http://purl.org/dc/dcmitype/StillImage" />
        <dc:title />
      </cc:Work>
    </rdf:RDF>
  </metadata>
  <g
     inkscape:label="Layer 1"
     inkscape:groupmode="layer"
     id="layer1"
     transform="translate(0,-289.0625)">
    <path
       style="color:#000000;font-style:normal;font-variant:normal;font-weight:normal;font-stretch:normal;font-size:medium;line-height:normal;font-family:sans-serif;font-variant-ligatures:normal;font-variant-position:normal;font-variant-caps:normal;font-variant-numeric:normal;font-variant-alternates:normal;font-feature-settings:normal;text-indent:0;text-align:start;text-decoration:none;text-decoration-line:none;text-decoration-style:solid;text-decoration-color:#000000;letter-spacing:normal;word-spacing:normal;text-transform:none;writing-mode:lr-tb;direction:ltr;text-orientation:mixed;dominant-baseline:auto;baseline-shift:baseline;text-anchor:start;white-space:normal;shape-padding:0;clip-rule:nonzero;display:inline;overflow:visible;visibility:visible;opacity:1;isolation:auto;mix-blend-mode:normal;color-interpolation:sRGB;color-interpolation-filters:linearRGB;solid-color:#000000;solid-opacity:1;vector-effect:none;fill:#000000;fill-opacity:1;fill-rule:nonzero;stroke:none;stroke-width:0.99999994;stroke-linecap:butt;stroke-linejoin:miter;stroke-miterlimit:4;stroke-dasharray:none;stroke-dashoffset:0;stroke-opacity:1;color-rendering:auto;image-rendering:auto;shape-rendering:auto;text-rendering:auto;enable-background:accumulate"
       d="M 15,3 C 8.3785059,3 3,8.37851 3,15 3,21.62149 8.3785059,27 15,27 21.621494,27 27,21.62149 27,15 27,8.37851 21.621494,3 15,3 Z m 0,1 C 21.081054,4 26,8.91895 26,15 26,21.08105 21.081054,26 15,26 8.9189459,26 4,21.08105 4,15 4,8.91895 8.9189459,4 15,4 Z m 0,2.0273438 C 10.744941,6.0273438 7.1754692,9.0159309 6.2617188,13 H 8.3203125 C 9.1765687,10.118743 11.833731,8.0273438 15,8.0273438 c 3.166269,0 5.823431,2.0913992 6.679688,4.9726562 h 2.058593 C 22.824531,9.0159309 19.255059,6.0273438 15,6.0273438 Z m -5,5.7832032 5,8.179687 5,-8.179687 z m 5.033203,0.478515 0.441406,2.230469 2.269532,0.546875 -2.230469,0.441406 -0.546875,2.271485 -0.441406,-2.232422 -2.269532,-0.544922 2.230469,-0.441406 z M 6.2617188,17 C 7.1754694,20.984069 10.744941,23.972656 15,23.972656 c 4.255059,0 7.824531,-2.988587 8.738281,-6.972656 H 21.679688 C 20.823431,19.881257 18.166269,21.972656 15,21.972656 11.833731,21.972656 9.1765688,19.881257 8.3203125,17 Z"
       transform="translate(0,289.0625)"
       id="path1676"
       inkscape:connector-curvature="0" />
  </g>
</svg>
