<svg width="75" height="81" viewBox="0 0 75 81" fill="none" xmlns="http://www.w3.org/2000/svg">
<path d="M32.8343 1.68932C35.2167 -0.563106 38.9433 -0.563106 41.3257 1.68932L71.2585 29.9896C73.1106 31.7407 74.16 34.177 74.16 36.7257V71.1436C74.16 76.2631 70.0095 80.4136 64.89 80.4136H52.53C47.4103 80.4136 43.26 76.2631 43.26 71.1436V55.6936C43.26 53.9872 41.8765 52.6037 40.17 52.6037H33.99C32.2835 52.6037 30.9 53.9872 30.9 55.6936V71.1436C30.9 76.2631 26.7497 80.4136 21.63 80.4136H9.27C4.1503 80.4136 0 76.2631 0 71.1436V36.7257C0 34.177 1.04936 31.7407 2.90139 29.9896L32.8343 1.68932ZM37.08 6.18002L7.14711 34.4803C6.52979 35.064 6.18 35.8761 6.18 36.7257V71.1436C6.18 72.8499 7.56346 74.2336 9.27 74.2336H21.63C23.3365 74.2336 24.72 72.8499 24.72 71.1436V55.6936C24.72 50.5741 28.8703 46.4237 33.99 46.4237H40.17C45.2897 46.4237 49.44 50.5741 49.44 55.6936V71.1436C49.44 72.8499 50.8237 74.2336 52.53 74.2336H64.89C66.5963 74.2336 67.98 72.8499 67.98 71.1436V36.7257C67.98 35.8761 67.6302 35.064 67.0128 34.4803L37.08 6.18002Z" fill="#212121"/>
</svg>
