Suite/Test/Step Name,Browser,Description,Tag,Start time,End time,Duration,Status
6.Informes-Reporte_Estad\u00EDsticas por planes_Pdf,Firefox 71.0,,,2020-01-02 17:18:40,2020-01-02 17:19:55,"1m - 15,253s",PASSED
,,,,,,,
Test Cases/2.Planes de Accion/Generales/5.Informes/6.Informes-Reporte_Estad\u00EDsticas por planes_Pdf,Firefox 71.0,,,2020-01-02 17:18:40,2020-01-02 17:19:55,"1m - 14,829s",PASSED
"callTestCase(findTestCase(""2.Planes de Accion/Daruma/Acceso al modulo""), [:])",Firefox 71.0,,,2020-01-02 17:18:41,2020-01-02 17:19:30,"48,612s",PASSED
delay(6),Firefox 71.0,,,2020-01-02 17:19:30,2020-01-02 17:19:36,"6,010s",PASSED
"click(findTestObject(""2.Planes de Accion/Daruma/Acceso al modulo/5.Open_Reports""))",Firefox 71.0,,,2020-01-02 17:19:36,2020-01-02 17:19:36,"0,638s",PASSED
"click(findTestObject(""2.Planes de Accion/Generales/4.Informes/5.Informes-Reporte_Estadísticas por planes/1.estadisticas por planes""))",Firefox 71.0,,,2020-01-02 17:19:36,2020-01-02 17:19:42,"5,401s",PASSED
"switchToWindowUrl(""http://52.11.126.234/app.php/staff/actionplan/indexReportState"")",Firefox 71.0,,,2020-01-02 17:19:42,2020-01-02 17:19:44,"1,888s",PASSED
delay(6),Firefox 71.0,,,2020-01-02 17:19:44,2020-01-02 17:19:50,"6,004s",PASSED
"click(findTestObject(""2.Planes de Accion/Generales/4.Informes/6.Informes_Reporte_Estadisticas por planes_Pdf/1.PDF""))",Firefox 71.0,,,2020-01-02 17:19:50,2020-01-02 17:19:55,"5,650s",PASSED
