Suite/Test/Step Name,Browser,Description,Tag,Start time,End time,Duration,Status
13.Concluir Plan de Accion,Firefox 71.0,,,2020-01-09 16:31:35,2020-01-09 16:45:47,"14m - 11,973s",PASSED
,,,,,,,
Test Cases/2.Planes de Accion/Generales/1.Index/1.Crear Plan de Accion,Firefox 71.0,,,2020-01-09 16:31:35,2020-01-09 16:36:09,"4m - 33,334s",PASSED
"callTestCase(findTestCase(""2.Planes de Accion/Daruma/Acceso al modulo""), [:])",Firefox 71.0,,,2020-01-09 16:31:36,2020-01-09 16:32:21,"45,053s",PASSED
"click(findTestObject(""2.Planes de Accion/Generales/1.Index/1.1.Crear/1.btn_Create""))",Firefox 71.0,,,2020-01-09 16:32:21,2020-01-09 16:32:22,"0,695s",PASSED
delay(5),Firefox 71.0,,,2020-01-09 16:32:22,2020-01-09 16:32:27,"5,011s",PASSED
"test.Metodos.display_list_only(findTestObject(""Generales/Select2/1.display_list_only""), 0)",Firefox 71.0,,,2020-01-09 16:32:27,2020-01-09 16:32:39,"12,025s",PASSED
"test.Metodos.element_selected(findTestObject(""Object Repository/Generales/Select2/2.select_option""), 1)",Firefox 71.0,,,2020-01-09 16:32:39,2020-01-09 16:32:46,"7,055s",PASSED
"test.Metodos.display_list_only(findTestObject(""Generales/Select2/1.display_list_only""), 1)",Firefox 71.0,,,2020-01-09 16:32:46,2020-01-09 16:32:57,"11,043s",PASSED
"test.Metodos.element_selected(findTestObject(""Object Repository/Generales/Select2/2.select_option""), 1)",Firefox 71.0,,,2020-01-09 16:32:57,2020-01-09 16:33:04,"7,080s",PASSED
"test.Metodos.display_list_multi(findTestObject(""Object Repository/Generales/Select2/1.1.display_list_multi""), 0)",Firefox 71.0,,,2020-01-09 16:33:04,2020-01-09 16:33:15,"10,636s",PASSED
"test.Metodos.select2(findTestObject(""Object Repository/Generales/Select2/2.select_option""), 0)",Firefox 71.0,,,2020-01-09 16:33:15,2020-01-09 16:33:26,"11,097s",PASSED
"click(findTestObject(""2.Planes de Accion/Generales/1.Index/1.1.Crear/3.Origenes""))",Firefox 71.0,,,2020-01-09 16:33:26,2020-01-09 16:33:27,"0,901s",PASSED
"test.Metodos.display_list_multi(findTestObject(""Object Repository/Generales/Select2/1.1.display_list_multi""), 1)",Firefox 71.0,,,2020-01-09 16:33:27,2020-01-09 16:33:38,"10,898s",PASSED
"test.Metodos.select2(findTestObject(""Object Repository/Generales/Select2/2.1.select_option_multi""), 1)",Firefox 71.0,,,2020-01-09 16:33:38,2020-01-09 16:33:49,"11,466s",PASSED
"elementSelect = test.Metodos.select2_config(findTestObject(""2.Planes de Accion/Generales/1.Index/1.1.Crear/4.Element_select""))",Firefox 71.0,,,2020-01-09 16:33:49,2020-01-09 16:33:51,"1,483s",PASSED
"selectOptionByValue(findTestObject(""2.Planes de Accion/Generales/1.Index/1.1.Crear/5.select_type""), elementSelect.toString(), true)",Firefox 71.0,,,2020-01-09 16:33:51,2020-01-09 16:33:52,"1,689s",PASSED
"getNumberOfTotalOption(findTestObject(""2.Planes de Accion/Generales/1.Index/1.1.Crear/4.Element_select""))",Firefox 71.0,,,2020-01-09 16:33:52,2020-01-09 16:33:53,"0,581s",PASSED
"test.Metodos.tiny1(findTestObject(""2.Planes de Accion/Generales/1.Index/1.1.Crear/6.TinyMCE""), 0)",Firefox 71.0,,,2020-01-09 16:33:53,2020-01-09 16:33:54,"1,154s",PASSED
delay(5),Firefox 71.0,,,2020-01-09 16:33:54,2020-01-09 16:33:59,"5,003s",PASSED
"test.Metodos.tiny1(findTestObject(""2.Planes de Accion/Generales/1.Index/1.1.Crear/6.TinyMCE""), 1)",Firefox 71.0,,,2020-01-09 16:33:59,2020-01-09 16:34:00,"1,027s",PASSED
delay(5),Firefox 71.0,,,2020-01-09 16:34:00,2020-01-09 16:34:05,"5,005s",PASSED
"selectOptionByValue(findTestObject(""2.Planes de Accion/Generales/1.Index/1.1.Crear/7.select_track_freq""), ""4"", true)",Firefox 71.0,,,2020-01-09 16:34:05,2020-01-09 16:34:06,"1,028s",PASSED
"setText(findTestObject(""2.Planes de Accion/Generales/1.Index/1.1.Crear/8.input_num_periods""), ""1"")",Firefox 71.0,,,2020-01-09 16:34:06,2020-01-09 16:34:07,"0,402s",PASSED
"selectOptionByValue(findTestObject(""2.Planes de Accion/Generales/1.Index/1.1.Crear/9.select_criticality_id""), ""21"", true)",Firefox 71.0,,,2020-01-09 16:34:07,2020-01-09 16:34:09,"2,493s",PASSED
"test.Metodos.display_list_multi(findTestObject(""Object Repository/Generales/Select2/1.1.display_list_multi""), 2)",Firefox 71.0,,,2020-01-09 16:34:09,2020-01-09 16:34:20,"10,613s",PASSED
"test.Metodos.select2(findTestObject(""Object Repository/Generales/Select2/2.select_option""), 0)",Firefox 71.0,,,2020-01-09 16:34:20,2020-01-09 16:34:31,"11,075s",PASSED
"test.Metodos.display_list_multi(findTestObject(""Object Repository/Generales/Select2/1.1.display_list_multi""), 5)",Firefox 71.0,,,2020-01-09 16:34:31,2020-01-09 16:34:41,"10,575s",PASSED
delay(5),Firefox 71.0,,,2020-01-09 16:34:41,2020-01-09 16:34:46,"5,005s",PASSED
"test.Metodos.select2(findTestObject(""Object Repository/Generales/Select2/2.select_option""), 0)",Firefox 71.0,,,2020-01-09 16:34:46,2020-01-09 16:34:57,"11,119s",PASSED
"test.Metodos.display_list_multi(findTestObject(""Object Repository/Generales/Select2/1.1.display_list_multi""), 6)",Firefox 71.0,,,2020-01-09 16:34:57,2020-01-09 16:35:08,"10,605s",PASSED
"test.Metodos.select2(findTestObject(""Object Repository/Generales/Select2/2.select_option""), 0)",Firefox 71.0,,,2020-01-09 16:35:08,2020-01-09 16:35:19,"11,077s",PASSED
"test.Metodos.display_list_multi(findTestObject(""Object Repository/Generales/Select2/1.1.display_list_multi""), 7)",Firefox 71.0,,,2020-01-09 16:35:19,2020-01-09 16:35:30,"10,612s",PASSED
"test.Metodos.select2(findTestObject(""Object Repository/Generales/Select2/2.select_option""), 0)",Firefox 71.0,,,2020-01-09 16:35:30,2020-01-09 16:35:41,"11,021s",PASSED
"test.Metodos.display_list_multi(findTestObject(""Object Repository/Generales/Select2/1.1.display_list_multi""), 8)",Firefox 71.0,,,2020-01-09 16:35:41,2020-01-09 16:35:51,"10,617s",PASSED
"test.Metodos.select2(findTestObject(""Object Repository/Generales/Select2/2.select_option""), 0)",Firefox 71.0,,,2020-01-09 16:35:51,2020-01-09 16:36:02,"11,041s",PASSED
delay(5),Firefox 71.0,,,2020-01-09 16:36:02,2020-01-09 16:36:07,"5,013s",PASSED
"click(findTestObject(""2.Planes de Accion/Generales/1.Index/1.1.Crear/10.btn_Save""))",Firefox 71.0,,,2020-01-09 16:36:07,2020-01-09 16:36:09,"1,391s",PASSED
,,,,,,,
Test Cases/2.Planes de Accion/Generales/1.Index/1.1.Gestion del Plan/2.Agregar Accion,Firefox 71.0,,,2020-01-09 16:36:09,2020-01-09 16:37:58,"1m - 49,187s",PASSED
"callTestCase(findTestCase(""2.Planes de Accion/Daruma/Acceso al modulo""), [:])",Firefox 71.0,,,2020-01-09 16:36:09,2020-01-09 16:36:52,"42,535s",PASSED
"id = test.Metodos.lista(findTestObject(""Object Repository/2.list_inputCheck""))",Firefox 71.0,,,2020-01-09 16:36:52,2020-01-09 16:36:56,"3,833s",PASSED
"test.Metodos.select_item_managment(findTestObject(""Generales/Select Item List/1.list_index""), id)",Firefox 71.0,,,2020-01-09 16:36:56,2020-01-09 16:36:57,"1,416s",PASSED
delay(5),Firefox 71.0,,,2020-01-09 16:36:57,2020-01-09 16:37:02,"5,002s",PASSED
"click(findTestObject(""2.Planes de Accion/Generales/1.Index/1.Gestion del Plan/1.Analisis/1.btn_option_more""))",Firefox 71.0,,,2020-01-09 16:37:02,2020-01-09 16:37:05,"2,848s",PASSED
"click(findTestObject(""2.Planes de Accion/Generales/1.Index/1.Gestion del Plan/1.Analisis/2.btn_analyze""))",Firefox 71.0,,,2020-01-09 16:37:05,2020-01-09 16:37:36,"31,111s",PASSED
"test.Metodos.tiny1(findTestObject(""Object Repository/Generales/TinyMCE/Iframe""), 0)",Firefox 71.0,,,2020-01-09 16:37:36,2020-01-09 16:37:37,"0,956s",PASSED
"click(findTestObject(""2.Planes de Accion/Generales/1.Index/1.Gestion del Plan/1.Analisis/3.btn_Save""))",Firefox 71.0,,,2020-01-09 16:37:37,2020-01-09 16:37:38,"1,205s",PASSED
delay(5),Firefox 71.0,,,2020-01-09 16:37:38,2020-01-09 16:37:43,"5,005s",PASSED
"selectOptionByValue(findTestObject(""2.Planes de Accion/Generales/1.Index/1.Gestion del Plan/1.Analisis/4.select_cause_effect""), ""2"", false)",Firefox 71.0,,,2020-01-09 16:37:43,2020-01-09 16:37:44,"1,065s",PASSED
"click(findTestObject(""2.Planes de Accion/Generales/1.Index/1.Gestion del Plan/1.Analisis/5.inputCheck_add_actions""))",Firefox 71.0,,,2020-01-09 16:37:44,2020-01-09 16:37:45,"0,564s",PASSED
"click(findTestObject(""2.Planes de Accion/Generales/1.Index/1.Gestion del Plan/1.Analisis/3.btn_Save""))",Firefox 71.0,,,2020-01-09 16:37:45,2020-01-09 16:37:45,"0,597s",PASSED
"test.Metodos.tiny1(findTestObject(""Object Repository/Generales/TinyMCE/Iframe""), 0)",Firefox 71.0,,,2020-01-09 16:37:45,2020-01-09 16:37:51,"5,980s",PASSED
"selectOptionByValue(findTestObject(""2.Planes de Accion/Generales/1.Index/1.Gestion del Plan/1.Analisis/6.select_action_type""), ""1"", true)",Firefox 71.0,,,2020-01-09 16:37:51,2020-01-09 16:37:53,"1,051s",PASSED
"selectOptionByValue(findTestObject(""2.Planes de Accion/Generales/1.Index/1.Gestion del Plan/1.Analisis/7.select_end_date_month""), ""12"", true)",Firefox 71.0,,,2020-01-09 16:37:53,2020-01-09 16:37:54,"1,433s",PASSED
"selectOptionByValue(findTestObject(""2.Planes de Accion/Generales/1.Index/1.Gestion del Plan/1.Analisis/8.select_end_date_day""), ""31"", true)",Firefox 71.0,,,2020-01-09 16:37:54,2020-01-09 16:37:56,"1,758s",PASSED
"setText(findTestObject(""Object Repository/2.Planes de Accion/Generales/1.Index/1.Gestion del Plan/1.Analisis/9.input_initial_budget""), ""5000000"")",Firefox 71.0,,,2020-01-09 16:37:56,2020-01-09 16:37:56,"0,394s",PASSED
"setText(findTestObject(""Object Repository/2.Planes de Accion/Generales/1.Index/1.Gestion del Plan/1.Analisis/10.input_investment_budget""), ""5100000"")",Firefox 71.0,,,2020-01-09 16:37:56,2020-01-09 16:37:56,"0,357s",PASSED
"setText(findTestObject(""Object Repository/2.Planes de Accion/Generales/1.Index/1.Gestion del Plan/1.Analisis/11.input_operating_budget""), ""4800000"")",Firefox 71.0,,,2020-01-09 16:37:56,2020-01-09 16:37:57,"0,360s",PASSED
"click(findTestObject(""2.Planes de Accion/Generales/1.Index/1.Gestion del Plan/1.Analisis/12.inputCheck_exclude_consolidate""))",Firefox 71.0,,,2020-01-09 16:37:57,2020-01-09 16:37:57,"0,591s",PASSED
"click(findTestObject(""2.Planes de Accion/Generales/1.Index/1.Gestion del Plan/1.Analisis/3.btn_Save""))",Firefox 71.0,,,2020-01-09 16:37:57,2020-01-09 16:37:58,"0,584s",PASSED
,,,,,,,
Test Cases/2.Planes de Accion/Generales/1.Index/1.1.Gestion del Plan/6.Solicitar aprobacion del plan,Firefox 71.0,,,2020-01-09 16:37:58,2020-01-09 16:38:56,"57,623s",PASSED
"callTestCase(findTestCase(""2.Planes de Accion/Daruma/Acceso al modulo""), [:])",Firefox 71.0,,,2020-01-09 16:37:58,2020-01-09 16:38:41,"42,949s",PASSED
"id = test.Metodos.lista(findTestObject(""Object Repository/2.list_inputCheck""))",Firefox 71.0,,,2020-01-09 16:38:41,2020-01-09 16:38:45,"3,821s",PASSED
"test.Metodos.select_item_managment(findTestObject(""Generales/Select Item List/1.list_index""), id)",Firefox 71.0,,,2020-01-09 16:38:45,2020-01-09 16:38:46,"1,348s",PASSED
delay(8),Firefox 71.0,,,2020-01-09 16:38:46,2020-01-09 16:38:54,"8,005s",PASSED
"click(findTestObject(""2.Planes de Accion/Generales/1.Index/1.Gestion del Plan/6.Solicitar Plan de Accion/1.btn_option_more""))",Firefox 71.0,,,2020-01-09 16:38:54,2020-01-09 16:38:55,"0,565s",PASSED
"click(findTestObject(""Object Repository/2.Planes de Accion/Generales/1.Index/1.Gestion del Plan/6.Solicitar Plan de Accion/2.btn_ask_for_approval""))",Firefox 71.0,,,2020-01-09 16:38:55,2020-01-09 16:38:56,"0,623s",PASSED
acceptAlert(),Firefox 71.0,,,2020-01-09 16:38:56,2020-01-09 16:38:56,"0,087s",PASSED
,,,,,,,
Test Cases/2.Planes de Accion/Generales/1.Index/1.1.Gestion del Plan/7.Ejecutar Acciones,Firefox 71.0,,,2020-01-09 16:38:56,2020-01-09 16:40:06,"1m - 9,958s",PASSED
"callTestCase(findTestCase(""2.Planes de Accion/Daruma/Acceso al modulo""), [:])",Firefox 71.0,,,2020-01-09 16:38:56,2020-01-09 16:39:40,"43,674s",PASSED
"id = test.Metodos.lista(findTestObject(""Object Repository/2.list_inputCheck""))",Firefox 71.0,,,2020-01-09 16:39:40,2020-01-09 16:39:44,"3,839s",PASSED
"test.Metodos.select_item_managment(findTestObject(""Generales/Select Item List/1.list_index""), id)",Firefox 71.0,,,2020-01-09 16:39:44,2020-01-09 16:39:45,"1,391s",PASSED
delay(8),Firefox 71.0,,,2020-01-09 16:39:45,2020-01-09 16:39:53,"8,003s",PASSED
"test.Metodos.select_items_actions(""#action-list-table > tbody > tr > td > a"")",Firefox 71.0,,,2020-01-09 16:39:53,2020-01-09 16:39:53,"0,491s",PASSED
delay(5),Firefox 71.0,,,2020-01-09 16:39:53,2020-01-09 16:39:58,"5,006s",PASSED
"test.Metodos.select2_multiselect(findTestObject(""Object Repository/2.Planes de Accion/Generales/1.Index/1.Gestion del Plan/7.Crear Tareas del Plan de Accion/1.add_list""), 0)",Firefox 71.0,,,2020-01-09 16:39:58,2020-01-09 16:39:59,"0,593s",PASSED
"enter = findWebElement(findTestObject(""Object Repository/2.Planes de Accion/Generales/1.Index/1.Gestion del Plan/7.Crear Tareas del Plan de Accion/2.input_task_list_name""), 5)",Firefox 71.0,,,2020-01-09 16:39:59,2020-01-09 16:39:59,"0,291s",PASSED
enter.sendKeys(ENTER),Firefox 71.0,,,2020-01-09 16:39:59,2020-01-09 16:39:59,"0,046s",PASSED
delay(5),Firefox 71.0,,,2020-01-09 16:39:59,2020-01-09 16:40:04,"5,004s",PASSED
"test.Metodos.select2_multiselect(findTestObject(""Object Repository/2.Planes de Accion/Generales/1.Index/1.Gestion del Plan/7.Crear Tareas del Plan de Accion/1.add_list""), 1)",Firefox 71.0,,,2020-01-09 16:40:04,2020-01-09 16:40:05,"0,552s",PASSED
"setText(findTestObject(""Object Repository/2.Planes de Accion/Generales/1.Index/1.Gestion del Plan/7.Crear Tareas del Plan de Accion/4.input_task_notes""), ""Una tarea..."")",Firefox 71.0,,,2020-01-09 16:40:05,2020-01-09 16:40:05,"0,351s",PASSED
"enter2 = findWebElement(findTestObject(""Object Repository/2.Planes de Accion/Generales/1.Index/1.Gestion del Plan/7.Crear Tareas del Plan de Accion/4.input_task_notes""), 5)",Firefox 71.0,,,2020-01-09 16:40:05,2020-01-09 16:40:06,"0,275s",PASSED
enter2.sendKeys(ENTER),Firefox 71.0,,,2020-01-09 16:40:06,2020-01-09 16:40:06,"0,047s",PASSED
,,,,,,,
Test Cases/2.Planes de Accion/Generales/1.Index/1.1.Gestion del Plan/8.Aprobar acciones,Firefox 71.0,,,2020-01-09 16:40:06,2020-01-09 16:41:10,"1m - 4,624s",PASSED
"callTestCase(findTestCase(""2.Planes de Accion/Daruma/Acceso al modulo""), [:])",Firefox 71.0,,,2020-01-09 16:40:06,2020-01-09 16:40:49,"43,051s",PASSED
"id = test.Metodos.lista(findTestObject(""Object Repository/2.list_inputCheck""))",Firefox 71.0,,,2020-01-09 16:40:49,2020-01-09 16:40:53,"3,846s",PASSED
"test.Metodos.select_item_managment(findTestObject(""Generales/Select Item List/1.list_index""), id)",Firefox 71.0,,,2020-01-09 16:40:53,2020-01-09 16:40:54,"1,371s",PASSED
delay(8),Firefox 71.0,,,2020-01-09 16:40:54,2020-01-09 16:41:02,"8,005s",PASSED
"test.Metodos.select_items_actions(""#action-list-table > tbody > tr > td > a"")",Firefox 71.0,,,2020-01-09 16:41:02,2020-01-09 16:41:03,"0,532s",PASSED
delay(5),Firefox 71.0,,,2020-01-09 16:41:03,2020-01-09 16:41:08,"5,006s",PASSED
"test.Metodos.selectItem_taskState(findTestObject(""Object Repository/2.Planes de Accion/Generales/1.Index/1.Gestion del Plan/8.Aprobar Acciones/2.inputCheck_task_state""))",Firefox 71.0,,,2020-01-09 16:41:08,2020-01-09 16:41:08,"0,593s",PASSED
"click(findTestObject(""Object Repository/2.Planes de Accion/Generales/1.Index/1.Gestion del Plan/8.Aprobar Acciones/3.btn_return_actionPlan""))",Firefox 71.0,,,2020-01-09 16:41:08,2020-01-09 16:41:10,"1,984s",PASSED
,,,,,,,
Test Cases/2.Planes de Accion/Generales/1.Index/1.1.Gestion del Plan/16.Seguir Accion,Firefox 71.0,,,2020-01-09 16:41:10,2020-01-09 16:42:32,"1m - 21,503s",PASSED
"callTestCase(findTestCase(""2.Planes de Accion/Daruma/Acceso al modulo""), [:])",Firefox 71.0,,,2020-01-09 16:41:10,2020-01-09 16:41:54,"43,177s",PASSED
"id = test.Metodos.lista(findTestObject(""Object Repository/2.list_inputCheck""))",Firefox 71.0,,,2020-01-09 16:41:54,2020-01-09 16:41:57,"3,850s",PASSED
"test.Metodos.select_item_managment(findTestObject(""Generales/Select Item List/1.list_index""), id)",Firefox 71.0,,,2020-01-09 16:41:57,2020-01-09 16:41:59,"1,356s",PASSED
delay(10),Firefox 71.0,,,2020-01-09 16:41:59,2020-01-09 16:42:09,"10,004s",PASSED
"test.Metodos.select_items_actions(""#action-list-table > tbody > tr > td > a"")",Firefox 71.0,,,2020-01-09 16:42:09,2020-01-09 16:42:09,"0,517s",PASSED
delay(5),Firefox 71.0,,,2020-01-09 16:42:09,2020-01-09 16:42:14,"5,004s",PASSED
"click(findTestObject(""2.Planes de Accion/Generales/1.Index/1.Gestion del Plan/16.Seguir Accion/btn_conclude action""))",Firefox 71.0,,,2020-01-09 16:42:14,2020-01-09 16:42:15,"0,862s",PASSED
delay(5),Firefox 71.0,,,2020-01-09 16:42:15,2020-01-09 16:42:20,"5,001s",PASSED
"test.Metodos.tiny1(findTestObject(""Object Repository/Generales/TinyMCE/Iframe""), 0)",Firefox 71.0,,,2020-01-09 16:42:20,2020-01-09 16:42:21,"0,907s",PASSED
"selectOptionByValue(findTestObject(""2.Planes de Accion/Generales/1.Index/1.Gestion del Plan/16.Seguir Accion/select1""), ""100"", true)",Firefox 71.0,,,2020-01-09 16:42:21,2020-01-09 16:42:25,"3,377s",PASSED
"click(findTestObject(""2.Planes de Accion/Generales/1.Index/1.Gestion del Plan/16.Seguir Accion/button_save""))",Firefox 71.0,,,2020-01-09 16:42:25,2020-01-09 16:42:25,"0,807s",PASSED
delay(5),Firefox 71.0,,,2020-01-09 16:42:25,2020-01-09 16:42:30,"5,002s",PASSED
"click(findTestObject(""2.Planes de Accion/Generales/1.Index/1.Gestion del Plan/16.Seguir Accion/a_return""))",Firefox 71.0,,,2020-01-09 16:42:30,2020-01-09 16:42:32,"1,413s",PASSED
,,,,,,,
Test Cases/2.Planes de Accion/Generales/1.Index/1.1.Gestion del Plan/17.Concluir Accion,Firefox 71.0,,,2020-01-09 16:42:32,2020-01-09 16:43:37,"1m - 5,291s",PASSED
"callTestCase(findTestCase(""2.Planes de Accion/Daruma/Acceso al modulo""), [:])",Firefox 71.0,,,2020-01-09 16:42:32,2020-01-09 16:43:16,"44,104s",PASSED
"id = test.Metodos.lista(findTestObject(""Object Repository/2.list_inputCheck""))",Firefox 71.0,,,2020-01-09 16:43:16,2020-01-09 16:43:20,"3,823s",PASSED
"test.Metodos.select_item_managment(findTestObject(""Generales/Select Item List/1.list_index""), id)",Firefox 71.0,,,2020-01-09 16:43:20,2020-01-09 16:43:21,"1,375s",PASSED
delay(5),Firefox 71.0,,,2020-01-09 16:43:21,2020-01-09 16:43:26,"5,001s",PASSED
"test.Metodos.select_items_actions(""#action-list-table > tbody > tr > td > a"")",Firefox 71.0,,,2020-01-09 16:43:26,2020-01-09 16:43:27,"0,611s",PASSED
"click(findTestObject(""2.Planes de Accion/Generales/1.Index/1.Gestion del Plan/17.Concluir Accion/1.Conclude_ActionF""))",Firefox 71.0,,,2020-01-09 16:43:27,2020-01-09 16:43:32,"4,756s",PASSED
"test.Metodos.tiny1(findTestObject(""Object Repository/Generales/TinyMCE/Iframe""), 0)",Firefox 71.0,,,2020-01-09 16:43:32,2020-01-09 16:43:36,"4,552s",PASSED
"click(findTestObject(""2.Planes de Accion/Generales/1.Index/1.Gestion del Plan/17.Concluir Accion/5.Button""))",Firefox 71.0,,,2020-01-09 16:43:36,2020-01-09 16:43:37,"0,828s",PASSED
,,,,,,,
Test Cases/2.Planes de Accion/Generales/1.Index/1.1.Gestion del Plan/14.Seguimiento Accion,Firefox 71.0,,,2020-01-09 16:43:37,2020-01-09 16:44:45,"1m - 7,984s",PASSED
"callTestCase(findTestCase(""2.Planes de Accion/Daruma/Acceso al modulo""), [:])",Firefox 71.0,,,2020-01-09 16:43:37,2020-01-09 16:44:21,"43,568s",PASSED
"id = test.Metodos.lista(findTestObject(""Object Repository/2.list_inputCheck""))",Firefox 71.0,,,2020-01-09 16:44:21,2020-01-09 16:44:25,"3,824s",PASSED
"test.Metodos.select_item_managment(findTestObject(""Generales/Select Item List/1.list_index""), id)",Firefox 71.0,,,2020-01-09 16:44:25,2020-01-09 16:44:26,"1,354s",PASSED
delay(10),Firefox 71.0,,,2020-01-09 16:44:26,2020-01-09 16:44:36,"10,004s",PASSED
"click(findTestObject(""2.Planes de Accion/Generales/1.Index/1.Gestion del Plan/14.Seguimiento Accion/1.Seguimiento""))",Firefox 71.0,,,2020-01-09 16:44:36,2020-01-09 16:44:38,"2,101s",PASSED
"test.Metodos.tiny1(findTestObject(""Object Repository/Generales/TinyMCE/Iframe""), 0)",Firefox 71.0,,,2020-01-09 16:44:38,2020-01-09 16:44:43,"5,167s",PASSED
"click(findTestObject(""Object Repository/2.Planes de Accion/Generales/1.Index/1.Gestion del Plan/14.Seguimiento Accion/input2""))",Firefox 71.0,,,2020-01-09 16:44:43,2020-01-09 16:44:44,"0,776s",PASSED
"click(findTestObject(""Object Repository/2.Planes de Accion/Generales/1.Index/1.Gestion del Plan/14.Seguimiento Accion/input_Return2""))",Firefox 71.0,,,2020-01-09 16:44:44,2020-01-09 16:44:45,"0,908s",PASSED
,,,,,,,
Test Cases/2.Planes de Accion/Generales/1.Index/1.1.Gestion del Plan/13.Concluir plan de accion,Firefox 71.0,,,2020-01-09 16:44:45,2020-01-09 16:45:47,"1m - 1,850s",PASSED
"callTestCase(findTestCase(""2.Planes de Accion/Daruma/Acceso al modulo""), [:])",Firefox 71.0,,,2020-01-09 16:44:45,2020-01-09 16:45:29,"43,806s",PASSED
"id = test.Metodos.lista(findTestObject(""Object Repository/2.list_inputCheck""))",Firefox 71.0,,,2020-01-09 16:45:29,2020-01-09 16:45:33,"3,824s",PASSED
"test.Metodos.select_item_managment(findTestObject(""Generales/Select Item List/1.list_index""), id)",Firefox 71.0,,,2020-01-09 16:45:33,2020-01-09 16:45:34,"1,322s",PASSED
delay(5),Firefox 71.0,,,2020-01-09 16:45:34,2020-01-09 16:45:39,"5,004s",PASSED
"click(findTestObject(""2.Planes de Accion/Generales/1.Index/1.Gestion del Plan/13.Concluir Plan de Accion/1.Conclude_Action""))",Firefox 71.0,,,2020-01-09 16:45:39,2020-01-09 16:45:40,"0,635s",PASSED
"click(findTestObject(""2.Planes de Accion/Generales/1.Index/1.Gestion del Plan/13.Concluir Plan de Accion/2.Input_Objetive_plan""))",Firefox 71.0,,,2020-01-09 16:45:40,2020-01-09 16:45:43,"2,989s",PASSED
"click(findTestObject(""2.Planes de Accion/Generales/1.Index/1.Gestion del Plan/13.Concluir Plan de Accion/3.Efectivo_plan_action""))",Firefox 71.0,,,2020-01-09 16:45:43,2020-01-09 16:45:44,"0,764s",PASSED
"test.Metodos.tiny1(findTestObject(""Object Repository/Generales/TinyMCE/Iframe""), 0)",Firefox 71.0,,,2020-01-09 16:45:44,2020-01-09 16:45:45,"0,953s",PASSED
"setText(findTestObject(""2.Planes de Accion/Generales/1.Index/1.Gestion del Plan/13.Concluir Plan de Accion/4.Textarea""), ""prueba katalon"")",Firefox 71.0,,,2020-01-09 16:45:45,2020-01-09 16:45:46,"1,637s",PASSED
"click(findTestObject(""2.Planes de Accion/Generales/1.Index/1.Gestion del Plan/13.Concluir Plan de Accion/5.Button""))",Firefox 71.0,,,2020-01-09 16:45:46,2020-01-09 16:45:47,"0,693s",PASSED
