Suite/Test/Step Name,Browser,Description,Tag,Start time,End time,Duration,Status
30.concluir plan de accion desde tareas,Firefox 72.0,,,2020-02-20 15:55:57,2020-02-20 16:06:22,"10m - 25,911s",FAILED
,,,,,,,
Test Cases/2.Planes de Accion/Generales/1.Index/1.Crear Plan de Accion,Firefox 72.0,,,2020-02-20 15:55:57,2020-02-20 15:59:30,"3m - 33,055s",PASSED
"callTestCase(findTestCase(""2.Planes de Accion/Daruma/Acceso al modulo""), [:])",Firefox 72.0,,,2020-02-20 15:55:58,2020-02-20 15:56:35,"37,319s",PASSED
delay(5),Firefox 72.0,,,2020-02-20 15:56:35,2020-02-20 15:56:40,"5,013s",PASSED
"user = test.Metodos.get_Text(findTestObject(""Object Repository/2.Planes de Accion/Generales/1.Index/1.1.Crear/1.user""))",Firefox 72.0,,,2020-02-20 15:56:40,2020-02-20 15:56:40,"0,359s",PASSED
delay(5),Firefox 72.0,,,2020-02-20 15:56:40,2020-02-20 15:56:45,"5,003s",PASSED
"click(findTestObject(""2.Planes de Accion/Generales/1.Index/1.1.Crear/1.btn_Create""))",Firefox 72.0,,,2020-02-20 15:56:45,2020-02-20 15:56:46,"0,572s",PASSED
delay(5),Firefox 72.0,,,2020-02-20 15:56:46,2020-02-20 15:56:51,"5,007s",PASSED
"test.Metodos.display_list_only(findTestObject(""Generales/Select2/1.display_list_only""), 0)",Firefox 72.0,,,2020-02-20 15:56:51,2020-02-20 15:57:03,"11,840s",PASSED
"test.Metodos.element_selected(findTestObject(""Object Repository/Generales/Select2/2.select_option""), 1)",Firefox 72.0,,,2020-02-20 15:57:03,2020-02-20 15:57:10,"7,039s",PASSED
"test.Metodos.display_list_only(findTestObject(""Generales/Select2/1.display_list_only""), 1)",Firefox 72.0,,,2020-02-20 15:57:10,2020-02-20 15:57:21,"11,030s",PASSED
"test.Metodos.element_selected(findTestObject(""Object Repository/Generales/Select2/2.select_option""), 1)",Firefox 72.0,,,2020-02-20 15:57:21,2020-02-20 15:57:28,"7,034s",PASSED
"click(findTestObject(""2.Planes de Accion/Generales/1.Index/1.1.Crear/3.Origenes""))",Firefox 72.0,,,2020-02-20 15:57:28,2020-02-20 15:57:29,"0,876s",PASSED
"elementSelect = test.Metodos.select2_config(findTestObject(""2.Planes de Accion/Generales/1.Index/1.1.Crear/4.Element_select""))",Firefox 72.0,,,2020-02-20 15:57:29,2020-02-20 15:57:30,"1,824s",PASSED
"selectOptionByValue(findTestObject(""2.Planes de Accion/Generales/1.Index/1.1.Crear/5.select_type""), elementSelect.toString(), true)",Firefox 72.0,,,2020-02-20 15:57:30,2020-02-20 15:57:32,"1,602s",PASSED
"getNumberOfTotalOption(findTestObject(""2.Planes de Accion/Generales/1.Index/1.1.Crear/4.Element_select""))",Firefox 72.0,,,2020-02-20 15:57:32,2020-02-20 15:57:33,"0,540s",PASSED
"test.Metodos.tiny1(findTestObject(""2.Planes de Accion/Generales/1.Index/1.1.Crear/6.TinyMCE""), 0)",Firefox 72.0,,,2020-02-20 15:57:33,2020-02-20 15:57:34,"0,945s",PASSED
delay(5),Firefox 72.0,,,2020-02-20 15:57:34,2020-02-20 15:57:39,"5,004s",PASSED
"test.Metodos.tiny1(findTestObject(""2.Planes de Accion/Generales/1.Index/1.1.Crear/6.TinyMCE""), 1)",Firefox 72.0,,,2020-02-20 15:57:39,2020-02-20 15:57:40,"0,932s",PASSED
delay(5),Firefox 72.0,,,2020-02-20 15:57:40,2020-02-20 15:57:45,"5,003s",PASSED
"selectOptionByValue(findTestObject(""2.Planes de Accion/Generales/1.Index/1.1.Crear/7.select_track_freq""), ""4"", true)",Firefox 72.0,,,2020-02-20 15:57:45,2020-02-20 15:57:45,"0,882s",PASSED
"setText(findTestObject(""2.Planes de Accion/Generales/1.Index/1.1.Crear/8.input_num_periods""), ""1"")",Firefox 72.0,,,2020-02-20 15:57:45,2020-02-20 15:57:46,"0,331s",PASSED
"test.Metodos.display_list_multi(findTestObject(""Object Repository/Generales/Select2/1.1.display_list_multi""), 2)",Firefox 72.0,,,2020-02-20 15:57:46,2020-02-20 15:57:56,"10,689s",PASSED
delay(5),Firefox 72.0,,,2020-02-20 15:57:56,2020-02-20 15:58:01,"5,006s",PASSED
"setText(findTestObject(""Object Repository/2.Planes de Accion/Generales/1.Index/1.1.Crear/1.enter""), user)",Firefox 72.0,,,2020-02-20 15:58:01,2020-02-20 15:58:02,"0,435s",PASSED
"enter = findWebElement(findTestObject(""Object Repository/2.Planes de Accion/Generales/1.Index/1.1.Crear/1.enter""), 2)",Firefox 72.0,,,2020-02-20 15:58:02,2020-02-20 15:58:04,"2,082s",PASSED
enter.sendKeys(ENTER),Firefox 72.0,,,2020-02-20 15:58:04,2020-02-20 15:58:04,"0,060s",PASSED
delay(5),Firefox 72.0,,,2020-02-20 15:58:04,2020-02-20 15:58:09,"5,002s",PASSED
"test.Metodos.display_list_multi(findTestObject(""Generales/Select2/1.1.display_list_multi""), 5)",Firefox 72.0,,,2020-02-20 15:58:09,2020-02-20 15:58:20,"10,537s",PASSED
delay(5),Firefox 72.0,,,2020-02-20 15:58:20,2020-02-20 15:58:25,"5,004s",PASSED
"test.Metodos.select2(findTestObject(""Object Repository/Generales/Select2/2.select_option""), 0)",Firefox 72.0,,,2020-02-20 15:58:25,2020-02-20 15:58:36,"11,047s",PASSED
"test.Metodos.display_list_multi(findTestObject(""Object Repository/Generales/Select2/1.1.display_list_multi""), 6)",Firefox 72.0,,,2020-02-20 15:58:36,2020-02-20 15:58:46,"10,570s",PASSED
"test.Metodos.select2(findTestObject(""Object Repository/Generales/Select2/2.select_option""), 0)",Firefox 72.0,,,2020-02-20 15:58:46,2020-02-20 15:58:57,"11,058s",PASSED
"test.Metodos.display_list_multi(findTestObject(""Object Repository/Generales/Select2/1.1.display_list_multi""), 7)",Firefox 72.0,,,2020-02-20 15:58:57,2020-02-20 15:59:08,"10,547s",PASSED
"test.Metodos.select2(findTestObject(""Object Repository/Generales/Select2/2.select_option""), 0)",Firefox 72.0,,,2020-02-20 15:59:08,2020-02-20 15:59:19,"11,000s",PASSED
delay(5),Firefox 72.0,,,2020-02-20 15:59:19,2020-02-20 15:59:24,"5,006s",PASSED
"click(findTestObject(""2.Planes de Accion/Generales/1.Index/1.1.Crear/10.btn_Save""))",Firefox 72.0,,,2020-02-20 15:59:24,2020-02-20 15:59:25,"1,155s",PASSED
delay(5),Firefox 72.0,,,2020-02-20 15:59:25,2020-02-20 15:59:30,"5,005s",PASSED
,,,,,,,
Test Cases/2.Planes de Accion/Generales/1.Index/1.1.Gestion del Plan/2.Agregar Accion,Firefox 72.0,,,2020-02-20 15:59:30,2020-02-20 16:00:42,"1m - 12,441s",PASSED
"callTestCase(findTestCase(""2.Planes de Accion/Daruma/Acceso al modulo""), [:])",Firefox 72.0,,,2020-02-20 15:59:30,2020-02-20 16:00:09,"38,202s",PASSED
"id = test.Metodos.lista(findTestObject(""Object Repository/2.list_inputCheck""))",Firefox 72.0,,,2020-02-20 16:00:09,2020-02-20 16:00:12,"3,795s",PASSED
"test.Metodos.select_item_managment(findTestObject(""Generales/Select Item List/1.list_index""), id)",Firefox 72.0,,,2020-02-20 16:00:12,2020-02-20 16:00:13,"1,078s",PASSED
delay(5),Firefox 72.0,,,2020-02-20 16:00:13,2020-02-20 16:00:18,"5,002s",PASSED
"click(findTestObject(""2.Planes de Accion/Generales/1.Index/1.Gestion del Plan/1.Analisis/1.btn_option_more""))",Firefox 72.0,,,2020-02-20 16:00:18,2020-02-20 16:00:19,"0,536s",PASSED
"click(findTestObject(""2.Planes de Accion/Generales/1.Index/1.Gestion del Plan/1.Analisis/2.btn_analyze""))",Firefox 72.0,,,2020-02-20 16:00:19,2020-02-20 16:00:20,"0,856s",PASSED
"test.Metodos.tiny1(findTestObject(""Object Repository/Generales/TinyMCE/Iframe""), 0)",Firefox 72.0,,,2020-02-20 16:00:20,2020-02-20 16:00:23,"3,404s",PASSED
"click(findTestObject(""2.Planes de Accion/Generales/1.Index/1.Gestion del Plan/1.Analisis/3.btn_Save""))",Firefox 72.0,,,2020-02-20 16:00:23,2020-02-20 16:00:24,"0,768s",PASSED
delay(5),Firefox 72.0,,,2020-02-20 16:00:24,2020-02-20 16:00:29,"5,004s",PASSED
"selectOptionByValue(findTestObject(""2.Planes de Accion/Generales/1.Index/1.Gestion del Plan/1.Analisis/4.select_cause_effect""), ""2"", false)",Firefox 72.0,,,2020-02-20 16:00:29,2020-02-20 16:00:30,"0,779s",PASSED
"click(findTestObject(""2.Planes de Accion/Generales/1.Index/1.Gestion del Plan/1.Analisis/5.inputCheck_add_actions""))",Firefox 72.0,,,2020-02-20 16:00:30,2020-02-20 16:00:30,"0,505s",PASSED
"click(findTestObject(""2.Planes de Accion/Generales/1.Index/1.Gestion del Plan/1.Analisis/3.btn_Save""))",Firefox 72.0,,,2020-02-20 16:00:30,2020-02-20 16:00:31,"0,516s",PASSED
"test.Metodos.tiny1(findTestObject(""Object Repository/Generales/TinyMCE/Iframe""), 0)",Firefox 72.0,,,2020-02-20 16:00:31,2020-02-20 16:00:36,"5,559s",PASSED
"selectOptionByValue(findTestObject(""2.Planes de Accion/Generales/1.Index/1.Gestion del Plan/1.Analisis/6.select_action_type""), ""1"", true)",Firefox 72.0,,,2020-02-20 16:00:36,2020-02-20 16:00:37,"1,020s",PASSED
"selectOptionByValue(findTestObject(""2.Planes de Accion/Generales/1.Index/1.Gestion del Plan/1.Analisis/7.select_end_date_month""), ""12"", true)",Firefox 72.0,,,2020-02-20 16:00:37,2020-02-20 16:00:39,"1,349s",PASSED
"selectOptionByValue(findTestObject(""2.Planes de Accion/Generales/1.Index/1.Gestion del Plan/1.Analisis/8.select_end_date_day""), ""31"", true)",Firefox 72.0,,,2020-02-20 16:00:39,2020-02-20 16:00:40,"1,608s",PASSED
"setText(findTestObject(""Object Repository/2.Planes de Accion/Generales/1.Index/1.Gestion del Plan/1.Analisis/9.input_initial_budget""), ""5000000"")",Firefox 72.0,,,2020-02-20 16:00:40,2020-02-20 16:00:41,"0,371s",PASSED
"setText(findTestObject(""Object Repository/2.Planes de Accion/Generales/1.Index/1.Gestion del Plan/1.Analisis/10.input_investment_budget""), ""5100000"")",Firefox 72.0,,,2020-02-20 16:00:41,2020-02-20 16:00:41,"0,322s",PASSED
"setText(findTestObject(""Object Repository/2.Planes de Accion/Generales/1.Index/1.Gestion del Plan/1.Analisis/11.input_operating_budget""), ""4800000"")",Firefox 72.0,,,2020-02-20 16:00:41,2020-02-20 16:00:41,"0,331s",PASSED
"click(findTestObject(""2.Planes de Accion/Generales/1.Index/1.Gestion del Plan/1.Analisis/12.inputCheck_exclude_consolidate""))",Firefox 72.0,,,2020-02-20 16:00:41,2020-02-20 16:00:42,"0,514s",PASSED
"click(findTestObject(""2.Planes de Accion/Generales/1.Index/1.Gestion del Plan/1.Analisis/3.btn_Save""))",Firefox 72.0,,,2020-02-20 16:00:42,2020-02-20 16:00:42,"0,539s",PASSED
,,,,,,,
Test Cases/2.Planes de Accion/Generales/1.Index/1.1.Gestion del Plan/6.Solicitar aprobacion del plan,Firefox 72.0,,,2020-02-20 16:00:42,2020-02-20 16:01:34,"51,370s",PASSED
"callTestCase(findTestCase(""2.Planes de Accion/Daruma/Acceso al modulo""), [:])",Firefox 72.0,,,2020-02-20 16:00:43,2020-02-20 16:01:20,"37,141s",PASSED
"id = test.Metodos.lista(findTestObject(""Object Repository/2.list_inputCheck""))",Firefox 72.0,,,2020-02-20 16:01:20,2020-02-20 16:01:24,"3,795s",PASSED
"test.Metodos.select_item_managment(findTestObject(""Generales/Select Item List/1.list_index""), id)",Firefox 72.0,,,2020-02-20 16:01:24,2020-02-20 16:01:25,"0,974s",PASSED
delay(8),Firefox 72.0,,,2020-02-20 16:01:25,2020-02-20 16:01:33,"8,004s",PASSED
"click(findTestObject(""2.Planes de Accion/Generales/1.Index/1.Gestion del Plan/6.Solicitar Plan de Accion/1.btn_option_more""))",Firefox 72.0,,,2020-02-20 16:01:33,2020-02-20 16:01:33,"0,524s",PASSED
"click(findTestObject(""Object Repository/2.Planes de Accion/Generales/1.Index/1.Gestion del Plan/6.Solicitar Plan de Accion/2.btn_ask_for_approval""))",Firefox 72.0,,,2020-02-20 16:01:33,2020-02-20 16:01:34,"0,645s",PASSED
acceptAlert(),Firefox 72.0,,,2020-02-20 16:01:34,2020-02-20 16:01:34,"0,073s",PASSED
,,,,,,,
Test Cases/2.Planes de Accion/Generales/1.Index/1.1.Gestion del Plan/29.aprobar acci\u00F3n desde la secci\u00F3n de tareas,Firefox 72.0,,,2020-02-20 16:01:34,2020-02-20 16:02:45,"1m - 10,779s",PASSED
"callTestCase(findTestCase(""Login""), [:])",Firefox 72.0,,,2020-02-20 16:01:34,2020-02-20 16:02:06,"31,523s",PASSED
delay(5),Firefox 72.0,,,2020-02-20 16:02:06,2020-02-20 16:02:11,"5,002s",PASSED
"click(findTestObject(""2.Planes de Accion/Generales/1.Index/1.Gestion del Plan/29.aprobar acción desde la sección de tareas/1.Task""))",Firefox 72.0,,,2020-02-20 16:02:11,2020-02-20 16:02:11,"0,639s",PASSED
delay(5),Firefox 72.0,,,2020-02-20 16:02:11,2020-02-20 16:02:16,"5,003s",PASSED
"click(findTestObject(""2.Planes de Accion/Generales/1.Index/1.Gestion del Plan/29.aprobar acción desde la sección de tareas/1.List_task_action_plan""))",Firefox 72.0,,,2020-02-20 16:02:16,2020-02-20 16:02:17,"0,537s",PASSED
delay(5),Firefox 72.0,,,2020-02-20 16:02:17,2020-02-20 16:02:22,"5,002s",PASSED
"click(findTestObject(""Object Repository/2.Planes de Accion/Generales/1.Index/1.Gestion del Plan/29.aprobar acción desde la sección de tareas/1.accion_name""))",Firefox 72.0,,,2020-02-20 16:02:22,2020-02-20 16:02:22,"0,524s",PASSED
delay(5),Firefox 72.0,,,2020-02-20 16:02:22,2020-02-20 16:02:27,"5,005s",PASSED
"test.Metodos.tiny1(findTestObject(""2.Planes de Accion/Generales/1.Index/1.1.Crear/6.TinyMCE""), 0)",Firefox 72.0,,,2020-02-20 16:02:27,2020-02-20 16:02:28,"0,820s",PASSED
delay(5),Firefox 72.0,,,2020-02-20 16:02:28,2020-02-20 16:02:33,"5,004s",PASSED
"selectOptionByValue(findTestObject(""2.Planes de Accion/Generales/1.Index/1.Gestion del Plan/29.aprobar acción desde la sección de tareas/1.select""), ""100"", false)",Firefox 72.0,,,2020-02-20 16:02:33,2020-02-20 16:02:34,"0,819s",PASSED
delay(5),Firefox 72.0,,,2020-02-20 16:02:34,2020-02-20 16:02:39,"5,002s",PASSED
"click(findTestObject(""Object Repository/2.Planes de Accion/Generales/1.Index/1.Gestion del Plan/29.aprobar acción desde la sección de tareas/1.btnsave""))",Firefox 72.0,,,2020-02-20 16:02:39,2020-02-20 16:02:40,"0,549s",PASSED
delay(5),Firefox 72.0,,,2020-02-20 16:02:40,2020-02-20 16:02:45,"5,003s",PASSED
,,,,,,,
Test Cases/2.Planes de Accion/Generales/1.Index/1.1.Gestion del Plan/30.concluir plan de accion,Firefox 72.0,,,2020-02-20 16:02:45,2020-02-20 16:03:46,"1m - 1,527s",PASSED
"callTestCase(findTestCase(""Login""), [:])",Firefox 72.0,,,2020-02-20 16:02:45,2020-02-20 16:03:13,"28,203s",PASSED
delay(5),Firefox 72.0,,,2020-02-20 16:03:13,2020-02-20 16:03:18,"5,003s",PASSED
"click(findTestObject(""2.Planes de Accion/Generales/1.Index/1.Gestion del Plan/29.aprobar acción desde la sección de tareas/1.Task""))",Firefox 72.0,,,2020-02-20 16:03:18,2020-02-20 16:03:19,"0,647s",PASSED
delay(5),Firefox 72.0,,,2020-02-20 16:03:19,2020-02-20 16:03:24,"5,005s",PASSED
"click(findTestObject(""2.Planes de Accion/Generales/1.Index/1.Gestion del Plan/29.aprobar acción desde la sección de tareas/1.List_task_action_plan""))",Firefox 72.0,,,2020-02-20 16:03:24,2020-02-20 16:03:24,"0,530s",PASSED
delay(5),Firefox 72.0,,,2020-02-20 16:03:24,2020-02-20 16:03:29,"5,003s",PASSED
"click(findTestObject(""Object Repository/2.Planes de Accion/Generales/1.Index/1.Gestion del Plan/30.concluir plan de accion/1.accion_name""))",Firefox 72.0,,,2020-02-20 16:03:29,2020-02-20 16:03:30,"0,551s",PASSED
delay(5),Firefox 72.0,,,2020-02-20 16:03:30,2020-02-20 16:03:35,"5,002s",PASSED
"test.Metodos.tiny1(findTestObject(""2.Planes de Accion/Generales/1.Index/1.1.Crear/6.TinyMCE""), 0)",Firefox 72.0,,,2020-02-20 16:03:35,2020-02-20 16:03:36,"0,836s",PASSED
delay(5),Firefox 72.0,,,2020-02-20 16:03:36,2020-02-20 16:03:41,"5,003s",PASSED
"click(findTestObject(""Object Repository/2.Planes de Accion/Generales/1.Index/1.Gestion del Plan/30.concluir plan de accion/1.btn_save""))",Firefox 72.0,,,2020-02-20 16:03:41,2020-02-20 16:03:41,"0,528s",PASSED
delay(5),Firefox 72.0,,,2020-02-20 16:03:41,2020-02-20 16:03:46,"5,004s",PASSED
,,,,,,,
Test Cases/2.Planes de Accion/Generales/1.Index/1.1.Gestion del Plan/31.seguimiento plan de accion,Firefox 72.0,,,2020-02-20 16:03:46,2020-02-20 16:04:55,"1m - 8,626s",PASSED
"callTestCase(findTestCase(""Login""), [:])",Firefox 72.0,,,2020-02-20 16:03:46,2020-02-20 16:04:16,"29,708s",PASSED
delay(5),Firefox 72.0,,,2020-02-20 16:04:16,2020-02-20 16:04:21,"5,003s",PASSED
"click(findTestObject(""2.Planes de Accion/Generales/1.Index/1.Gestion del Plan/29.aprobar acción desde la sección de tareas/1.Task""))",Firefox 72.0,,,2020-02-20 16:04:21,2020-02-20 16:04:22,"0,638s",PASSED
delay(5),Firefox 72.0,,,2020-02-20 16:04:22,2020-02-20 16:04:27,"5,003s",PASSED
"click(findTestObject(""2.Planes de Accion/Generales/1.Index/1.Gestion del Plan/29.aprobar acción desde la sección de tareas/1.List_task_action_plan""))",Firefox 72.0,,,2020-02-20 16:04:27,2020-02-20 16:04:27,"0,558s",PASSED
delay(5),Firefox 72.0,,,2020-02-20 16:04:27,2020-02-20 16:04:32,"5,003s",PASSED
"click(findTestObject(""Object Repository/2.Planes de Accion/Generales/1.Index/1.Gestion del Plan/30.concluir plan de accion/1.accion_name""))",Firefox 72.0,,,2020-02-20 16:04:32,2020-02-20 16:04:33,"0,536s",PASSED
delay(5),Firefox 72.0,,,2020-02-20 16:04:33,2020-02-20 16:04:38,"5,002s",PASSED
"test.Metodos.tiny1(findTestObject(""2.Planes de Accion/Generales/1.Index/1.1.Crear/6.TinyMCE""), 0)",Firefox 72.0,,,2020-02-20 16:04:38,2020-02-20 16:04:39,"0,889s",PASSED
delay(5),Firefox 72.0,,,2020-02-20 16:04:39,2020-02-20 16:04:44,"5,003s",PASSED
"click(findTestObject(""Object Repository/2.Planes de Accion/Generales/1.Index/1.Gestion del Plan/31.seguimiento plan de accion/1.input_check""))",Firefox 72.0,,,2020-02-20 16:04:44,2020-02-20 16:04:44,"0,517s",PASSED
delay(5),Firefox 72.0,,,2020-02-20 16:04:44,2020-02-20 16:04:49,"5,002s",PASSED
"click(findTestObject(""Object Repository/2.Planes de Accion/Generales/1.Index/1.Gestion del Plan/31.seguimiento plan de accion/1.btn_save""))",Firefox 72.0,,,2020-02-20 16:04:49,2020-02-20 16:04:50,"0,553s",PASSED
delay(5),Firefox 72.0,,,2020-02-20 16:04:50,2020-02-20 16:04:55,"5,004s",PASSED
,,,,,,,
Test Cases/2.Planes de Accion/Generales/1.Index/1.1.Gestion del Plan/32.concluir plan,Firefox 72.0,,,2020-02-20 16:04:55,2020-02-20 16:06:22,"1m - 27,675s",FAILED
"callTestCase(findTestCase(""Login""), [:])",Firefox 72.0,,,2020-02-20 16:04:55,2020-02-20 16:05:23,"28,280s",PASSED
delay(5),Firefox 72.0,,,2020-02-20 16:05:23,2020-02-20 16:05:28,"5,002s",PASSED
palabra = test.Metodos.randomString(),Firefox 72.0,,,2020-02-20 16:05:28,2020-02-20 16:05:28,"0,019s",PASSED
"click(findTestObject(""2.Planes de Accion/Generales/1.Index/1.Gestion del Plan/29.aprobar acción desde la sección de tareas/1.Task""))",Firefox 72.0,,,2020-02-20 16:05:28,2020-02-20 16:05:29,"0,669s",PASSED
delay(5),Firefox 72.0,,,2020-02-20 16:05:29,2020-02-20 16:05:34,"5,002s",PASSED
"click(findTestObject(""2.Planes de Accion/Generales/1.Index/1.Gestion del Plan/29.aprobar acción desde la sección de tareas/1.List_task_action_plan""))",Firefox 72.0,,,2020-02-20 16:05:34,2020-02-20 16:05:35,"0,513s",PASSED
delay(5),Firefox 72.0,,,2020-02-20 16:05:35,2020-02-20 16:05:40,"5,002s",PASSED
"click(findTestObject(""Object Repository/2.Planes de Accion/Generales/1.Index/1.Gestion del Plan/32.concluir plan/1.input_check""))",Firefox 72.0,,,2020-02-20 16:05:40,2020-02-20 16:06:22,"42,835s",FAILED
