Suite/Test/Step Name,Browser,Description,Tag,Start time,End time,Duration,Status
3.Origenes de Opinion_SAC,Firefox 71.0,,,2020-01-09 11:58:07,2020-01-09 12:07:01,"8m - 53,971s",PASSED
,,,,,,,
Test Cases/5.SAC/Configuracion/3.Origenes de opinion/1.Test Case Generales/0.Ver,Firefox 71.0,,,2020-01-09 11:58:07,2020-01-09 11:59:08,"1m - 0,468s",PASSED
"callTestCase(findTestCase(""5.SAC/Daruma/Acceso al modulo""), [:])",Firefox 71.0,,,2020-01-09 11:58:08,2020-01-09 11:58:56,"48,182s",PASSED
"click(findTestObject(""5.SAC/Configuracion/3.Origenes de opinion/0.Ver/1.Configuration""))",Firefox 71.0,,,2020-01-09 11:58:56,2020-01-09 11:59:02,"6,079s",PASSED
delay(5),Firefox 71.0,,,2020-01-09 11:59:02,2020-01-09 11:59:07,"5,009s",PASSED
"click(findTestObject(""5.SAC/Configuracion/3.Origenes de opinion/0.Ver/Origin_Opinion""))",Firefox 71.0,,,2020-01-09 11:59:07,2020-01-09 11:59:08,"0,697s",PASSED
,,,,,,,
Test Cases/5.SAC/Configuracion/3.Origenes de opinion/1.Test Case Generales/1.Crear,Firefox 71.0,,,2020-01-09 11:59:08,2020-01-09 12:00:12,"1m - 4,748s",PASSED
palabra = test.Metodos.randomString(),Firefox 71.0,,,2020-01-09 11:59:08,2020-01-09 11:59:08,"0,037s",PASSED
"callTestCase(findTestCase(""5.SAC/Configuracion/3.Origenes de opinion/1.Test Case Generales/0.Ver""), [:])",Firefox 71.0,,,2020-01-09 11:59:08,2020-01-09 11:59:57,"49,459s",PASSED
delay(5),Firefox 71.0,,,2020-01-09 11:59:57,2020-01-09 12:00:02,"5,007s",PASSED
"click(findTestObject(""5.SAC/Configuracion/3.Origenes de opinion/1.Crear/create""))",Firefox 71.0,,,2020-01-09 12:00:02,2020-01-09 12:00:03,"0,575s",PASSED
"setText(findTestObject(""5.SAC/Configuracion/3.Origenes de opinion/1.Crear/input_Origin_opinion""), palabra)",Firefox 71.0,,,2020-01-09 12:00:03,2020-01-09 12:00:10,"6,756s",PASSED
"setText(findTestObject(""5.SAC/Configuracion/3.Origenes de opinion/1.Crear/textarea_Descripcion""), ""descripcion prueba katalon"")",Firefox 71.0,,,2020-01-09 12:00:10,2020-01-09 12:00:12,"2,023s",PASSED
"click(findTestObject(""5.SAC/Configuracion/3.Origenes de opinion/1.Crear/btn_save""))",Firefox 71.0,,,2020-01-09 12:00:12,2020-01-09 12:00:12,"0,623s",PASSED
,,,,,,,
Test Cases/5.SAC/Configuracion/3.Origenes de opinion/1.Test Case Generales/2.Editar,Firefox 71.0,,,2020-01-09 12:00:12,2020-01-09 12:01:20,"1m - 7,295s",PASSED
palabra = test.Metodos.randomStringEdit(),Firefox 71.0,,,2020-01-09 12:00:13,2020-01-09 12:00:13,"0,002s",PASSED
"callTestCase(findTestCase(""5.SAC/Configuracion/3.Origenes de opinion/1.Test Case Generales/0.Ver""), [:])",Firefox 71.0,,,2020-01-09 12:00:13,2020-01-09 12:01:03,"50,376s",PASSED
delay(5),Firefox 71.0,,,2020-01-09 12:01:03,2020-01-09 12:01:08,"5,006s",PASSED
"test.Metodos.lista(findTestObject(""5.SAC/Configuracion/3.Origenes de opinion/2.Editar/list_inputCheck""))",Firefox 71.0,,,2020-01-09 12:01:08,2020-01-09 12:01:12,"3,946s",PASSED
"click(findTestObject(""5.SAC/Configuracion/2.Tipos de causas/2.Editar/Edit""))",Firefox 71.0,,,2020-01-09 12:01:12,2020-01-09 12:01:13,"0,590s",PASSED
"setText(findTestObject(""5.SAC/Configuracion/3.Origenes de opinion/1.Crear/input_Origin_opinion""), palabra)",Firefox 71.0,,,2020-01-09 12:01:13,2020-01-09 12:01:18,"5,914s",PASSED
"setText(findTestObject(""5.SAC/Configuracion/3.Origenes de opinion/1.Crear/textarea_Descripcion""), ""Editando descripcion prueba katalon"")",Firefox 71.0,,,2020-01-09 12:01:18,2020-01-09 12:01:19,"0,610s",PASSED
"click(findTestObject(""5.SAC/Configuracion/3.Origenes de opinion/1.Crear/btn_save""))",Firefox 71.0,,,2020-01-09 12:01:19,2020-01-09 12:01:20,"0,525s",PASSED
,,,,,,,
Test Cases/5.SAC/Configuracion/3.Origenes de opinion/1.Test Case Generales/3.Eliminar,Firefox 71.0,,,2020-01-09 12:01:20,2020-01-09 12:02:34,"1m - 14,220s",PASSED
"callTestCase(findTestCase(""5.SAC/Configuracion/3.Origenes de opinion/1.Test Case Generales/0.Ver""), [:])",Firefox 71.0,,,2020-01-09 12:01:20,2020-01-09 12:02:19,"58,784s",PASSED
delay(5),Firefox 71.0,,,2020-01-09 12:02:19,2020-01-09 12:02:24,"5,003s",PASSED
"test.Metodos.lista(findTestObject(""5.SAC/Configuracion/3.Origenes de opinion/3.Eliminar/1.list_inputCheck""))",Firefox 71.0,,,2020-01-09 12:02:24,2020-01-09 12:02:33,"9,437s",PASSED
"click(findTestObject(""5.SAC/Configuracion/3.Origenes de opinion/3.Eliminar/Delete""))",Firefox 71.0,,,2020-01-09 12:02:33,2020-01-09 12:02:34,"0,521s",PASSED
acceptAlert(),Firefox 71.0,,,2020-01-09 12:02:34,2020-01-09 12:02:34,"0,092s",PASSED
,,,,,,,
Test Cases/5.SAC/Configuracion/3.Origenes de opinion/1.Test Case Generales/4.Inhabilitar,Firefox 71.0,,,2020-01-09 12:02:34,2020-01-09 12:03:40,"1m - 6,105s",PASSED
"callTestCase(findTestCase(""5.SAC/Configuracion/3.Origenes de opinion/1.Test Case Generales/0.Ver""), [:])",Firefox 71.0,,,2020-01-09 12:02:34,2020-01-09 12:03:29,"54,283s",PASSED
delay(5),Firefox 71.0,,,2020-01-09 12:03:29,2020-01-09 12:03:34,"5,005s",PASSED
"test.Metodos.lista(findTestObject(""5.SAC/Configuracion/3.Origenes de opinion/4.Inhabilitar/1.list_inputCheck""))",Firefox 71.0,,,2020-01-09 12:03:34,2020-01-09 12:03:37,"3,904s",PASSED
"click(findTestObject(""5.SAC/Configuracion/2.Tipos de causas/4.Inhabilitar/1Btn_Disable""))",Firefox 71.0,,,2020-01-09 12:03:37,2020-01-09 12:03:38,"0,752s",PASSED
"click(findTestObject(""5.SAC/Configuracion/2.Tipos de causas/4.Inhabilitar/2Btn_disable""))",Firefox 71.0,,,2020-01-09 12:03:38,2020-01-09 12:03:40,"1,680s",PASSED
acceptAlert(),Firefox 71.0,,,2020-01-09 12:03:40,2020-01-09 12:03:40,"0,076s",PASSED
,,,,,,,
Test Cases/5.SAC/Configuracion/3.Origenes de opinion/1.Test Case Generales/5.Filtrar,Firefox 71.0,,,2020-01-09 12:03:40,2020-01-09 12:04:45,"1m - 5,385s",PASSED
"callTestCase(findTestCase(""5.SAC/Configuracion/3.Origenes de opinion/1.Test Case Generales/0.Ver""), [:])",Firefox 71.0,,,2020-01-09 12:03:40,2020-01-09 12:04:37,"57,037s",PASSED
delay(5),Firefox 71.0,,,2020-01-09 12:04:37,2020-01-09 12:04:42,"5,004s",PASSED
"click(findTestObject(""5.SAC/Configuracion/3.Origenes de opinion/5.Filtrar/1.btn_Filter""))",Firefox 71.0,,,2020-01-09 12:04:42,2020-01-09 12:04:44,"2,116s",PASSED
"setText(findTestObject(""5.SAC/Configuracion/3.Origenes de opinion/5.Filtrar/input_Origin""), ""EMAIL"")",Firefox 71.0,,,2020-01-09 12:04:44,2020-01-09 12:04:45,"0,408s",PASSED
"click(findTestObject(""5.SAC/Configuracion/3.Origenes de opinion/5.Filtrar/btn_filter""))",Firefox 71.0,,,2020-01-09 12:04:45,2020-01-09 12:04:45,"0,583s",PASSED
,,,,,,,
Test Cases/5.SAC/Configuracion/3.Origenes de opinion/1.Test Case Generales/6.Desfiltrar,Firefox 71.0,,,2020-01-09 12:04:45,2020-01-09 12:05:55,"1m - 9,906s",PASSED
"callTestCase(findTestCase(""5.SAC/Configuracion/3.Origenes de opinion/1.Test Case Generales/0.Ver""), [:])",Firefox 71.0,,,2020-01-09 12:04:46,2020-01-09 12:05:43,"56,987s",PASSED
delay(5),Firefox 71.0,,,2020-01-09 12:05:43,2020-01-09 12:05:48,"5,003s",PASSED
"click(findTestObject(""5.SAC/Configuracion/3.Origenes de opinion/6.Desfiltrar/1.btn_Filter""))",Firefox 71.0,,,2020-01-09 12:05:48,2020-01-09 12:05:48,"0,564s",PASSED
"setText(findTestObject(""5.SAC/Configuracion/3.Origenes de opinion/6.Desfiltrar/input_Origin""), ""EMAIL"")",Firefox 71.0,,,2020-01-09 12:05:48,2020-01-09 12:05:49,"0,410s",PASSED
"click(findTestObject(""5.SAC/Configuracion/3.Origenes de opinion/6.Desfiltrar/btn_filter""))",Firefox 71.0,,,2020-01-09 12:05:49,2020-01-09 12:05:49,"0,591s",PASSED
delay(5),Firefox 71.0,,,2020-01-09 12:05:49,2020-01-09 12:05:54,"5,007s",PASSED
"click(findTestObject(""5.SAC/Configuracion/3.Origenes de opinion/6.Desfiltrar/1.btn_Filter""))",Firefox 71.0,,,2020-01-09 12:05:54,2020-01-09 12:05:55,"0,536s",PASSED
"click(findTestObject(""5.SAC/Configuracion/3.Origenes de opinion/6.Desfiltrar/a_Restablecer""))",Firefox 71.0,,,2020-01-09 12:05:55,2020-01-09 12:05:55,"0,602s",PASSED
,,,,,,,
Test Cases/5.SAC/Configuracion/3.Origenes de opinion/1.Test Case Generales/7.Mostrar,Firefox 71.0,,,2020-01-09 12:05:55,2020-01-09 12:07:01,"1m - 5,223s",PASSED
"callTestCase(findTestCase(""5.SAC/Configuracion/3.Origenes de opinion/1.Test Case Generales/0.Ver""), [:])",Firefox 71.0,,,2020-01-09 12:05:56,2020-01-09 12:06:46,"50,512s",PASSED
delay(5),Firefox 71.0,,,2020-01-09 12:06:46,2020-01-09 12:06:51,"5,006s",PASSED
"test.Metodos.lista(findTestObject(""Object Repository/2.list_inputCheck""))",Firefox 71.0,,,2020-01-09 12:06:51,2020-01-09 12:06:55,"3,783s",PASSED
delay(5),Firefox 71.0,,,2020-01-09 12:06:55,2020-01-09 12:07:00,"5,005s",PASSED
"click(findTestObject(""5.SAC/Configuracion/3.Origenes de opinion/7.Mostrar/7.Show""))",Firefox 71.0,,,2020-01-09 12:07:00,2020-01-09 12:07:01,"0,606s",PASSED
