Suite/Test/Step Name,Browser,Description,Tag,Start time,End time,Duration,Status
13.Concluir Plan de Accion,Firefox 71.0,,,2019-12-30 09:13:57,2019-12-30 09:28:48,"14m - 50,624s",PASSED
,,,,,,,
Test Cases/2.Planes de Accion/Generales/1.Index/1.Crear Plan de Accion,Firefox 71.0,,,2019-12-30 09:13:57,2019-12-30 09:18:32,"4m - 34,141s",PASSED
"callTestCase(findTestCase(""2.Planes de Accion/Daruma/Acceso al modulo""), [:])",Firefox 71.0,,,2019-12-30 09:13:58,2019-12-30 09:14:50,"51,723s",PASSED
"click(findTestObject(""2.Planes de Accion/Generales/1.Index/1.1.Crear/1.btn_Create""))",Firefox 71.0,,,2019-12-30 09:14:50,2019-12-30 09:14:51,"0,605s",PASSED
delay(5),Firefox 71.0,,,2019-12-30 09:14:51,2019-12-30 09:14:56,"5,008s",PASSED
"test.Metodos.display_list_only(findTestObject(""Generales/Select2/1.display_list_only""), 0)",Firefox 71.0,,,2019-12-30 09:14:56,2019-12-30 09:15:08,"12,053s",PASSED
"test.Metodos.element_selected(findTestObject(""Object Repository/Generales/Select2/2.select_option""), 1)",Firefox 71.0,,,2019-12-30 09:15:08,2019-12-30 09:15:15,"7,051s",PASSED
"test.Metodos.display_list_only(findTestObject(""Generales/Select2/1.display_list_only""), 1)",Firefox 71.0,,,2019-12-30 09:15:15,2019-12-30 09:15:26,"11,056s",PASSED
"test.Metodos.element_selected(findTestObject(""Object Repository/Generales/Select2/2.select_option""), 1)",Firefox 71.0,,,2019-12-30 09:15:26,2019-12-30 09:15:33,"7,087s",PASSED
"test.Metodos.display_list_multi(findTestObject(""Object Repository/Generales/Select2/1.1.display_list_multi""), 0)",Firefox 71.0,,,2019-12-30 09:15:33,2019-12-30 09:15:43,"10,625s",PASSED
"test.Metodos.select2(findTestObject(""Object Repository/Generales/Select2/2.select_option""), 0)",Firefox 71.0,,,2019-12-30 09:15:43,2019-12-30 09:15:55,"11,110s",PASSED
"click(findTestObject(""2.Planes de Accion/Generales/1.Index/1.1.Crear/3.Origenes""))",Firefox 71.0,,,2019-12-30 09:15:55,2019-12-30 09:15:56,"0,993s",PASSED
"test.Metodos.display_list_multi(findTestObject(""Object Repository/Generales/Select2/1.1.display_list_multi""), 1)",Firefox 71.0,,,2019-12-30 09:15:56,2019-12-30 09:16:06,"10,884s",PASSED
"test.Metodos.select2(findTestObject(""Object Repository/Generales/Select2/2.1.select_option_multi""), 1)",Firefox 71.0,,,2019-12-30 09:16:06,2019-12-30 09:16:18,"11,266s",PASSED
"elementSelect = test.Metodos.select2_config(findTestObject(""2.Planes de Accion/Generales/1.Index/1.1.Crear/4.Element_select""))",Firefox 71.0,,,2019-12-30 09:16:18,2019-12-30 09:16:19,"1,370s",PASSED
"selectOptionByValue(findTestObject(""2.Planes de Accion/Generales/1.Index/1.1.Crear/5.select_type""), elementSelect.toString(), true)",Firefox 71.0,,,2019-12-30 09:16:19,2019-12-30 09:16:21,"1,494s",PASSED
"getNumberOfTotalOption(findTestObject(""2.Planes de Accion/Generales/1.Index/1.1.Crear/4.Element_select""))",Firefox 71.0,,,2019-12-30 09:16:21,2019-12-30 09:16:21,"0,615s",PASSED
"test.Metodos.tiny1(findTestObject(""2.Planes de Accion/Generales/1.Index/1.1.Crear/6.TinyMCE""), 0)",Firefox 71.0,,,2019-12-30 09:16:21,2019-12-30 09:16:22,"1,125s",PASSED
delay(5),Firefox 71.0,,,2019-12-30 09:16:22,2019-12-30 09:16:27,"5,004s",PASSED
"test.Metodos.tiny1(findTestObject(""2.Planes de Accion/Generales/1.Index/1.1.Crear/6.TinyMCE""), 1)",Firefox 71.0,,,2019-12-30 09:16:27,2019-12-30 09:16:28,"1,054s",PASSED
delay(5),Firefox 71.0,,,2019-12-30 09:16:28,2019-12-30 09:16:33,"5,005s",PASSED
"selectOptionByValue(findTestObject(""2.Planes de Accion/Generales/1.Index/1.1.Crear/7.select_track_freq""), ""4"", true)",Firefox 71.0,,,2019-12-30 09:16:33,2019-12-30 09:16:34,"1,109s",PASSED
"setText(findTestObject(""2.Planes de Accion/Generales/1.Index/1.1.Crear/8.input_num_periods""), ""1"")",Firefox 71.0,,,2019-12-30 09:16:34,2019-12-30 09:16:35,"0,481s",PASSED
"selectOptionByValue(findTestObject(""2.Planes de Accion/Generales/1.Index/1.1.Crear/9.select_criticality_id""), ""21"", true)",Firefox 71.0,,,2019-12-30 09:16:35,2019-12-30 09:16:38,"2,681s",PASSED
"test.Metodos.display_list_multi(findTestObject(""Object Repository/Generales/Select2/1.1.display_list_multi""), 2)",Firefox 71.0,,,2019-12-30 09:16:38,2019-12-30 09:16:48,"10,633s",PASSED
"test.Metodos.select2(findTestObject(""Object Repository/Generales/Select2/2.select_option""), 0)",Firefox 71.0,,,2019-12-30 09:16:48,2019-12-30 09:16:59,"11,109s",PASSED
"test.Metodos.display_list_multi(findTestObject(""Object Repository/Generales/Select2/1.1.display_list_multi""), 5)",Firefox 71.0,,,2019-12-30 09:16:59,2019-12-30 09:17:10,"10,590s",PASSED
delay(5),Firefox 71.0,,,2019-12-30 09:17:10,2019-12-30 09:17:15,"5,004s",PASSED
"test.Metodos.select2(findTestObject(""Object Repository/Generales/Select2/2.select_option""), 0)",Firefox 71.0,,,2019-12-30 09:17:15,2019-12-30 09:17:26,"11,088s",PASSED
"test.Metodos.display_list_multi(findTestObject(""Object Repository/Generales/Select2/1.1.display_list_multi""), 6)",Firefox 71.0,,,2019-12-30 09:17:26,2019-12-30 09:17:37,"10,643s",PASSED
"test.Metodos.select2(findTestObject(""Object Repository/Generales/Select2/2.select_option""), 0)",Firefox 71.0,,,2019-12-30 09:17:37,2019-12-30 09:17:48,"11,084s",PASSED
"test.Metodos.display_list_multi(findTestObject(""Object Repository/Generales/Select2/1.1.display_list_multi""), 7)",Firefox 71.0,,,2019-12-30 09:17:48,2019-12-30 09:17:58,"10,601s",PASSED
"test.Metodos.select2(findTestObject(""Object Repository/Generales/Select2/2.select_option""), 0)",Firefox 71.0,,,2019-12-30 09:17:58,2019-12-30 09:18:09,"11,050s",PASSED
"test.Metodos.display_list_multi(findTestObject(""Object Repository/Generales/Select2/1.1.display_list_multi""), 8)",Firefox 71.0,,,2019-12-30 09:18:09,2019-12-30 09:18:20,"10,604s",PASSED
"test.Metodos.select2(findTestObject(""Object Repository/Generales/Select2/2.select_option""), 0)",Firefox 71.0,,,2019-12-30 09:18:20,2019-12-30 09:18:31,"11,042s",PASSED
delay(5),Firefox 71.0,,,2019-12-30 09:18:31,2019-12-30 09:18:26,,PASSED
"click(findTestObject(""2.Planes de Accion/Generales/1.Index/1.1.Crear/10.btn_Save""))",Firefox 71.0,,,2019-12-30 09:18:26,2019-12-30 09:18:32,"5,363s",PASSED
,,,,,,,
Test Cases/2.Planes de Accion/Generales/1.Index/1.1.Gestion del Plan/2.Agregar Accion,Firefox 71.0,,,2019-12-30 09:18:32,2019-12-30 09:20:15,"1m - 43,822s",PASSED
"callTestCase(findTestCase(""2.Planes de Accion/Daruma/Acceso al modulo""), [:])",Firefox 71.0,,,2019-12-30 09:18:32,2019-12-30 09:19:34,"1m - 1,751s",PASSED
"id = test.Metodos.lista(findTestObject(""Object Repository/2.list_inputCheck""))",Firefox 71.0,,,2019-12-30 09:19:34,2019-12-30 09:19:38,"3,869s",PASSED
"test.Metodos.select_item_managment(findTestObject(""Generales/Select Item List/1.list_index""), id)",Firefox 71.0,,,2019-12-30 09:19:38,2019-12-30 09:19:39,"1,487s",PASSED
delay(5),Firefox 71.0,,,2019-12-30 09:19:39,2019-12-30 09:19:44,"5,003s",PASSED
"click(findTestObject(""2.Planes de Accion/Generales/1.Index/1.Gestion del Plan/1.Analisis/1.btn_option_more""))",Firefox 71.0,,,2019-12-30 09:19:44,2019-12-30 09:19:49,"4,658s",PASSED
"click(findTestObject(""2.Planes de Accion/Generales/1.Index/1.Gestion del Plan/1.Analisis/2.btn_analyze""))",Firefox 71.0,,,2019-12-30 09:19:49,2019-12-30 09:19:51,"1,873s",PASSED
"test.Metodos.tiny1(findTestObject(""Object Repository/Generales/TinyMCE/Iframe""), 0)",Firefox 71.0,,,2019-12-30 09:19:51,2019-12-30 09:19:55,"3,949s",PASSED
"click(findTestObject(""2.Planes de Accion/Generales/1.Index/1.Gestion del Plan/1.Analisis/3.btn_Save""))",Firefox 71.0,,,2019-12-30 09:19:55,2019-12-30 09:19:55,"0,801s",PASSED
delay(5),Firefox 71.0,,,2019-12-30 09:19:55,2019-12-30 09:20:00,"5,002s",PASSED
"selectOptionByValue(findTestObject(""2.Planes de Accion/Generales/1.Index/1.Gestion del Plan/1.Analisis/4.select_cause_effect""), ""2"", false)",Firefox 71.0,,,2019-12-30 09:20:00,2019-12-30 09:20:01,"0,828s",PASSED
"click(findTestObject(""2.Planes de Accion/Generales/1.Index/1.Gestion del Plan/1.Analisis/5.inputCheck_add_actions""))",Firefox 71.0,,,2019-12-30 09:20:01,2019-12-30 09:20:02,"0,548s",PASSED
"click(findTestObject(""2.Planes de Accion/Generales/1.Index/1.Gestion del Plan/1.Analisis/3.btn_Save""))",Firefox 71.0,,,2019-12-30 09:20:02,2019-12-30 09:20:02,"0,566s",PASSED
"test.Metodos.tiny1(findTestObject(""Object Repository/Generales/TinyMCE/Iframe""), 0)",Firefox 71.0,,,2019-12-30 09:20:02,2019-12-30 09:20:09,"6,931s",PASSED
"selectOptionByValue(findTestObject(""2.Planes de Accion/Generales/1.Index/1.Gestion del Plan/1.Analisis/6.select_action_type""), ""1"", true)",Firefox 71.0,,,2019-12-30 09:20:09,2019-12-30 09:20:10,"1,016s",PASSED
"selectOptionByValue(findTestObject(""2.Planes de Accion/Generales/1.Index/1.Gestion del Plan/1.Analisis/7.select_end_date_month""), ""12"", true)",Firefox 71.0,,,2019-12-30 09:20:10,2019-12-30 09:20:11,"1,077s",PASSED
"selectOptionByValue(findTestObject(""2.Planes de Accion/Generales/1.Index/1.Gestion del Plan/1.Analisis/8.select_end_date_day""), ""31"", true)",Firefox 71.0,,,2019-12-30 09:20:11,2019-12-30 09:20:13,"1,802s",PASSED
"setText(findTestObject(""Object Repository/2.Planes de Accion/Generales/1.Index/1.Gestion del Plan/1.Analisis/9.input_initial_budget""), ""5000000"")",Firefox 71.0,,,2019-12-30 09:20:13,2019-12-30 09:20:14,"0,392s",PASSED
"setText(findTestObject(""Object Repository/2.Planes de Accion/Generales/1.Index/1.Gestion del Plan/1.Analisis/10.input_investment_budget""), ""5100000"")",Firefox 71.0,,,2019-12-30 09:20:14,2019-12-30 09:20:14,"0,378s",PASSED
"setText(findTestObject(""Object Repository/2.Planes de Accion/Generales/1.Index/1.Gestion del Plan/1.Analisis/11.input_operating_budget""), ""4800000"")",Firefox 71.0,,,2019-12-30 09:20:14,2019-12-30 09:20:14,"0,346s",PASSED
"click(findTestObject(""2.Planes de Accion/Generales/1.Index/1.Gestion del Plan/1.Analisis/12.inputCheck_exclude_consolidate""))",Firefox 71.0,,,2019-12-30 09:20:14,2019-12-30 09:20:15,"0,515s",PASSED
"click(findTestObject(""2.Planes de Accion/Generales/1.Index/1.Gestion del Plan/1.Analisis/3.btn_Save""))",Firefox 71.0,,,2019-12-30 09:20:15,2019-12-30 09:20:15,"0,551s",PASSED
,,,,,,,
Test Cases/2.Planes de Accion/Generales/1.Index/1.1.Gestion del Plan/6.Solicitar aprobacion del plan,Firefox 71.0,,,2019-12-30 09:20:15,2019-12-30 09:21:19,"1m - 3,772s",PASSED
"callTestCase(findTestCase(""2.Planes de Accion/Daruma/Acceso al modulo""), [:])",Firefox 71.0,,,2019-12-30 09:20:16,2019-12-30 09:21:04,"48,853s",PASSED
"id = test.Metodos.lista(findTestObject(""Object Repository/2.list_inputCheck""))",Firefox 71.0,,,2019-12-30 09:21:04,2019-12-30 09:21:08,"3,864s",PASSED
"test.Metodos.select_item_managment(findTestObject(""Generales/Select Item List/1.list_index""), id)",Firefox 71.0,,,2019-12-30 09:21:08,2019-12-30 09:21:10,"1,529s",PASSED
delay(8),Firefox 71.0,,,2019-12-30 09:21:10,2019-12-30 09:21:18,"8,003s",PASSED
"click(findTestObject(""2.Planes de Accion/Generales/1.Index/1.Gestion del Plan/6.Solicitar Plan de Accion/1.btn_option_more""))",Firefox 71.0,,,2019-12-30 09:21:18,2019-12-30 09:21:18,"0,548s",PASSED
"click(findTestObject(""Object Repository/2.Planes de Accion/Generales/1.Index/1.Gestion del Plan/6.Solicitar Plan de Accion/2.btn_ask_for_approval""))",Firefox 71.0,,,2019-12-30 09:21:18,2019-12-30 09:21:19,"0,612s",PASSED
acceptAlert(),Firefox 71.0,,,2019-12-30 09:21:19,2019-12-30 09:21:19,"0,082s",PASSED
,,,,,,,
Test Cases/2.Planes de Accion/Generales/1.Index/1.1.Gestion del Plan/7.Ejecutar Acciones,Firefox 71.0,,,2019-12-30 09:21:19,2019-12-30 09:22:35,"1m - 15,711s",PASSED
"callTestCase(findTestCase(""2.Planes de Accion/Daruma/Acceso al modulo""), [:])",Firefox 71.0,,,2019-12-30 09:21:20,2019-12-30 09:22:09,"49,300s",PASSED
"id = test.Metodos.lista(findTestObject(""Object Repository/2.list_inputCheck""))",Firefox 71.0,,,2019-12-30 09:22:09,2019-12-30 09:22:13,"3,820s",PASSED
"test.Metodos.select_item_managment(findTestObject(""Generales/Select Item List/1.list_index""), id)",Firefox 71.0,,,2019-12-30 09:22:13,2019-12-30 09:22:14,"1,490s",PASSED
delay(8),Firefox 71.0,,,2019-12-30 09:22:14,2019-12-30 09:22:22,"8,002s",PASSED
"test.Metodos.select_items_actions(""#action-list-table > tbody > tr > td > a"")",Firefox 71.0,,,2019-12-30 09:22:22,2019-12-30 09:22:23,"0,477s",PASSED
delay(5),Firefox 71.0,,,2019-12-30 09:22:23,2019-12-30 09:22:28,"5,003s",PASSED
"test.Metodos.select2_multiselect(findTestObject(""Object Repository/2.Planes de Accion/Generales/1.Index/1.Gestion del Plan/7.Crear Tareas del Plan de Accion/1.add_list""), 0)",Firefox 71.0,,,2019-12-30 09:22:28,2019-12-30 09:22:28,"0,521s",PASSED
"enter = findWebElement(findTestObject(""Object Repository/2.Planes de Accion/Generales/1.Index/1.Gestion del Plan/7.Crear Tareas del Plan de Accion/2.input_task_list_name""), 5)",Firefox 71.0,,,2019-12-30 09:22:28,2019-12-30 09:22:29,"0,281s",PASSED
enter.sendKeys(ENTER),Firefox 71.0,,,2019-12-30 09:22:29,2019-12-30 09:22:29,"0,044s",PASSED
delay(5),Firefox 71.0,,,2019-12-30 09:22:29,2019-12-30 09:22:34,"5,003s",PASSED
"test.Metodos.select2_multiselect(findTestObject(""Object Repository/2.Planes de Accion/Generales/1.Index/1.Gestion del Plan/7.Crear Tareas del Plan de Accion/1.add_list""), 1)",Firefox 71.0,,,2019-12-30 09:22:34,2019-12-30 09:22:34,"0,544s",PASSED
"setText(findTestObject(""Object Repository/2.Planes de Accion/Generales/1.Index/1.Gestion del Plan/7.Crear Tareas del Plan de Accion/4.input_task_notes""), ""Una tarea..."")",Firefox 71.0,,,2019-12-30 09:22:34,2019-12-30 09:22:35,"0,364s",PASSED
"enter2 = findWebElement(findTestObject(""Object Repository/2.Planes de Accion/Generales/1.Index/1.Gestion del Plan/7.Crear Tareas del Plan de Accion/4.input_task_notes""), 5)",Firefox 71.0,,,2019-12-30 09:22:35,2019-12-30 09:22:35,"0,283s",PASSED
enter2.sendKeys(ENTER),Firefox 71.0,,,2019-12-30 09:22:35,2019-12-30 09:22:35,"0,019s",PASSED
,,,,,,,
Test Cases/2.Planes de Accion/Generales/1.Index/1.1.Gestion del Plan/8.Aprobar acciones,Firefox 71.0,,,2019-12-30 09:22:35,2019-12-30 09:23:49,"1m - 13,726s",PASSED
"callTestCase(findTestCase(""2.Planes de Accion/Daruma/Acceso al modulo""), [:])",Firefox 71.0,,,2019-12-30 09:22:35,2019-12-30 09:23:24,"48,892s",PASSED
"id = test.Metodos.lista(findTestObject(""Object Repository/2.list_inputCheck""))",Firefox 71.0,,,2019-12-30 09:23:24,2019-12-30 09:23:28,"3,837s",PASSED
"test.Metodos.select_item_managment(findTestObject(""Generales/Select Item List/1.list_index""), id)",Firefox 71.0,,,2019-12-30 09:23:28,2019-12-30 09:23:29,"1,422s",PASSED
delay(8),Firefox 71.0,,,2019-12-30 09:23:29,2019-12-30 09:23:37,"8,003s",PASSED
"test.Metodos.select_items_actions(""#action-list-table > tbody > tr > td > a"")",Firefox 71.0,,,2019-12-30 09:23:37,2019-12-30 09:23:38,"0,483s",PASSED
delay(5),Firefox 71.0,,,2019-12-30 09:23:38,2019-12-30 09:23:43,"5,004s",PASSED
"test.Metodos.selectItem_taskState(findTestObject(""Object Repository/2.Planes de Accion/Generales/1.Index/1.Gestion del Plan/8.Aprobar Acciones/2.inputCheck_task_state""))",Firefox 71.0,,,2019-12-30 09:23:43,2019-12-30 09:23:46,"3,716s",PASSED
"click(findTestObject(""Object Repository/2.Planes de Accion/Generales/1.Index/1.Gestion del Plan/8.Aprobar Acciones/3.btn_return_actionPlan""))",Firefox 71.0,,,2019-12-30 09:23:46,2019-12-30 09:23:49,"2,094s",PASSED
,,,,,,,
Test Cases/2.Planes de Accion/Generales/1.Index/1.1.Gestion del Plan/16.Seguir Accion,Firefox 71.0,,,2019-12-30 09:23:49,2019-12-30 09:25:19,"1m - 30,309s",PASSED
"callTestCase(findTestCase(""2.Planes de Accion/Daruma/Acceso al modulo""), [:])",Firefox 71.0,,,2019-12-30 09:23:49,2019-12-30 09:24:40,"51,105s",PASSED
"id = test.Metodos.lista(findTestObject(""Object Repository/2.list_inputCheck""))",Firefox 71.0,,,2019-12-30 09:24:40,2019-12-30 09:24:44,"3,851s",PASSED
"test.Metodos.select_item_managment(findTestObject(""Generales/Select Item List/1.list_index""), id)",Firefox 71.0,,,2019-12-30 09:24:44,2019-12-30 09:24:45,"1,509s",PASSED
delay(10),Firefox 71.0,,,2019-12-30 09:24:45,2019-12-30 09:24:55,"10,004s",PASSED
"test.Metodos.select_items_actions(""#action-list-table > tbody > tr > td > a"")",Firefox 71.0,,,2019-12-30 09:24:55,2019-12-30 09:24:56,"0,468s",PASSED
delay(5),Firefox 71.0,,,2019-12-30 09:24:56,2019-12-30 09:25:01,"5,002s",PASSED
"click(findTestObject(""2.Planes de Accion/Generales/1.Index/1.Gestion del Plan/16.Seguir Accion/btn_conclude action""))",Firefox 71.0,,,2019-12-30 09:25:01,2019-12-30 09:25:02,"0,910s",PASSED
delay(5),Firefox 71.0,,,2019-12-30 09:25:02,2019-12-30 09:25:07,"5,004s",PASSED
"test.Metodos.tiny1(findTestObject(""Object Repository/Generales/TinyMCE/Iframe""), 0)",Firefox 71.0,,,2019-12-30 09:25:07,2019-12-30 09:25:08,"0,912s",PASSED
"selectOptionByValue(findTestObject(""2.Planes de Accion/Generales/1.Index/1.Gestion del Plan/16.Seguir Accion/select1""), ""100"", true)",Firefox 71.0,,,2019-12-30 09:25:08,2019-12-30 09:25:11,"3,788s",PASSED
"click(findTestObject(""2.Planes de Accion/Generales/1.Index/1.Gestion del Plan/16.Seguir Accion/button_save""))",Firefox 71.0,,,2019-12-30 09:25:11,2019-12-30 09:25:12,"0,813s",PASSED
delay(5),Firefox 71.0,,,2019-12-30 09:25:12,2019-12-30 09:25:17,"5,003s",PASSED
"click(findTestObject(""2.Planes de Accion/Generales/1.Index/1.Gestion del Plan/16.Seguir Accion/a_return""))",Firefox 71.0,,,2019-12-30 09:25:17,2019-12-30 09:25:19,"1,694s",PASSED
,,,,,,,
Test Cases/2.Planes de Accion/Generales/1.Index/1.1.Gestion del Plan/17.Concluir Accion,Firefox 71.0,,,2019-12-30 09:25:19,2019-12-30 09:26:28,"1m - 9,225s",PASSED
"callTestCase(findTestCase(""2.Planes de Accion/Daruma/Acceso al modulo""), [:])",Firefox 71.0,,,2019-12-30 09:25:19,2019-12-30 09:26:08,"48,163s",PASSED
"id = test.Metodos.lista(findTestObject(""Object Repository/2.list_inputCheck""))",Firefox 71.0,,,2019-12-30 09:26:08,2019-12-30 09:26:11,"3,834s",PASSED
"test.Metodos.select_item_managment(findTestObject(""Generales/Select Item List/1.list_index""), id)",Firefox 71.0,,,2019-12-30 09:26:11,2019-12-30 09:26:13,"1,509s",PASSED
delay(5),Firefox 71.0,,,2019-12-30 09:26:13,2019-12-30 09:26:18,"5,003s",PASSED
"test.Metodos.select_items_actions(""#action-list-table > tbody > tr > td > a"")",Firefox 71.0,,,2019-12-30 09:26:18,2019-12-30 09:26:19,"0,520s",PASSED
"click(findTestObject(""2.Planes de Accion/Generales/1.Index/1.Gestion del Plan/17.Concluir Accion/1.Conclude_ActionF""))",Firefox 71.0,,,2019-12-30 09:26:19,2019-12-30 09:26:23,"4,523s",PASSED
"test.Metodos.tiny1(findTestObject(""Object Repository/Generales/TinyMCE/Iframe""), 0)",Firefox 71.0,,,2019-12-30 09:26:23,2019-12-30 09:26:27,"4,375s",PASSED
"click(findTestObject(""2.Planes de Accion/Generales/1.Index/1.Gestion del Plan/17.Concluir Accion/5.Button""))",Firefox 71.0,,,2019-12-30 09:26:27,2019-12-30 09:26:28,"0,761s",PASSED
,,,,,,,
Test Cases/2.Planes de Accion/Generales/1.Index/1.1.Gestion del Plan/14.Seguimiento Accion,Firefox 71.0,,,2019-12-30 09:26:28,2019-12-30 09:27:41,"1m - 12,410s",PASSED
"callTestCase(findTestCase(""2.Planes de Accion/Daruma/Acceso al modulo""), [:])",Firefox 71.0,,,2019-12-30 09:26:28,2019-12-30 09:27:16,"47,501s",PASSED
"id = test.Metodos.lista(findTestObject(""Object Repository/2.list_inputCheck""))",Firefox 71.0,,,2019-12-30 09:27:16,2019-12-30 09:27:20,"3,815s",PASSED
"test.Metodos.select_item_managment(findTestObject(""Generales/Select Item List/1.list_index""), id)",Firefox 71.0,,,2019-12-30 09:27:20,2019-12-30 09:27:21,"1,343s",PASSED
delay(10),Firefox 71.0,,,2019-12-30 09:27:21,2019-12-30 09:27:31,"10,002s",PASSED
"click(findTestObject(""2.Planes de Accion/Generales/1.Index/1.Gestion del Plan/14.Seguimiento Accion/1.Seguimiento""))",Firefox 71.0,,,2019-12-30 09:27:31,2019-12-30 09:27:32,"0,575s",PASSED
"test.Metodos.tiny1(findTestObject(""Object Repository/Generales/TinyMCE/Iframe""), 0)",Firefox 71.0,,,2019-12-30 09:27:32,2019-12-30 09:27:39,"7,558s",PASSED
"click(findTestObject(""Object Repository/2.Planes de Accion/Generales/1.Index/1.Gestion del Plan/14.Seguimiento Accion/input2""))",Firefox 71.0,,,2019-12-30 09:27:39,2019-12-30 09:27:40,"0,814s",PASSED
"click(findTestObject(""Object Repository/2.Planes de Accion/Generales/1.Index/1.Gestion del Plan/14.Seguimiento Accion/input_Return2""))",Firefox 71.0,,,2019-12-30 09:27:40,2019-12-30 09:27:41,"0,568s",PASSED
,,,,,,,
Test Cases/2.Planes de Accion/Generales/1.Index/1.1.Gestion del Plan/13.Concluir plan de accion,Firefox 71.0,,,2019-12-30 09:27:41,2019-12-30 09:28:48,"1m - 6,891s",PASSED
"callTestCase(findTestCase(""2.Planes de Accion/Daruma/Acceso al modulo""), [:])",Firefox 71.0,,,2019-12-30 09:27:41,2019-12-30 09:28:28,"47,629s",PASSED
"id = test.Metodos.lista(findTestObject(""Object Repository/2.list_inputCheck""))",Firefox 71.0,,,2019-12-30 09:28:28,2019-12-30 09:28:32,"3,820s",PASSED
"test.Metodos.select_item_managment(findTestObject(""Generales/Select Item List/1.list_index""), id)",Firefox 71.0,,,2019-12-30 09:28:32,2019-12-30 09:28:34,"1,533s",PASSED
delay(5),Firefox 71.0,,,2019-12-30 09:28:34,2019-12-30 09:28:39,"5,003s",PASSED
"click(findTestObject(""2.Planes de Accion/Generales/1.Index/1.Gestion del Plan/13.Concluir Plan de Accion/1.Conclude_Action""))",Firefox 71.0,,,2019-12-30 09:28:39,2019-12-30 09:28:39,"0,643s",PASSED
"click(findTestObject(""2.Planes de Accion/Generales/1.Index/1.Gestion del Plan/13.Concluir Plan de Accion/2.Input_Objetive_plan""))",Firefox 71.0,,,2019-12-30 09:28:39,2019-12-30 09:28:43,"3,180s",PASSED
"click(findTestObject(""2.Planes de Accion/Generales/1.Index/1.Gestion del Plan/13.Concluir Plan de Accion/3.Efectivo_plan_action""))",Firefox 71.0,,,2019-12-30 09:28:43,2019-12-30 09:28:43,"0,759s",PASSED
"test.Metodos.tiny1(findTestObject(""Object Repository/Generales/TinyMCE/Iframe""), 0)",Firefox 71.0,,,2019-12-30 09:28:43,2019-12-30 09:28:44,"0,959s",PASSED
"setText(findTestObject(""2.Planes de Accion/Generales/1.Index/1.Gestion del Plan/13.Concluir Plan de Accion/4.Textarea""), ""prueba katalon"")",Firefox 71.0,,,2019-12-30 09:28:44,2019-12-30 09:28:47,"2,436s",PASSED
"click(findTestObject(""2.Planes de Accion/Generales/1.Index/1.Gestion del Plan/13.Concluir Plan de Accion/5.Button""))",Firefox 71.0,,,2019-12-30 09:28:47,2019-12-30 09:28:48,"0,712s",PASSED
