Suite/Test/Step Name,Browser,Description,Tag,Start time,End time,Duration,Status
Impactos,Firefox 71.0,,,2019-12-19 11:21:34,2019-12-19 11:28:27,"6m - 53,580s",FAILED
,,,,,,,
Test Cases/2.Planes de Accion/Configuracion/5.Impactos/1.Test Cases General/0.Ver,Firefox 71.0,,,2019-12-19 11:21:34,2019-12-19 11:22:28,"54,158s",PASSED
"callTestCase(findTestCase(""2.Planes de Accion/Daruma/Acceso al modulo""), [:])",Firefox 71.0,,,2019-12-19 11:21:35,2019-12-19 11:22:22,"47,179s",PASSED
"click(findTestObject(""2.Planes de Accion/Configuracion/5.Impactos/1.Generales/0.Ver/1.a_Configuration""))",Firefox 71.0,,,2019-12-19 11:22:22,2019-12-19 11:22:22,"0,636s",PASSED
"click(findTestObject(""2.Planes de Accion/Configuracion/5.Impactos/1.Generales/0.Ver/2.a_Impactos""))",Firefox 71.0,,,2019-12-19 11:22:22,2019-12-19 11:22:23,"0,692s",PASSED
delay(5),Firefox 71.0,,,2019-12-19 11:22:23,2019-12-19 11:22:28,"5,004s",PASSED
,,,,,,,
Test Cases/2.Planes de Accion/Configuracion/5.Impactos/1.Test Cases General/1.Crear,Firefox 71.0,,,2019-12-19 11:22:28,2019-12-19 11:23:30,"1m - 1,944s",PASSED
palabra = test.Metodos.randomString(),Firefox 71.0,,,2019-12-19 11:22:29,2019-12-19 11:22:29,"0,075s",PASSED
"callTestCase(findTestCase(""2.Planes de Accion/Daruma/Acceso al modulo""), [:])",Firefox 71.0,,,2019-12-19 11:22:29,2019-12-19 11:23:14,"44,913s",PASSED
"click(findTestObject(""2.Planes de Accion/Configuracion/5.Impactos/1.Generales/0.Ver/1.a_Configuration""))",Firefox 71.0,,,2019-12-19 11:23:14,2019-12-19 11:23:14,"0,566s",PASSED
"click(findTestObject(""2.Planes de Accion/Configuracion/5.Impactos/1.Generales/0.Ver/2.a_Impactos""))",Firefox 71.0,,,2019-12-19 11:23:14,2019-12-19 11:23:15,"0,774s",PASSED
delay(5),Firefox 71.0,,,2019-12-19 11:23:15,2019-12-19 11:23:20,"5,003s",PASSED
"click(findTestObject(""2.Planes de Accion/Configuracion/5.Impactos/1.Generales/1.Crear/1.btn_Create""))",Firefox 71.0,,,2019-12-19 11:23:20,2019-12-19 11:23:21,"0,613s",PASSED
"setText(findTestObject(""2.Planes de Accion/Configuracion/5.Impactos/1.Generales/1.Crear/2.input_impactname""), palabra)",Firefox 71.0,,,2019-12-19 11:23:21,2019-12-19 11:23:24,"3,478s",PASSED
"setText(findTestObject(""2.Planes de Accion/Configuracion/5.Impactos/1.Generales/1.Crear/3.textarea_impactnotes""), ""Esto es una Descripcion..."")",Firefox 71.0,,,2019-12-19 11:23:24,2019-12-19 11:23:24,"0,417s",PASSED
"click(findTestObject(""2.Planes de Accion/Configuracion/5.Impactos/1.Generales/1.Crear/4.btn_Save""))",Firefox 71.0,,,2019-12-19 11:23:24,2019-12-19 11:23:25,"0,666s",PASSED
delay(5),Firefox 71.0,,,2019-12-19 11:23:25,2019-12-19 11:23:30,"5,004s",PASSED
,,,,,,,
Test Cases/2.Planes de Accion/Configuracion/5.Impactos/1.Test Cases General/2.Editar,Firefox 71.0,,,2019-12-19 11:23:30,2019-12-19 11:25:12,"1m - 41,783s",FAILED
palabra = test.Metodos.randomStringEdit(),Firefox 71.0,,,2019-12-19 11:23:30,2019-12-19 11:23:30,"0,002s",PASSED
"callTestCase(findTestCase(""2.Planes de Accion/Daruma/Acceso al modulo""), [:])",Firefox 71.0,,,2019-12-19 11:23:30,2019-12-19 11:24:16,"45,797s",PASSED
"test.Metodos.lista(findTestObject(""Object Repository/2.list_inputCheck""))",Firefox 71.0,,,2019-12-19 11:24:16,2019-12-19 11:24:20,"4,040s",PASSED
"click(findTestObject(""2.Planes de Accion/Configuracion/5.Impactos/1.Generales/2.Editar/2.btn_Edit""))",Firefox 71.0,,,2019-12-19 11:24:20,2019-12-19 11:24:21,"1,049s",PASSED
"setText(findTestObject(""2.Planes de Accion/Configuracion/5.Impactos/1.Generales/2.Editar/3.input_impactname""), palabra)",Firefox 71.0,,,2019-12-19 11:24:21,2019-12-19 11:25:12,"50,555s",FAILED
,,,,,,,
Test Cases/2.Planes de Accion/Configuracion/5.Impactos/1.Test Cases General/3.Eliminar,Firefox 71.0,,,2019-12-19 11:25:12,2019-12-19 11:26:06,"54,269s",FAILED
"callTestCase(findTestCase(""2.Planes de Accion/Daruma/Acceso al modulo""), [:])",Firefox 71.0,,,2019-12-19 11:25:12,2019-12-19 11:26:01,"48,176s",PASSED
"test.Metodos.lista(findTestObject(""Object Repository/2.list_inputCheck""))",Firefox 71.0,,,2019-12-19 11:26:01,2019-12-19 11:26:04,"3,902s",PASSED
"click(findTestObject(""2.Planes de Accion/Configuracion/5.Impactos/1.Generales/3.Eliminar/2.btn_Delete""))",Firefox 71.0,,,2019-12-19 11:26:04,2019-12-19 11:26:05,"0,854s",PASSED
acceptAlert(),Firefox 71.0,,,2019-12-19 11:26:05,2019-12-19 11:26:06,"0,908s",FAILED
,,,,,,,
Test Cases/2.Planes de Accion/Configuracion/5.Impactos/1.Test Cases General/4.Inhabilitar,Firefox 71.0,,,2019-12-19 11:26:06,2019-12-19 11:26:58,"52,207s",FAILED
"callTestCase(findTestCase(""2.Planes de Accion/Daruma/Acceso al modulo""), [:])",Firefox 71.0,,,2019-12-19 11:26:07,2019-12-19 11:26:52,"45,456s",PASSED
"test.Metodos.lista(findTestObject(""Object Repository/2.list_inputCheck""))",Firefox 71.0,,,2019-12-19 11:26:52,2019-12-19 11:26:56,"3,966s",PASSED
"click(findTestObject(""2.Planes de Accion/Configuracion/5.Impactos/1.Generales/4.Inhabilitar/2.btn_Disable_1""))",Firefox 71.0,,,2019-12-19 11:26:56,2019-12-19 11:26:57,"0,812s",PASSED
"click(findTestObject(""2.Planes de Accion/Configuracion/5.Impactos/1.Generales/4.Inhabilitar/3.btn_Disable_2""))",Firefox 71.0,,,2019-12-19 11:26:57,2019-12-19 11:26:57,"0,557s",PASSED
acceptAlert(),Firefox 71.0,,,2019-12-19 11:26:57,2019-12-19 11:26:58,"0,973s",FAILED
,,,,,,,
Test Cases/2.Planes de Accion/Configuracion/5.Impactos/1.Test Cases General/5.Filtrar,Firefox 71.0,,,2019-12-19 11:26:58,2019-12-19 11:28:27,"1m - 28,663s",FAILED
"callTestCase(findTestCase(""2.Planes de Accion/Daruma/Acceso al modulo""), [:])",Firefox 71.0,,,2019-12-19 11:26:59,2019-12-19 11:27:44,"45,558s",PASSED
"click(findTestObject(""2.Planes de Accion/Configuracion/5.Impactos/1.Generales/5.Filtrar/1.open_filter""))",Firefox 71.0,,,2019-12-19 11:27:44,2019-12-19 11:28:27,"42,584s",FAILED
