Suite/Test/Step Name,Browser,Description,Tag,Start time,End time,Duration,Status
1.Tipos de Opinion_SAC,Firefox 71.0,,,2020-01-09 10:06:18,2020-01-09 10:14:53,"8m - 34,554s",PASSED
,,,,,,,
Test Cases/5.SAC/Configuracion/1.Tipos de opinion/1.Test Case Generales/0.Ver,Firefox 71.0,,,2020-01-09 10:06:19,2020-01-09 10:07:12,"53,268s",PASSED
"callTestCase(findTestCase(""5.SAC/Daruma/Acceso al modulo""), [:])",Firefox 71.0,,,2020-01-09 10:06:19,2020-01-09 10:07:03,"43,936s",PASSED
"click(findTestObject(""5.SAC/Configuracion/1.Tipos de opinion/0.Ver/1.Configuration""))",Firefox 71.0,,,2020-01-09 10:07:03,2020-01-09 10:07:11,"8,037s",PASSED
"click(findTestObject(""5.SAC/Configuracion/1.Tipos de opinion/0.Ver/2.OpinionTypes""))",Firefox 71.0,,,2020-01-09 10:07:11,2020-01-09 10:07:12,"0,795s",PASSED
,,,,,,,
Test Cases/5.SAC/Configuracion/1.Tipos de opinion/1.Test Case Generales/1.Crear,Firefox 71.0,,,2020-01-09 10:07:12,2020-01-09 10:08:15,"1m - 3,036s",PASSED
palabra = test.Metodos.randomString(),Firefox 71.0,,,2020-01-09 10:07:12,2020-01-09 10:07:12,"0,062s",PASSED
"callTestCase(findTestCase(""5.SAC/Configuracion/1.Tipos de opinion/1.Test Case Generales/0.Ver""), [:])",Firefox 71.0,,,2020-01-09 10:07:12,2020-01-09 10:08:00,"48,057s",PASSED
delay(5),Firefox 71.0,,,2020-01-09 10:08:00,2020-01-09 10:08:05,"5,005s",PASSED
"click(findTestObject(""5.SAC/Configuracion/1.Tipos de opinion/1.Crear/create""))",Firefox 71.0,,,2020-01-09 10:08:05,2020-01-09 10:08:06,"0,598s",PASSED
"setText(findTestObject(""5.SAC/Configuracion/1.Tipos de opinion/1.Crear/input_typename""), palabra)",Firefox 71.0,,,2020-01-09 10:08:06,2020-01-09 10:08:12,"5,947s",PASSED
"selectOptionByValue(findTestObject(""5.SAC/Configuracion/1.Tipos de opinion/1.Crear/select_filters_state""), ""2"", true)",Firefox 71.0,,,2020-01-09 10:08:12,2020-01-09 10:08:13,"1,437s",PASSED
"setText(findTestObject(""5.SAC/Configuracion/1.Tipos de opinion/1.Crear/input_Ans""), ""10"")",Firefox 71.0,,,2020-01-09 10:08:13,2020-01-09 10:08:14,"0,565s",PASSED
"setText(findTestObject(""5.SAC/Configuracion/1.Tipos de opinion/1.Crear/textarea_Description""), ""descripcion prueba katalon"")",Firefox 71.0,,,2020-01-09 10:08:14,2020-01-09 10:08:14,"0,443s",PASSED
"click(findTestObject(""5.SAC/Configuracion/1.Tipos de opinion/1.Crear/btn_save""))",Firefox 71.0,,,2020-01-09 10:08:14,2020-01-09 10:08:15,"0,685s",PASSED
,,,,,,,
Test Cases/5.SAC/Configuracion/1.Tipos de opinion/1.Test Case Generales/2.Editar,Firefox 71.0,,,2020-01-09 10:08:15,2020-01-09 10:10:00,"1m - 44,692s",PASSED
palabra = test.Metodos.randomStringEdit(),Firefox 71.0,,,2020-01-09 10:08:16,2020-01-09 10:08:16,"0,003s",PASSED
"callTestCase(findTestCase(""5.SAC/Configuracion/1.Tipos de opinion/1.Test Case Generales/0.Ver""), [:])",Firefox 71.0,,,2020-01-09 10:08:16,2020-01-09 10:09:00,"44,578s",PASSED
delay(5),Firefox 71.0,,,2020-01-09 10:09:00,2020-01-09 10:09:05,"5,007s",PASSED
"test.Metodos.lista(findTestObject(""5.SAC/Configuracion/1.Tipos de opinion/2.Editar/1.list_inputCheck""))",Firefox 71.0,,,2020-01-09 10:09:05,2020-01-09 10:09:09,"3,960s",PASSED
"click(findTestObject(""5.SAC/Configuracion/1.Tipos de opinion/2.Editar/Edit""))",Firefox 71.0,,,2020-01-09 10:09:09,2020-01-09 10:09:10,"0,578s",PASSED
"setText(findTestObject(""5.SAC/Configuracion/2.Tipos de causas/2.Editar/input_Causa""), palabra)",Firefox 71.0,,,2020-01-09 10:09:10,2020-01-09 10:09:57,"47,215s",PASSED
"selectOptionByValue(findTestObject(""5.SAC/Configuracion/1.Tipos de opinion/2.Editar/select_filters_state""), ""3"", true)",Firefox 71.0,,,2020-01-09 10:09:57,2020-01-09 10:09:58,"1,320s",PASSED
"setText(findTestObject(""5.SAC/Configuracion/1.Tipos de opinion/2.Editar/input_ANS""), ""15"")",Firefox 71.0,,,2020-01-09 10:09:58,2020-01-09 10:09:59,"0,624s",PASSED
"setText(findTestObject(""5.SAC/Configuracion/1.Tipos de opinion/2.Editar/textarea_descripcion""), ""descripcion prueba katalon"")",Firefox 71.0,,,2020-01-09 10:09:59,2020-01-09 10:09:59,"0,398s",PASSED
"click(findTestObject(""5.SAC/Configuracion/1.Tipos de opinion/2.Editar/btn_save""))",Firefox 71.0,,,2020-01-09 10:09:59,2020-01-09 10:10:00,"0,625s",PASSED
,,,,,,,
Test Cases/5.SAC/Configuracion/1.Tipos de opinion/1.Test Case Generales/3.Eliminar,Firefox 71.0,,,2020-01-09 10:10:00,2020-01-09 10:10:55,"55,531s",PASSED
"callTestCase(findTestCase(""5.SAC/Configuracion/1.Tipos de opinion/1.Test Case Generales/0.Ver""), [:])",Firefox 71.0,,,2020-01-09 10:10:00,2020-01-09 10:10:46,"45,612s",PASSED
delay(5),Firefox 71.0,,,2020-01-09 10:10:46,2020-01-09 10:10:51,"5,007s",PASSED
"test.Metodos.lista(findTestObject(""5.SAC/Configuracion/1.Tipos de opinion/3.Eliminar/1.list_inputCheck""))",Firefox 71.0,,,2020-01-09 10:10:51,2020-01-09 10:10:55,"3,907s",PASSED
"click(findTestObject(""5.SAC/Configuracion/1.Tipos de opinion/3.Eliminar/Delete""))",Firefox 71.0,,,2020-01-09 10:10:55,2020-01-09 10:10:55,"0,540s",PASSED
acceptAlert(),Firefox 71.0,,,2020-01-09 10:10:55,2020-01-09 10:10:55,"0,092s",PASSED
,,,,,,,
Test Cases/5.SAC/Configuracion/1.Tipos de opinion/1.Test Case Generales/4.Inhabilitar,Firefox 71.0,,,2020-01-09 10:10:55,2020-01-09 10:11:54,"58,331s",PASSED
"callTestCase(findTestCase(""5.SAC/Configuracion/1.Tipos de opinion/1.Test Case Generales/0.Ver""), [:])",Firefox 71.0,,,2020-01-09 10:10:56,2020-01-09 10:11:44,"48,004s",PASSED
delay(5),Firefox 71.0,,,2020-01-09 10:11:44,2020-01-09 10:11:49,"5,006s",PASSED
"test.Metodos.lista(findTestObject(""5.SAC/Configuracion/1.Tipos de opinion/4.Inhabilitar/1.list_inputCheck""))",Firefox 71.0,,,2020-01-09 10:11:49,2020-01-09 10:11:53,"3,863s",PASSED
"click(findTestObject(""5.SAC/Configuracion/1.Tipos de opinion/4.Inhabilitar/1Btn_Disable""))",Firefox 71.0,,,2020-01-09 10:11:53,2020-01-09 10:11:53,"0,587s",PASSED
"click(findTestObject(""5.SAC/Configuracion/1.Tipos de opinion/4.Inhabilitar/2Btn_disable""))",Firefox 71.0,,,2020-01-09 10:11:53,2020-01-09 10:11:54,"0,441s",PASSED
acceptAlert(),Firefox 71.0,,,2020-01-09 10:11:54,2020-01-09 10:11:54,"0,090s",PASSED
,,,,,,,
Test Cases/5.SAC/Configuracion/1.Tipos de opinion/1.Test Case Generales/5.Filtrar,Firefox 71.0,,,2020-01-09 10:11:54,2020-01-09 10:12:49,"54,971s",PASSED
"callTestCase(findTestCase(""5.SAC/Configuracion/1.Tipos de opinion/1.Test Case Generales/0.Ver""), [:])",Firefox 71.0,,,2020-01-09 10:11:54,2020-01-09 10:12:41,"46,865s",PASSED
delay(5),Firefox 71.0,,,2020-01-09 10:12:41,2020-01-09 10:12:46,"5,003s",PASSED
"click(findTestObject(""5.SAC/Configuracion/1.Tipos de opinion/5.Filtrar/1.btn_Filter""))",Firefox 71.0,,,2020-01-09 10:12:46,2020-01-09 10:12:46,"0,584s",PASSED
"setText(findTestObject(""5.SAC/Configuracion/1.Tipos de opinion/5.Filtrar/input_OpinionType""), ""AGRADECIMIENTO"")",Firefox 71.0,,,2020-01-09 10:12:46,2020-01-09 10:12:47,"0,481s",PASSED
"selectOptionByValue(findTestObject(""Object Repository/5.SAC/Configuracion/1.Tipos de opinion/5.Filtrar/select_state""), ""1"", true)",Firefox 71.0,,,2020-01-09 10:12:47,2020-01-09 10:12:48,"1,212s",PASSED
"click(findTestObject(""Object Repository/5.SAC/Configuracion/1.Tipos de opinion/5.Filtrar/btn_filter""))",Firefox 71.0,,,2020-01-09 10:12:48,2020-01-09 10:12:49,"0,577s",PASSED
,,,,,,,
Test Cases/5.SAC/Configuracion/1.Tipos de opinion/1.Test Case Generales/6.Desfiltrar,Firefox 71.0,,,2020-01-09 10:12:49,2020-01-09 10:13:52,"1m - 3,363s",PASSED
"callTestCase(findTestCase(""5.SAC/Configuracion/1.Tipos de opinion/1.Test Case Generales/0.Ver""), [:])",Firefox 71.0,,,2020-01-09 10:12:49,2020-01-09 10:13:38,"49,075s",PASSED
delay(5),Firefox 71.0,,,2020-01-09 10:13:38,2020-01-09 10:13:43,"5,004s",PASSED
"click(findTestObject(""5.SAC/Configuracion/1.Tipos de opinion/6.Desfiltrar/1.btn_Filter""))",Firefox 71.0,,,2020-01-09 10:13:43,2020-01-09 10:13:44,"0,606s",PASSED
"setText(findTestObject(""5.SAC/Configuracion/1.Tipos de opinion/6.Desfiltrar/input_OpinionType""), ""AGRADECIMIENTO"")",Firefox 71.0,,,2020-01-09 10:13:44,2020-01-09 10:13:44,"0,419s",PASSED
"selectOptionByValue(findTestObject(""5.SAC/Configuracion/1.Tipos de opinion/6.Desfiltrar/select_state""), ""1"", true)",Firefox 71.0,,,2020-01-09 10:13:44,2020-01-09 10:13:45,"1,221s",PASSED
"click(findTestObject(""5.SAC/Configuracion/1.Tipos de opinion/6.Desfiltrar/btn_filter""))",Firefox 71.0,,,2020-01-09 10:13:45,2020-01-09 10:13:46,"0,552s",PASSED
delay(5),Firefox 71.0,,,2020-01-09 10:13:46,2020-01-09 10:13:51,"5,007s",PASSED
"click(findTestObject(""5.SAC/Configuracion/1.Tipos de opinion/6.Desfiltrar/2.btn_Filter""))",Firefox 71.0,,,2020-01-09 10:13:51,2020-01-09 10:13:52,"0,665s",PASSED
"click(findTestObject(""5.SAC/Configuracion/1.Tipos de opinion/6.Desfiltrar/a_Restablecer""))",Firefox 71.0,,,2020-01-09 10:13:52,2020-01-09 10:13:52,"0,578s",PASSED
,,,,,,,
Test Cases/5.SAC/Configuracion/1.Tipos de opinion/1.Test Case Generales/7.Mostrar,Firefox 71.0,,,2020-01-09 10:13:52,2020-01-09 10:14:53,"1m - 0,694s",PASSED
"callTestCase(findTestCase(""5.SAC/Configuracion/1.Tipos de opinion/1.Test Case Generales/0.Ver""), [:])",Firefox 71.0,,,2020-01-09 10:13:52,2020-01-09 10:14:38,"46,009s",PASSED
delay(5),Firefox 71.0,,,2020-01-09 10:14:38,2020-01-09 10:14:43,"5,005s",PASSED
"test.Metodos.lista(findTestObject(""Object Repository/2.list_inputCheck""))",Firefox 71.0,,,2020-01-09 10:14:43,2020-01-09 10:14:47,"3,805s",PASSED
delay(5),Firefox 71.0,,,2020-01-09 10:14:47,2020-01-09 10:14:52,"5,007s",PASSED
"click(findTestObject(""5.SAC/Configuracion/1.Tipos de opinion/7.Mostrar/7.Show""))",Firefox 71.0,,,2020-01-09 10:14:52,2020-01-09 10:14:53,"0,606s",PASSED
