Suite/Test/Step Name,Browser,Description,Tag,Start time,End time,Duration,Status
2.Tipos de Causas_SAC,Firefox 71.0,,,2020-01-09 11:32:15,2020-01-09 11:41:20,"9m - 5,492s",ERROR
,,,,,,,
Test Cases/5.SAC/Configuracion/2.Tipos de causas/1.Test Case Generales/0.Ver,Firefox 71.0,,,2020-01-09 11:32:15,2020-01-09 11:33:16,"1m - 0,625s",PASSED
"callTestCase(findTestCase(""5.SAC/Daruma/Acceso al modulo""), [:])",Firefox 71.0,,,2020-01-09 11:32:16,2020-01-09 11:33:04,"48,206s",PASSED
"click(findTestObject(""5.SAC/Configuracion/2.Tipos de causas/0.Ver/1.Configuration""))",Firefox 71.0,,,2020-01-09 11:33:04,2020-01-09 11:33:10,"6,354s",PASSED
delay(5),Firefox 71.0,,,2020-01-09 11:33:10,2020-01-09 11:33:15,"5,006s",PASSED
"click(findTestObject(""5.SAC/Configuracion/2.Tipos de causas/0.Ver/a_Tipos de causas""))",Firefox 71.0,,,2020-01-09 11:33:15,2020-01-09 11:33:16,"0,624s",PASSED
,,,,,,,
Test Cases/5.SAC/Configuracion/2.Tipos de causas/1.Test Case Generales/1.Crear,Firefox 71.0,,,2020-01-09 11:33:16,2020-01-09 11:34:25,"1m - 9,443s",PASSED
palabra = test.Metodos.randomString(),Firefox 71.0,,,2020-01-09 11:33:16,2020-01-09 11:33:16,"0,046s",PASSED
"callTestCase(findTestCase(""5.SAC/Configuracion/2.Tipos de causas/1.Test Case Generales/0.Ver""), [:])",Firefox 71.0,,,2020-01-09 11:33:16,2020-01-09 11:34:15,"58,636s",PASSED
delay(5),Firefox 71.0,,,2020-01-09 11:34:15,2020-01-09 11:34:20,"5,001s",PASSED
"click(findTestObject(""5.SAC/Configuracion/2.Tipos de causas/1.Crear/create""))",Firefox 71.0,,,2020-01-09 11:34:20,2020-01-09 11:34:20,"0,570s",PASSED
"setText(findTestObject(""5.SAC/Configuracion/2.Tipos de causas/1.Crear/input_Causa""), palabra)",Firefox 71.0,,,2020-01-09 11:34:20,2020-01-09 11:34:24,"3,720s",PASSED
"setText(findTestObject(""5.SAC/Configuracion/2.Tipos de causas/1.Crear/textarea_Descripcion""), "" descripcion causa prueba"")",Firefox 71.0,,,2020-01-09 11:34:24,2020-01-09 11:34:25,"0,460s",PASSED
"click(findTestObject(""5.SAC/Configuracion/2.Tipos de causas/1.Crear/btn_save""))",Firefox 71.0,,,2020-01-09 11:34:25,2020-01-09 11:34:25,"0,719s",PASSED
,,,,,,,
Test Cases/5.SAC/Configuracion/2.Tipos de causas/1.Test Case Generales/2.Editar,Firefox 71.0,,,2020-01-09 11:34:25,2020-01-09 11:35:26,"1m - 0,389s",ERROR
palabra = test.Metodos.randomStringEdit(),Firefox 71.0,,,2020-01-09 11:34:26,2020-01-09 11:34:26,"0,002s",PASSED
"callTestCase(findTestCase(""5.SAC/Configuracion/2.Tipos de causas/1.Test Case Generales/0.Ver""), [:])",Firefox 71.0,,,2020-01-09 11:34:26,2020-01-09 11:35:17,"50,950s",PASSED
delay(5),Firefox 71.0,,,2020-01-09 11:35:17,2020-01-09 11:35:22,"5,004s",PASSED
"test.Metodos.lista(findTestObject(""5.SAC/Configuracion/2.Tipos de causas/2.Editar/list_inputCheck""))",Firefox 71.0,,,2020-01-09 11:35:22,2020-01-09 11:35:26,"3,971s",PASSED
"click(findTestObject(""5.SAC/Configuracion/2.Tipos de causas/2.Editar/Edit""), palabra)",Firefox 71.0,,,2020-01-09 11:35:26,2020-01-09 11:35:26,"0,082s",PASSED
,,,,,,,
Test Cases/5.SAC/Configuracion/2.Tipos de causas/1.Test Case Generales/3.Eliminar,Firefox 71.0,,,2020-01-09 11:35:26,2020-01-09 11:36:25,"59,558s",PASSED
"callTestCase(findTestCase(""5.SAC/Configuracion/2.Tipos de causas/1.Test Case Generales/0.Ver""), [:])",Firefox 71.0,,,2020-01-09 11:35:26,2020-01-09 11:36:16,"49,897s",PASSED
delay(5),Firefox 71.0,,,2020-01-09 11:36:16,2020-01-09 11:36:21,"5,012s",PASSED
"test.Metodos.lista(findTestObject(""5.SAC/Configuracion/2.Tipos de causas/3.Eliminar/1.list_inputCheck""))",Firefox 71.0,,,2020-01-09 11:36:21,2020-01-09 11:36:25,"3,854s",PASSED
"click(findTestObject(""5.SAC/Configuracion/2.Tipos de causas/3.Eliminar/Delete""))",Firefox 71.0,,,2020-01-09 11:36:25,2020-01-09 11:36:25,"0,470s",PASSED
acceptAlert(),Firefox 71.0,,,2020-01-09 11:36:25,2020-01-09 11:36:25,"0,077s",PASSED
,,,,,,,
Test Cases/5.SAC/Configuracion/2.Tipos de causas/1.Test Case Generales/4.Inhabilitar,Firefox 71.0,,,2020-01-09 11:36:25,2020-01-09 11:37:39,"1m - 13,877s",PASSED
"callTestCase(findTestCase(""5.SAC/Configuracion/2.Tipos de causas/1.Test Case Generales/0.Ver""), [:])",Firefox 71.0,,,2020-01-09 11:36:26,2020-01-09 11:37:27,"1m - 1,682s",PASSED
delay(5),Firefox 71.0,,,2020-01-09 11:37:27,2020-01-09 11:37:32,"5,009s",PASSED
"test.Metodos.lista(findTestObject(""5.SAC/Configuracion/2.Tipos de causas/4.Inhabilitar/1.list_inputCheck""))",Firefox 71.0,,,2020-01-09 11:37:32,2020-01-09 11:37:36,"3,818s",PASSED
"click(findTestObject(""5.SAC/Configuracion/2.Tipos de causas/4.Inhabilitar/1Btn_Disable""))",Firefox 71.0,,,2020-01-09 11:37:36,2020-01-09 11:37:39,"2,545s",PASSED
"click(findTestObject(""5.SAC/Configuracion/2.Tipos de causas/4.Inhabilitar/2Btn_disable""))",Firefox 71.0,,,2020-01-09 11:37:39,2020-01-09 11:37:39,"0,386s",PASSED
acceptAlert(),Firefox 71.0,,,2020-01-09 11:37:39,2020-01-09 11:37:39,"0,060s",PASSED
,,,,,,,
Test Cases/5.SAC/Configuracion/2.Tipos de causas/1.Test Case Generales/5.Filtrar,Firefox 71.0,,,2020-01-09 11:37:39,2020-01-09 11:38:56,"1m - 16,664s",PASSED
"callTestCase(findTestCase(""5.SAC/Configuracion/2.Tipos de causas/1.Test Case Generales/0.Ver""), [:])",Firefox 71.0,,,2020-01-09 11:37:39,2020-01-09 11:38:44,"1m - 4,842s",PASSED
delay(5),Firefox 71.0,,,2020-01-09 11:38:44,2020-01-09 11:38:49,"5,003s",PASSED
"click(findTestObject(""5.SAC/Configuracion/2.Tipos de causas/5.Filtrar/1.btn_Filter""))",Firefox 71.0,,,2020-01-09 11:38:49,2020-01-09 11:38:50,"0,585s",PASSED
"setText(findTestObject(""5.SAC/Configuracion/2.Tipos de causas/5.Filtrar/input_Causa_opinion""), ""Otros"")",Firefox 71.0,,,2020-01-09 11:38:50,2020-01-09 11:38:50,"0,355s",PASSED
"click(findTestObject(""5.SAC/Configuracion/2.Tipos de causas/5.Filtrar/btn_filter""))",Firefox 71.0,,,2020-01-09 11:38:50,2020-01-09 11:38:51,"0,620s",PASSED
delay(5),Firefox 71.0,,,2020-01-09 11:38:51,2020-01-09 11:38:56,"5,004s",PASSED
,,,,,,,
Test Cases/5.SAC/Configuracion/2.Tipos de causas/1.Test Case Generales/6.Desfiltrar,Firefox 71.0,,,2020-01-09 11:38:56,2020-01-09 11:40:01,"1m - 4,977s",PASSED
"callTestCase(findTestCase(""5.SAC/Configuracion/2.Tipos de causas/1.Test Case Generales/0.Ver""), [:])",Firefox 71.0,,,2020-01-09 11:38:56,2020-01-09 11:39:47,"50,632s",PASSED
delay(5),Firefox 71.0,,,2020-01-09 11:39:47,2020-01-09 11:39:52,"5,006s",PASSED
"click(findTestObject(""5.SAC/Configuracion/2.Tipos de causas/6.Desfiltrar/1.btn_Filter""))",Firefox 71.0,,,2020-01-09 11:39:52,2020-01-09 11:39:52,"0,607s",PASSED
"setText(findTestObject(""5.SAC/Configuracion/2.Tipos de causas/6.Desfiltrar/input_Causa_opinion""), ""Otros"")",Firefox 71.0,,,2020-01-09 11:39:52,2020-01-09 11:39:53,"0,383s",PASSED
"click(findTestObject(""5.SAC/Configuracion/2.Tipos de causas/6.Desfiltrar/btn_filter""))",Firefox 71.0,,,2020-01-09 11:39:53,2020-01-09 11:39:53,"0,655s",PASSED
delay(5),Firefox 71.0,,,2020-01-09 11:39:53,2020-01-09 11:39:58,"5,004s",PASSED
"click(findTestObject(""5.SAC/Configuracion/2.Tipos de causas/6.Desfiltrar/1.btn_Filter""))",Firefox 71.0,,,2020-01-09 11:39:58,2020-01-09 11:40:00,"1,880s",PASSED
"click(findTestObject(""5.SAC/Configuracion/2.Tipos de causas/6.Desfiltrar/a_Restablecer""))",Firefox 71.0,,,2020-01-09 11:40:00,2020-01-09 11:40:01,"0,592s",PASSED
,,,,,,,
Test Cases/5.SAC/Configuracion/2.Tipos de causas/1.Test Case Generales/7.Mostrar,Firefox 71.0,,,2020-01-09 11:40:01,2020-01-09 11:41:20,"1m - 19,174s",PASSED
"callTestCase(findTestCase(""5.SAC/Configuracion/2.Tipos de causas/1.Test Case Generales/0.Ver""), [:])",Firefox 71.0,,,2020-01-09 11:40:01,2020-01-09 11:41:06,"1m - 4,451s",PASSED
delay(5),Firefox 71.0,,,2020-01-09 11:41:06,2020-01-09 11:41:11,"5,006s",PASSED
"test.Metodos.lista(findTestObject(""Object Repository/2.list_inputCheck""))",Firefox 71.0,,,2020-01-09 11:41:11,2020-01-09 11:41:14,"3,777s",PASSED
delay(5),Firefox 71.0,,,2020-01-09 11:41:14,2020-01-09 11:41:19,"5,006s",PASSED
"click(findTestObject(""5.SAC/Configuracion/2.Tipos de causas/7.Mostrar/7.Show""))",Firefox 71.0,,,2020-01-09 11:41:19,2020-01-09 11:41:20,"0,639s",PASSED
