Suite/Test/Step Name,Browser,Description,Tag,Start time,End time,Duration,Status
9.Informes-Reporte_Estad\u00EDsticas por planes_Filtro,Firefox 71.0,,,2020-01-02 17:26:52,2020-01-02 17:28:16,"1m - 23,891s",PASSED
,,,,,,,
Test Cases/2.Planes de Accion/Generales/5.Informes/9.Informes-Reporte_Estad\u00EDsticas por planes_Filtro,Firefox 71.0,,,2020-01-02 17:26:52,2020-01-02 17:28:16,"1m - 23,382s",PASSED
"callTestCase(findTestCase(""2.Planes de Accion/Daruma/Acceso al modulo""), [:])",Firefox 71.0,,,2020-01-02 17:26:53,2020-01-02 17:27:41,"48,022s",PASSED
delay(6),Firefox 71.0,,,2020-01-02 17:27:41,2020-01-02 17:27:47,"6,012s",PASSED
"click(findTestObject(""2.Planes de Accion/Daruma/Acceso al modulo/5.Open_Reports""))",Firefox 71.0,,,2020-01-02 17:27:47,2020-01-02 17:27:48,"0,672s",PASSED
"click(findTestObject(""2.Planes de Accion/Generales/4.Informes/5.Informes-Reporte_Estadísticas por planes/1.estadisticas por planes""))",Firefox 71.0,,,2020-01-02 17:27:48,2020-01-02 17:27:54,"6,660s",PASSED
"switchToWindowUrl(""http://52.11.126.234/app.php/staff/actionplan/indexReportState"")",Firefox 71.0,,,2020-01-02 17:27:54,2020-01-02 17:27:56,"1,911s",PASSED
delay(6),Firefox 71.0,,,2020-01-02 17:27:56,2020-01-02 17:28:02,"6,007s",PASSED
"click(findTestObject(""2.Planes de Accion/Generales/4.Informes/9.Informes-Reporte_Estadísticas por planes_Filtro/2.filter""))",Firefox 71.0,,,2020-01-02 17:28:02,2020-01-02 17:28:03,"0,669s",PASSED
delay(5),Firefox 71.0,,,2020-01-02 17:28:03,2020-01-02 17:28:08,"5,004s",PASSED
"elementSelect = test.Metodos.select2_config(findTestObject(""2.Planes de Accion/Generales/4.Informes/9.Informes-Reporte_Estadísticas por planes_Filtro/4.Element_select""))",Firefox 71.0,,,2020-01-02 17:28:08,2020-01-02 17:28:09,"1,648s",PASSED
"selectOptionByValue(findTestObject(""2.Planes de Accion/Generales/4.Informes/9.Informes-Reporte_Estadísticas por planes_Filtro/4.Element_select""), elementSelect.toString(), true)",Firefox 71.0,,,2020-01-02 17:28:09,2020-01-02 17:28:11,"1,657s",PASSED
"click(findTestObject(""2.Planes de Accion/Generales/4.Informes/9.Informes-Reporte_Estadísticas por planes_Filtro/5input_btn_save""))",Firefox 71.0,,,2020-01-02 17:28:11,2020-01-02 17:28:16,"4,466s",PASSED
