Suite/Test/Step Name,Browser,Description,Tag,Start time,End time,Duration,Status
20.Listado de Maestros,Firefox 71.0,,,2019-12-30 14:48:10,2019-12-30 14:49:07,"56,805s",PASSED
,,,,,,,
Test Cases/2.Planes de Accion/Generales/1.Index/1.1.Gestion del Plan/20.Listado Maestros,Firefox 71.0,,,2019-12-30 14:48:11,2019-12-30 14:49:07,"56,319s",PASSED
"callTestCase(findTestCase(""2.Planes de Accion/Daruma/Acceso al modulo""), [:])",Firefox 71.0,,,2019-12-30 14:48:11,2019-12-30 14:49:01,"50,198s",PASSED
delay(5),Firefox 71.0,,,2019-12-30 14:49:01,2019-12-30 14:49:06,"5,011s",PASSED
"click(findTestObject(""2.Planes de Accion/Generales/1.Index/1.Gestion del Plan/20.Listado Maestros/1.open_all""))",Firefox 71.0,,,2019-12-30 14:49:06,2019-12-30 14:49:07,"0,641s",PASSED
