Suite/Test/Step Name,Browser,Description,Tag,Start time,End time,Duration,Status
3.Informe Reporte General por Acciones Excel,Firefox 71.0,,,2020-01-02 16:29:15,2020-01-02 16:30:37,"1m - 21,738s",PASSED
,,,,,,,
Test Cases/2.Planes de Accion/Generales/5.Informes/3.Informe Reporte General por Acciones Excel,Firefox 71.0,,,2020-01-02 16:29:16,2020-01-02 16:30:37,"1m - 21,110s",PASSED
"callTestCase(findTestCase(""2.Planes de Accion/Daruma/Acceso al modulo""), [:])",Firefox 71.0,,,2020-01-02 16:29:17,2020-01-02 16:30:03,"46,109s",PASSED
delay(6),Firefox 71.0,,,2020-01-02 16:30:03,2020-01-02 16:30:09,"6,010s",PASSED
"click(findTestObject(""2.Planes de Accion/Daruma/Acceso al modulo/5.Open_Reports""))",Firefox 71.0,,,2020-01-02 16:30:09,2020-01-02 16:30:10,"0,592s",PASSED
"click(findTestObject(""2.Planes de Accion/Generales/4.Informes/1.Informes por acciones_filtro/1.General_informes""))",Firefox 71.0,,,2020-01-02 16:30:10,2020-01-02 16:30:19,"8,932s",PASSED
"switchToWindowUrl(""http://52.11.126.234/app.php/staff/actionplan/viewReportByGeneral"")",Firefox 71.0,,,2020-01-02 16:30:19,2020-01-02 16:30:20,"1,375s",PASSED
delay(6),Firefox 71.0,,,2020-01-02 16:30:20,2020-01-02 16:30:26,"6,004s",PASSED
"click(findTestObject(""2.Planes de Accion/Generales/4.Informes/3.Informe Por acciones Excel/1.Excel""))",Firefox 71.0,,,2020-01-02 16:30:26,2020-01-02 16:30:32,"5,607s",PASSED
"click(findTestObject(""Object Repository/2.Planes de Accion/Generales/4.Informes/3.Informe Por acciones Excel/Prueba enter/td_Todos""))",Firefox 71.0,,,2020-01-02 16:30:32,2020-01-02 16:30:32,"0,556s",PASSED
delay(5),Firefox 71.0,,,2020-01-02 16:30:32,2020-01-02 16:30:37,"5,008s",PASSED
