Suite/Test/Step Name,Browser,Description,Tag,Start time,End time,Duration,Status
21.Eliminar Accion,Firefox 71.0,,,2019-12-30 15:37:29,2019-12-30 15:45:34,"8m - 5,789s",FAILED
,,,,,,,
Test Cases/2.Planes de Accion/Generales/1.Index/1.Crear Plan de Accion,Firefox 71.0,,,2019-12-30 15:37:29,2019-12-30 15:42:08,"4m - 38,403s",PASSED
"callTestCase(findTestCase(""2.Planes de Accion/Daruma/Acceso al modulo""), [:])",Firefox 71.0,,,2019-12-30 15:37:30,2019-12-30 15:38:19,"49,258s",PASSED
"click(findTestObject(""2.Planes de Accion/Generales/1.Index/1.1.Crear/1.btn_Create""))",Firefox 71.0,,,2019-12-30 15:38:19,2019-12-30 15:38:20,"0,686s",PASSED
delay(5),Firefox 71.0,,,2019-12-30 15:38:20,2019-12-30 15:38:25,"5,005s",PASSED
"test.Metodos.display_list_only(findTestObject(""Generales/Select2/1.display_list_only""), 0)",Firefox 71.0,,,2019-12-30 15:38:25,2019-12-30 15:38:38,"12,895s",PASSED
"test.Metodos.element_selected(findTestObject(""Object Repository/Generales/Select2/2.select_option""), 1)",Firefox 71.0,,,2019-12-30 15:38:38,2019-12-30 15:38:45,"7,046s",PASSED
"test.Metodos.display_list_only(findTestObject(""Generales/Select2/1.display_list_only""), 1)",Firefox 71.0,,,2019-12-30 15:38:45,2019-12-30 15:38:56,"11,043s",PASSED
"test.Metodos.element_selected(findTestObject(""Object Repository/Generales/Select2/2.select_option""), 1)",Firefox 71.0,,,2019-12-30 15:38:56,2019-12-30 15:39:03,"7,095s",PASSED
"test.Metodos.display_list_multi(findTestObject(""Object Repository/Generales/Select2/1.1.display_list_multi""), 0)",Firefox 71.0,,,2019-12-30 15:39:03,2019-12-30 15:39:14,"10,674s",PASSED
"test.Metodos.select2(findTestObject(""Object Repository/Generales/Select2/2.select_option""), 0)",Firefox 71.0,,,2019-12-30 15:39:14,2019-12-30 15:39:25,"11,091s",PASSED
"click(findTestObject(""2.Planes de Accion/Generales/1.Index/1.1.Crear/3.Origenes""))",Firefox 71.0,,,2019-12-30 15:39:25,2019-12-30 15:39:26,"1,052s",PASSED
"test.Metodos.display_list_multi(findTestObject(""Object Repository/Generales/Select2/1.1.display_list_multi""), 1)",Firefox 71.0,,,2019-12-30 15:39:26,2019-12-30 15:39:37,"10,808s",PASSED
"test.Metodos.select2(findTestObject(""Object Repository/Generales/Select2/2.1.select_option_multi""), 1)",Firefox 71.0,,,2019-12-30 15:39:37,2019-12-30 15:39:48,"11,113s",PASSED
"elementSelect = test.Metodos.select2_config(findTestObject(""2.Planes de Accion/Generales/1.Index/1.1.Crear/4.Element_select""))",Firefox 71.0,,,2019-12-30 15:39:48,2019-12-30 15:39:49,"1,378s",PASSED
"selectOptionByValue(findTestObject(""2.Planes de Accion/Generales/1.Index/1.1.Crear/5.select_type""), elementSelect.toString(), true)",Firefox 71.0,,,2019-12-30 15:39:49,2019-12-30 15:39:51,"1,529s",PASSED
"getNumberOfTotalOption(findTestObject(""2.Planes de Accion/Generales/1.Index/1.1.Crear/4.Element_select""))",Firefox 71.0,,,2019-12-30 15:39:51,2019-12-30 15:39:51,"0,557s",PASSED
"test.Metodos.tiny1(findTestObject(""2.Planes de Accion/Generales/1.Index/1.1.Crear/6.TinyMCE""), 0)",Firefox 71.0,,,2019-12-30 15:39:51,2019-12-30 15:39:52,"1,092s",PASSED
delay(5),Firefox 71.0,,,2019-12-30 15:39:52,2019-12-30 15:39:57,"5,004s",PASSED
"test.Metodos.tiny1(findTestObject(""2.Planes de Accion/Generales/1.Index/1.1.Crear/6.TinyMCE""), 1)",Firefox 71.0,,,2019-12-30 15:39:57,2019-12-30 15:39:58,"0,989s",PASSED
delay(5),Firefox 71.0,,,2019-12-30 15:39:58,2019-12-30 15:40:03,"5,003s",PASSED
"selectOptionByValue(findTestObject(""2.Planes de Accion/Generales/1.Index/1.1.Crear/7.select_track_freq""), ""4"", true)",Firefox 71.0,,,2019-12-30 15:40:03,2019-12-30 15:40:04,"1,007s",PASSED
"setText(findTestObject(""2.Planes de Accion/Generales/1.Index/1.1.Crear/8.input_num_periods""), ""1"")",Firefox 71.0,,,2019-12-30 15:40:04,2019-12-30 15:40:05,"0,441s",PASSED
"selectOptionByValue(findTestObject(""2.Planes de Accion/Generales/1.Index/1.1.Crear/9.select_criticality_id""), ""21"", true)",Firefox 71.0,,,2019-12-30 15:40:05,2019-12-30 15:40:07,"2,646s",PASSED
"test.Metodos.display_list_multi(findTestObject(""Object Repository/Generales/Select2/1.1.display_list_multi""), 2)",Firefox 71.0,,,2019-12-30 15:40:07,2019-12-30 15:40:19,"11,691s",PASSED
"test.Metodos.select2(findTestObject(""Object Repository/Generales/Select2/2.select_option""), 0)",Firefox 71.0,,,2019-12-30 15:40:19,2019-12-30 15:40:30,"11,085s",PASSED
"test.Metodos.display_list_multi(findTestObject(""Object Repository/Generales/Select2/1.1.display_list_multi""), 5)",Firefox 71.0,,,2019-12-30 15:40:30,2019-12-30 15:40:41,"10,874s",PASSED
delay(5),Firefox 71.0,,,2019-12-30 15:40:41,2019-12-30 15:40:46,"5,005s",PASSED
"test.Metodos.select2(findTestObject(""Object Repository/Generales/Select2/2.select_option""), 0)",Firefox 71.0,,,2019-12-30 15:40:46,2019-12-30 15:40:57,"11,052s",PASSED
"test.Metodos.display_list_multi(findTestObject(""Object Repository/Generales/Select2/1.1.display_list_multi""), 6)",Firefox 71.0,,,2019-12-30 15:40:57,2019-12-30 15:41:08,"10,588s",PASSED
"test.Metodos.select2(findTestObject(""Object Repository/Generales/Select2/2.select_option""), 0)",Firefox 71.0,,,2019-12-30 15:41:08,2019-12-30 15:41:19,"11,043s",PASSED
"test.Metodos.display_list_multi(findTestObject(""Object Repository/Generales/Select2/1.1.display_list_multi""), 7)",Firefox 71.0,,,2019-12-30 15:41:19,2019-12-30 15:41:29,"10,578s",PASSED
"test.Metodos.select2(findTestObject(""Object Repository/Generales/Select2/2.select_option""), 0)",Firefox 71.0,,,2019-12-30 15:41:29,2019-12-30 15:41:40,"11,037s",PASSED
"test.Metodos.display_list_multi(findTestObject(""Object Repository/Generales/Select2/1.1.display_list_multi""), 8)",Firefox 71.0,,,2019-12-30 15:41:40,2019-12-30 15:41:51,"10,616s",PASSED
"test.Metodos.select2(findTestObject(""Object Repository/Generales/Select2/2.select_option""), 0)",Firefox 71.0,,,2019-12-30 15:41:51,2019-12-30 15:42:02,"11,054s",PASSED
delay(5),Firefox 71.0,,,2019-12-30 15:42:02,2019-12-30 15:42:07,"5,006s",PASSED
"click(findTestObject(""2.Planes de Accion/Generales/1.Index/1.1.Crear/10.btn_Save""))",Firefox 71.0,,,2019-12-30 15:42:07,2019-12-30 15:42:08,"0,585s",PASSED
,,,,,,,
Test Cases/2.Planes de Accion/Generales/1.Index/1.1.Gestion del Plan/2.Agregar Accion,Firefox 71.0,,,2019-12-30 15:42:08,2019-12-30 15:43:47,"1m - 39,698s",PASSED
"callTestCase(findTestCase(""2.Planes de Accion/Daruma/Acceso al modulo""), [:])",Firefox 71.0,,,2019-12-30 15:42:08,2019-12-30 15:43:09,"1m - 1,425s",PASSED
"id = test.Metodos.lista(findTestObject(""Object Repository/2.list_inputCheck""))",Firefox 71.0,,,2019-12-30 15:43:09,2019-12-30 15:43:13,"3,864s",PASSED
"test.Metodos.select_item_managment(findTestObject(""Generales/Select Item List/1.list_index""), id)",Firefox 71.0,,,2019-12-30 15:43:13,2019-12-30 15:43:15,"1,559s",PASSED
delay(5),Firefox 71.0,,,2019-12-30 15:43:15,2019-12-30 15:43:20,"5,003s",PASSED
"click(findTestObject(""2.Planes de Accion/Generales/1.Index/1.Gestion del Plan/1.Analisis/1.btn_option_more""))",Firefox 71.0,,,2019-12-30 15:43:20,2019-12-30 15:43:21,"1,019s",PASSED
"click(findTestObject(""2.Planes de Accion/Generales/1.Index/1.Gestion del Plan/1.Analisis/2.btn_analyze""))",Firefox 71.0,,,2019-12-30 15:43:21,2019-12-30 15:43:22,"0,767s",PASSED
"test.Metodos.tiny1(findTestObject(""Object Repository/Generales/TinyMCE/Iframe""), 0)",Firefox 71.0,,,2019-12-30 15:43:22,2019-12-30 15:43:25,"3,950s",PASSED
"click(findTestObject(""2.Planes de Accion/Generales/1.Index/1.Gestion del Plan/1.Analisis/3.btn_Save""))",Firefox 71.0,,,2019-12-30 15:43:25,2019-12-30 15:43:28,"2,531s",PASSED
delay(5),Firefox 71.0,,,2019-12-30 15:43:28,2019-12-30 15:43:33,"5,004s",PASSED
"selectOptionByValue(findTestObject(""2.Planes de Accion/Generales/1.Index/1.Gestion del Plan/1.Analisis/4.select_cause_effect""), ""2"", false)",Firefox 71.0,,,2019-12-30 15:43:33,2019-12-30 15:43:34,"0,864s",PASSED
"click(findTestObject(""2.Planes de Accion/Generales/1.Index/1.Gestion del Plan/1.Analisis/5.inputCheck_add_actions""))",Firefox 71.0,,,2019-12-30 15:43:34,2019-12-30 15:43:34,"0,560s",PASSED
"click(findTestObject(""2.Planes de Accion/Generales/1.Index/1.Gestion del Plan/1.Analisis/3.btn_Save""))",Firefox 71.0,,,2019-12-30 15:43:34,2019-12-30 15:43:35,"0,612s",PASSED
"test.Metodos.tiny1(findTestObject(""Object Repository/Generales/TinyMCE/Iframe""), 0)",Firefox 71.0,,,2019-12-30 15:43:35,2019-12-30 15:43:41,"6,114s",PASSED
"selectOptionByValue(findTestObject(""2.Planes de Accion/Generales/1.Index/1.Gestion del Plan/1.Analisis/6.select_action_type""), ""1"", true)",Firefox 71.0,,,2019-12-30 15:43:41,2019-12-30 15:43:42,"1,061s",PASSED
"selectOptionByValue(findTestObject(""2.Planes de Accion/Generales/1.Index/1.Gestion del Plan/1.Analisis/7.select_end_date_month""), ""12"", true)",Firefox 71.0,,,2019-12-30 15:43:42,2019-12-30 15:43:43,"1,089s",PASSED
"selectOptionByValue(findTestObject(""2.Planes de Accion/Generales/1.Index/1.Gestion del Plan/1.Analisis/8.select_end_date_day""), ""31"", true)",Firefox 71.0,,,2019-12-30 15:43:43,2019-12-30 15:43:45,"1,698s",PASSED
"setText(findTestObject(""Object Repository/2.Planes de Accion/Generales/1.Index/1.Gestion del Plan/1.Analisis/9.input_initial_budget""), ""5000000"")",Firefox 71.0,,,2019-12-30 15:43:45,2019-12-30 15:43:45,"0,400s",PASSED
"setText(findTestObject(""Object Repository/2.Planes de Accion/Generales/1.Index/1.Gestion del Plan/1.Analisis/10.input_investment_budget""), ""5100000"")",Firefox 71.0,,,2019-12-30 15:43:45,2019-12-30 15:43:46,"0,351s",PASSED
"setText(findTestObject(""Object Repository/2.Planes de Accion/Generales/1.Index/1.Gestion del Plan/1.Analisis/11.input_operating_budget""), ""4800000"")",Firefox 71.0,,,2019-12-30 15:43:46,2019-12-30 15:43:46,"0,385s",PASSED
"click(findTestObject(""2.Planes de Accion/Generales/1.Index/1.Gestion del Plan/1.Analisis/12.inputCheck_exclude_consolidate""))",Firefox 71.0,,,2019-12-30 15:43:46,2019-12-30 15:43:47,"0,523s",PASSED
"click(findTestObject(""2.Planes de Accion/Generales/1.Index/1.Gestion del Plan/1.Analisis/3.btn_Save""))",Firefox 71.0,,,2019-12-30 15:43:47,2019-12-30 15:43:47,"0,587s",PASSED
,,,,,,,
Test Cases/2.Planes de Accion/Generales/1.Index/1.1.Gestion del Plan/21.Eliminar Accion,Firefox 71.0,,,2019-12-30 15:43:47,2019-12-30 15:45:34,"1m - 47,109s",FAILED
"callTestCase(findTestCase(""2.Planes de Accion/Daruma/Acceso al modulo""), [:])",Firefox 71.0,,,2019-12-30 15:43:48,2019-12-30 15:44:43,"54,977s",PASSED
"id = test.Metodos.lista(findTestObject(""Object Repository/2.list_inputCheck""))",Firefox 71.0,,,2019-12-30 15:44:43,2019-12-30 15:44:47,"3,836s",PASSED
"test.Metodos.select_item_managment(findTestObject(""Generales/Select Item List/1.list_index""), id)",Firefox 71.0,,,2019-12-30 15:44:47,2019-12-30 15:44:48,"1,478s",PASSED
"test.Metodos.select_items_actions(""#action-list-table > tbody > tr > td > a"")",Firefox 71.0,,,2019-12-30 15:44:48,2019-12-30 15:44:54,"6,187s",PASSED
"click(findTestObject(""2.Planes de Accion/Generales/1.Index/1.Gestion del Plan/21.Eliminar Accion/1.Options""))",Firefox 71.0,,,2019-12-30 15:44:54,2019-12-30 15:45:34,"40,111s",FAILED
