Suite/Test/Step Name,Browser,Description,Tag,Start time,End time,Duration,Status
2.Agregar Accion,Firefox 71.0,,,2019-12-27 09:56:13,2019-12-27 10:02:47,"6m - 34,004s",PASSED
,,,,,,,
Test Cases/2.Planes de Accion/Generales/1.Index/1.Crear Plan de Accion,Firefox 71.0,,,2019-12-27 09:56:14,2019-12-27 10:00:46,"4m - 31,886s",PASSED
"callTestCase(findTestCase(""2.Planes de Accion/Daruma/Acceso al modulo""), [:])",Firefox 71.0,,,2019-12-27 09:56:14,2019-12-27 09:56:59,"44,511s",PASSED
"click(findTestObject(""2.Planes de Accion/Generales/1.Index/1.1.Crear/1.btn_Create""))",Firefox 71.0,,,2019-12-27 09:56:59,2019-12-27 09:57:00,"0,649s",PASSED
delay(5),Firefox 71.0,,,2019-12-27 09:57:00,2019-12-27 09:57:05,"5,002s",PASSED
"test.Metodos.display_list_only(findTestObject(""Generales/Select2/1.display_list_only""), 0)",Firefox 71.0,,,2019-12-27 09:57:05,2019-12-27 09:57:16,"11,927s",PASSED
"test.Metodos.element_selected(findTestObject(""Object Repository/Generales/Select2/2.select_option""), 1)",Firefox 71.0,,,2019-12-27 09:57:16,2019-12-27 09:57:24,"7,070s",PASSED
"test.Metodos.display_list_only(findTestObject(""Generales/Select2/1.display_list_only""), 1)",Firefox 71.0,,,2019-12-27 09:57:24,2019-12-27 09:57:35,"11,055s",PASSED
"test.Metodos.element_selected(findTestObject(""Object Repository/Generales/Select2/2.select_option""), 1)",Firefox 71.0,,,2019-12-27 09:57:35,2019-12-27 09:57:42,"7,100s",PASSED
"test.Metodos.display_list_multi(findTestObject(""Object Repository/Generales/Select2/1.1.display_list_multi""), 0)",Firefox 71.0,,,2019-12-27 09:57:42,2019-12-27 09:57:52,"10,647s",PASSED
"test.Metodos.select2(findTestObject(""Object Repository/Generales/Select2/2.select_option""), 0)",Firefox 71.0,,,2019-12-27 09:57:52,2019-12-27 09:58:03,"11,122s",PASSED
"click(findTestObject(""2.Planes de Accion/Generales/1.Index/1.1.Crear/3.Origenes""))",Firefox 71.0,,,2019-12-27 09:58:03,2019-12-27 09:58:04,"0,916s",PASSED
"test.Metodos.display_list_multi(findTestObject(""Object Repository/Generales/Select2/1.1.display_list_multi""), 1)",Firefox 71.0,,,2019-12-27 09:58:04,2019-12-27 09:58:15,"10,858s",PASSED
"test.Metodos.select2(findTestObject(""Object Repository/Generales/Select2/2.1.select_option_multi""), 1)",Firefox 71.0,,,2019-12-27 09:58:15,2019-12-27 09:58:26,"11,097s",PASSED
"elementSelect = test.Metodos.select2_config(findTestObject(""2.Planes de Accion/Generales/1.Index/1.1.Crear/4.Element_select""))",Firefox 71.0,,,2019-12-27 09:58:26,2019-12-27 09:58:28,"1,239s",PASSED
"selectOptionByValue(findTestObject(""2.Planes de Accion/Generales/1.Index/1.1.Crear/5.select_type""), elementSelect.toString(), true)",Firefox 71.0,,,2019-12-27 09:58:28,2019-12-27 09:58:29,"1,548s",PASSED
"getNumberOfTotalOption(findTestObject(""2.Planes de Accion/Generales/1.Index/1.1.Crear/4.Element_select""))",Firefox 71.0,,,2019-12-27 09:58:29,2019-12-27 09:58:30,"0,588s",PASSED
"test.Metodos.tiny1(findTestObject(""2.Planes de Accion/Generales/1.Index/1.1.Crear/6.TinyMCE""), 0)",Firefox 71.0,,,2019-12-27 09:58:30,2019-12-27 09:58:31,"1,149s",PASSED
delay(5),Firefox 71.0,,,2019-12-27 09:58:31,2019-12-27 09:58:36,"5,002s",PASSED
"test.Metodos.tiny1(findTestObject(""2.Planes de Accion/Generales/1.Index/1.1.Crear/6.TinyMCE""), 1)",Firefox 71.0,,,2019-12-27 09:58:36,2019-12-27 09:58:37,"0,931s",PASSED
delay(5),Firefox 71.0,,,2019-12-27 09:58:37,2019-12-27 09:58:42,"5,005s",PASSED
"selectOptionByValue(findTestObject(""2.Planes de Accion/Generales/1.Index/1.1.Crear/7.select_track_freq""), ""4"", true)",Firefox 71.0,,,2019-12-27 09:58:42,2019-12-27 09:58:43,"1,104s",PASSED
"setText(findTestObject(""2.Planes de Accion/Generales/1.Index/1.1.Crear/8.input_num_periods""), ""1"")",Firefox 71.0,,,2019-12-27 09:58:43,2019-12-27 09:58:43,"0,548s",PASSED
"selectOptionByValue(findTestObject(""2.Planes de Accion/Generales/1.Index/1.1.Crear/9.select_criticality_id""), ""21"", true)",Firefox 71.0,,,2019-12-27 09:58:43,2019-12-27 09:58:45,"1,263s",PASSED
"test.Metodos.display_list_multi(findTestObject(""Object Repository/Generales/Select2/1.1.display_list_multi""), 2)",Firefox 71.0,,,2019-12-27 09:58:45,2019-12-27 09:58:55,"10,625s",PASSED
"test.Metodos.select2(findTestObject(""Object Repository/Generales/Select2/2.select_option""), 0)",Firefox 71.0,,,2019-12-27 09:58:55,2019-12-27 09:59:06,"11,103s",PASSED
"test.Metodos.display_list_multi(findTestObject(""Object Repository/Generales/Select2/1.1.display_list_multi""), 5)",Firefox 71.0,,,2019-12-27 09:59:06,2019-12-27 09:59:17,"10,596s",PASSED
delay(5),Firefox 71.0,,,2019-12-27 09:59:17,2019-12-27 09:59:22,"5,004s",PASSED
"test.Metodos.select2(findTestObject(""Object Repository/Generales/Select2/2.select_option""), 0)",Firefox 71.0,,,2019-12-27 09:59:22,2019-12-27 09:59:33,"11,083s",PASSED
"test.Metodos.display_list_multi(findTestObject(""Object Repository/Generales/Select2/1.1.display_list_multi""), 6)",Firefox 71.0,,,2019-12-27 09:59:33,2019-12-27 09:59:44,"10,604s",PASSED
"test.Metodos.select2(findTestObject(""Object Repository/Generales/Select2/2.select_option""), 0)",Firefox 71.0,,,2019-12-27 09:59:44,2019-12-27 09:59:55,"11,082s",PASSED
"test.Metodos.display_list_multi(findTestObject(""Object Repository/Generales/Select2/1.1.display_list_multi""), 7)",Firefox 71.0,,,2019-12-27 09:59:55,2019-12-27 10:00:05,"10,603s",PASSED
"test.Metodos.select2(findTestObject(""Object Repository/Generales/Select2/2.select_option""), 0)",Firefox 71.0,,,2019-12-27 10:00:05,2019-12-27 10:00:16,"11,027s",PASSED
"test.Metodos.display_list_multi(findTestObject(""Object Repository/Generales/Select2/1.1.display_list_multi""), 8)",Firefox 71.0,,,2019-12-27 10:00:16,2019-12-27 10:00:29,"12,393s",PASSED
"test.Metodos.select2(findTestObject(""Object Repository/Generales/Select2/2.select_option""), 0)",Firefox 71.0,,,2019-12-27 10:00:29,2019-12-27 10:00:40,"11,084s",PASSED
delay(5),Firefox 71.0,,,2019-12-27 10:00:40,2019-12-27 10:00:45,"5,004s",PASSED
"click(findTestObject(""2.Planes de Accion/Generales/1.Index/1.1.Crear/10.btn_Save""))",Firefox 71.0,,,2019-12-27 10:00:45,2019-12-27 10:00:46,"0,573s",PASSED
,,,,,,,
Test Cases/2.Planes de Accion/Generales/1.Index/1.1.Gestion del Plan/2.Agregar Accion,Firefox 71.0,,,2019-12-27 10:00:46,2019-12-27 10:02:47,"2m - 1,636s",PASSED
"callTestCase(findTestCase(""2.Planes de Accion/Daruma/Acceso al modulo""), [:])",Firefox 71.0,,,2019-12-27 10:00:46,2019-12-27 10:01:38,"51,937s",PASSED
"id = test.Metodos.lista(findTestObject(""Object Repository/2.list_inputCheck""))",Firefox 71.0,,,2019-12-27 10:01:38,2019-12-27 10:01:42,"3,819s",PASSED
"test.Metodos.select_item_managment(findTestObject(""Generales/Select Item List/1.list_index""), id)",Firefox 71.0,,,2019-12-27 10:01:42,2019-12-27 10:01:43,"1,551s",PASSED
delay(5),Firefox 71.0,,,2019-12-27 10:01:43,2019-12-27 10:01:48,"5,003s",PASSED
"click(findTestObject(""2.Planes de Accion/Generales/1.Index/1.Gestion del Plan/1.Analisis/1.btn_option_more""))",Firefox 71.0,,,2019-12-27 10:01:48,2019-12-27 10:01:53,"4,952s",PASSED
"click(findTestObject(""2.Planes de Accion/Generales/1.Index/1.Gestion del Plan/1.Analisis/2.btn_analyze""))",Firefox 71.0,,,2019-12-27 10:01:53,2019-12-27 10:02:24,"30,888s",PASSED
"test.Metodos.tiny1(findTestObject(""Object Repository/Generales/TinyMCE/Iframe""), 0)",Firefox 71.0,,,2019-12-27 10:02:24,2019-12-27 10:02:27,"2,829s",PASSED
"click(findTestObject(""2.Planes de Accion/Generales/1.Index/1.Gestion del Plan/1.Analisis/3.btn_Save""))",Firefox 71.0,,,2019-12-27 10:02:27,2019-12-27 10:02:28,"0,784s",PASSED
delay(5),Firefox 71.0,,,2019-12-27 10:02:28,2019-12-27 10:02:33,"5,004s",PASSED
"selectOptionByValue(findTestObject(""2.Planes de Accion/Generales/1.Index/1.Gestion del Plan/1.Analisis/4.select_cause_effect""), ""2"", false)",Firefox 71.0,,,2019-12-27 10:02:33,2019-12-27 10:02:33,"0,913s",PASSED
"click(findTestObject(""2.Planes de Accion/Generales/1.Index/1.Gestion del Plan/1.Analisis/5.inputCheck_add_actions""))",Firefox 71.0,,,2019-12-27 10:02:33,2019-12-27 10:02:34,"0,531s",PASSED
"click(findTestObject(""2.Planes de Accion/Generales/1.Index/1.Gestion del Plan/1.Analisis/3.btn_Save""))",Firefox 71.0,,,2019-12-27 10:02:34,2019-12-27 10:02:35,"0,580s",PASSED
"test.Metodos.tiny1(findTestObject(""Object Repository/Generales/TinyMCE/Iframe""), 0)",Firefox 71.0,,,2019-12-27 10:02:35,2019-12-27 10:02:40,"5,860s",PASSED
"selectOptionByValue(findTestObject(""2.Planes de Accion/Generales/1.Index/1.Gestion del Plan/1.Analisis/6.select_action_type""), ""1"", true)",Firefox 71.0,,,2019-12-27 10:02:40,2019-12-27 10:02:42,"1,123s",PASSED
"selectOptionByValue(findTestObject(""2.Planes de Accion/Generales/1.Index/1.Gestion del Plan/1.Analisis/7.select_end_date_month""), ""11"", true)",Firefox 71.0,,,2019-12-27 10:02:42,2019-12-27 10:02:43,"1,433s",PASSED
"selectOptionByValue(findTestObject(""2.Planes de Accion/Generales/1.Index/1.Gestion del Plan/1.Analisis/8.select_end_date_day""), ""31"", true)",Firefox 71.0,,,2019-12-27 10:02:43,2019-12-27 10:02:45,"1,755s",PASSED
"setText(findTestObject(""Object Repository/2.Planes de Accion/Generales/1.Index/1.Gestion del Plan/1.Analisis/9.input_initial_budget""), ""5000000"")",Firefox 71.0,,,2019-12-27 10:02:45,2019-12-27 10:02:45,"0,383s",PASSED
"setText(findTestObject(""Object Repository/2.Planes de Accion/Generales/1.Index/1.Gestion del Plan/1.Analisis/10.input_investment_budget""), ""5100000"")",Firefox 71.0,,,2019-12-27 10:02:45,2019-12-27 10:02:46,"0,457s",PASSED
"setText(findTestObject(""Object Repository/2.Planes de Accion/Generales/1.Index/1.Gestion del Plan/1.Analisis/11.input_operating_budget""), ""4800000"")",Firefox 71.0,,,2019-12-27 10:02:46,2019-12-27 10:02:46,"0,381s",PASSED
"click(findTestObject(""2.Planes de Accion/Generales/1.Index/1.Gestion del Plan/1.Analisis/12.inputCheck_exclude_consolidate""))",Firefox 71.0,,,2019-12-27 10:02:46,2019-12-27 10:02:47,"0,579s",PASSED
"click(findTestObject(""2.Planes de Accion/Generales/1.Index/1.Gestion del Plan/1.Analisis/3.btn_Save""))",Firefox 71.0,,,2019-12-27 10:02:47,2019-12-27 10:02:47,"0,602s",PASSED
