Suite/Test/Step Name,Browser,Description,Tag,Start time,End time,Duration,Status
19.Mostrar detalles del Plan,Firefox 71.0,,,2019-12-30 14:43:18,2019-12-30 14:44:26,"1m - 7,543s",PASSED
,,,,,,,
Test Cases/2.Planes de Accion/Generales/1.Index/1.1.Gestion del Plan/19.Mostrar detalles del Plan,Firefox 71.0,,,2019-12-30 14:43:19,2019-12-30 14:44:26,"1m - 7,000s",PASSED
"callTestCase(findTestCase(""2.Planes de Accion/Daruma/Acceso al modulo""), [:])",Firefox 71.0,,,2019-12-30 14:43:19,2019-12-30 14:44:09,"49,245s",PASSED
delay(5),Firefox 71.0,,,2019-12-30 14:44:09,2019-12-30 14:44:14,"5,011s",PASSED
"click(findTestObject(""2.Planes de Accion/Generales/1.Index/1.Gestion del Plan/19.Mostar detalles del plan/1.open_all""))",Firefox 71.0,,,2019-12-30 14:44:14,2019-12-30 14:44:14,"0,627s",PASSED
"id = test.Metodos.lista(findTestObject(""2.Planes de Accion/Generales/1.Index/1.Gestion del Plan/19.Mostar detalles del plan/2.list_inputCheck""))",Firefox 71.0,,,2019-12-30 14:44:14,2019-12-30 14:44:24,"10,094s",PASSED
"test.Metodos.select_item_managment(findTestObject(""Generales/Select Item List/1.list_index""), id)",Firefox 71.0,,,2019-12-30 14:44:24,2019-12-30 14:44:26,"1,340s",PASSED
