Suite/Test/Step Name,Browser,Description,Tag,Start time,End time,Duration,Status
1.Crear plan de accion,Firefox 72.0,,,2020-01-23 10:28:41,2020-01-23 10:32:05,"3m - 23,769s",PASSED
,,,,,,,
Test Cases/2.Planes de Accion/Generales/1.Index/1.Crear Plan de Accion,Firefox 72.0,,,2020-01-23 10:28:42,2020-01-23 10:32:05,"3m - 23,158s",PASSED
"callTestCase(findTestCase(""2.Planes de Accion/Daruma/Acceso al modulo""), [:])",Firefox 72.0,,,2020-01-23 10:28:42,2020-01-23 10:29:27,"44,171s",PASSED
"click(findTestObject(""2.Planes de Accion/Generales/1.Index/1.1.Crear/1.btn_Create""))",Firefox 72.0,,,2020-01-23 10:29:27,2020-01-23 10:29:27,"0,662s",PASSED
delay(5),Firefox 72.0,,,2020-01-23 10:29:27,2020-01-23 10:29:32,"5,006s",PASSED
"test.Metodos.display_list_only(findTestObject(""Generales/Select2/1.display_list_only""), 0)",Firefox 72.0,,,2020-01-23 10:29:32,2020-01-23 10:29:43,"11,191s",PASSED
"test.Metodos.element_selected(findTestObject(""Object Repository/Generales/Select2/2.select_option""), 1)",Firefox 72.0,,,2020-01-23 10:29:43,2020-01-23 10:29:51,"7,134s",PASSED
"test.Metodos.display_list_only(findTestObject(""Generales/Select2/1.display_list_only""), 1)",Firefox 72.0,,,2020-01-23 10:29:51,2020-01-23 10:30:02,"11,073s",PASSED
"test.Metodos.element_selected(findTestObject(""Object Repository/Generales/Select2/2.select_option""), 1)",Firefox 72.0,,,2020-01-23 10:30:02,2020-01-23 10:30:09,"7,082s",PASSED
"click(findTestObject(""2.Planes de Accion/Generales/1.Index/1.1.Crear/3.Origenes""))",Firefox 72.0,,,2020-01-23 10:30:09,2020-01-23 10:30:10,"1,321s",PASSED
"elementSelect = test.Metodos.select2_config(findTestObject(""2.Planes de Accion/Generales/1.Index/1.1.Crear/4.Element_select""))",Firefox 72.0,,,2020-01-23 10:30:10,2020-01-23 10:30:11,"1,188s",PASSED
"selectOptionByValue(findTestObject(""2.Planes de Accion/Generales/1.Index/1.1.Crear/5.select_type""), elementSelect.toString(), true)",Firefox 72.0,,,2020-01-23 10:30:11,2020-01-23 10:30:13,"1,835s",PASSED
"getNumberOfTotalOption(findTestObject(""2.Planes de Accion/Generales/1.Index/1.1.Crear/4.Element_select""))",Firefox 72.0,,,2020-01-23 10:30:13,2020-01-23 10:30:14,"0,604s",PASSED
"test.Metodos.tiny1(findTestObject(""2.Planes de Accion/Generales/1.Index/1.1.Crear/6.TinyMCE""), 0)",Firefox 72.0,,,2020-01-23 10:30:14,2020-01-23 10:30:15,"1,092s",PASSED
delay(5),Firefox 72.0,,,2020-01-23 10:30:15,2020-01-23 10:30:20,"5,004s",PASSED
"test.Metodos.tiny1(findTestObject(""2.Planes de Accion/Generales/1.Index/1.1.Crear/6.TinyMCE""), 1)",Firefox 72.0,,,2020-01-23 10:30:20,2020-01-23 10:30:21,"1,001s",PASSED
delay(5),Firefox 72.0,,,2020-01-23 10:30:21,2020-01-23 10:30:26,"5,003s",PASSED
"selectOptionByValue(findTestObject(""2.Planes de Accion/Generales/1.Index/1.1.Crear/7.select_track_freq""), ""4"", true)",Firefox 72.0,,,2020-01-23 10:30:26,2020-01-23 10:30:27,"0,993s",PASSED
"setText(findTestObject(""2.Planes de Accion/Generales/1.Index/1.1.Crear/8.input_num_periods""), ""1"")",Firefox 72.0,,,2020-01-23 10:30:27,2020-01-23 10:30:27,"0,477s",PASSED
"test.Metodos.display_list_multi(findTestObject(""Object Repository/Generales/Select2/1.1.display_list_multi""), 2)",Firefox 72.0,,,2020-01-23 10:30:27,2020-01-23 10:30:38,"10,749s",PASSED
delay(5),Firefox 72.0,,,2020-01-23 10:30:38,2020-01-23 10:30:43,"5,005s",PASSED
"click(findTestObject(""Object Repository/2.Planes de Accion/Generales/1.Index/1.1.Crear/li_Seleccionar Todo""))",Firefox 72.0,,,2020-01-23 10:30:43,2020-01-23 10:30:44,"1,003s",PASSED
delay(5),Firefox 72.0,,,2020-01-23 10:30:44,2020-01-23 10:30:49,"5,004s",PASSED
"test.Metodos.display_list_multi(findTestObject(""Generales/Select2/1.1.display_list_multi""), 5)",Firefox 72.0,,,2020-01-23 10:30:49,2020-01-23 10:31:00,"10,672s",PASSED
delay(5),Firefox 72.0,,,2020-01-23 10:31:00,2020-01-23 10:31:05,"5,003s",PASSED
"test.Metodos.select2(findTestObject(""Object Repository/Generales/Select2/2.select_option""), 0)",Firefox 72.0,,,2020-01-23 10:31:05,2020-01-23 10:31:16,"11,091s",PASSED
"test.Metodos.display_list_multi(findTestObject(""Object Repository/Generales/Select2/1.1.display_list_multi""), 6)",Firefox 72.0,,,2020-01-23 10:31:16,2020-01-23 10:31:26,"10,689s",PASSED
"test.Metodos.select2(findTestObject(""Object Repository/Generales/Select2/2.select_option""), 0)",Firefox 72.0,,,2020-01-23 10:31:26,2020-01-23 10:31:38,"11,100s",PASSED
"test.Metodos.display_list_multi(findTestObject(""Object Repository/Generales/Select2/1.1.display_list_multi""), 7)",Firefox 72.0,,,2020-01-23 10:31:38,2020-01-23 10:31:48,"10,569s",PASSED
"test.Metodos.select2(findTestObject(""Object Repository/Generales/Select2/2.select_option""), 0)",Firefox 72.0,,,2020-01-23 10:31:48,2020-01-23 10:31:59,"11,066s",PASSED
delay(5),Firefox 72.0,,,2020-01-23 10:31:59,2020-01-23 10:32:04,"5,006s",PASSED
"click(findTestObject(""2.Planes de Accion/Generales/1.Index/1.1.Crear/10.btn_Save""))",Firefox 72.0,,,2020-01-23 10:32:04,2020-01-23 10:32:05,"0,617s",PASSED
