Suite/Test/Step Name,Browser,Description,Tag,Start time,End time,Duration,Status
29.Elimnar un plan de Accion (Con Acciones),Firefox 71.0,,,2020-01-03 15:41:12,2020-01-03 15:48:37,"7m - 25,141s",PASSED
,,,,,,,
Test Cases/2.Planes de Accion/Generales/1.Index/1.Crear Plan de Accion,Firefox 71.0,,,2020-01-03 15:41:12,2020-01-03 15:45:51,"4m - 39,366s",PASSED
"callTestCase(findTestCase(""2.Planes de Accion/Daruma/Acceso al modulo""), [:])",Firefox 71.0,,,2020-01-03 15:41:13,2020-01-03 15:42:02,"49,546s",PASSED
"click(findTestObject(""2.Planes de Accion/Generales/1.Index/1.1.Crear/1.btn_Create""))",Firefox 71.0,,,2020-01-03 15:42:02,2020-01-03 15:42:03,"0,761s",PASSED
delay(5),Firefox 71.0,,,2020-01-03 15:42:03,2020-01-03 15:42:08,"5,007s",PASSED
"test.Metodos.display_list_only(findTestObject(""Generales/Select2/1.display_list_only""), 0)",Firefox 71.0,,,2020-01-03 15:42:08,2020-01-03 15:42:21,"13,191s",PASSED
"test.Metodos.element_selected(findTestObject(""Object Repository/Generales/Select2/2.select_option""), 1)",Firefox 71.0,,,2020-01-03 15:42:21,2020-01-03 15:42:28,"7,083s",PASSED
"test.Metodos.display_list_only(findTestObject(""Generales/Select2/1.display_list_only""), 1)",Firefox 71.0,,,2020-01-03 15:42:28,2020-01-03 15:42:40,"11,050s",PASSED
"test.Metodos.element_selected(findTestObject(""Object Repository/Generales/Select2/2.select_option""), 1)",Firefox 71.0,,,2020-01-03 15:42:40,2020-01-03 15:42:47,"7,054s",PASSED
"test.Metodos.display_list_multi(findTestObject(""Object Repository/Generales/Select2/1.1.display_list_multi""), 0)",Firefox 71.0,,,2020-01-03 15:42:47,2020-01-03 15:42:57,"10,606s",PASSED
"test.Metodos.select2(findTestObject(""Object Repository/Generales/Select2/2.select_option""), 0)",Firefox 71.0,,,2020-01-03 15:42:57,2020-01-03 15:43:08,"11,084s",PASSED
"click(findTestObject(""2.Planes de Accion/Generales/1.Index/1.1.Crear/3.Origenes""))",Firefox 71.0,,,2020-01-03 15:43:08,2020-01-03 15:43:09,"0,989s",PASSED
"test.Metodos.display_list_multi(findTestObject(""Object Repository/Generales/Select2/1.1.display_list_multi""), 1)",Firefox 71.0,,,2020-01-03 15:43:09,2020-01-03 15:43:20,"10,913s",PASSED
"test.Metodos.select2(findTestObject(""Object Repository/Generales/Select2/2.1.select_option_multi""), 1)",Firefox 71.0,,,2020-01-03 15:43:20,2020-01-03 15:43:31,"11,153s",PASSED
"elementSelect = test.Metodos.select2_config(findTestObject(""2.Planes de Accion/Generales/1.Index/1.1.Crear/4.Element_select""))",Firefox 71.0,,,2020-01-03 15:43:31,2020-01-03 15:43:33,"1,424s",PASSED
"selectOptionByValue(findTestObject(""2.Planes de Accion/Generales/1.Index/1.1.Crear/5.select_type""), elementSelect.toString(), true)",Firefox 71.0,,,2020-01-03 15:43:33,2020-01-03 15:43:34,"1,560s",PASSED
"getNumberOfTotalOption(findTestObject(""2.Planes de Accion/Generales/1.Index/1.1.Crear/4.Element_select""))",Firefox 71.0,,,2020-01-03 15:43:34,2020-01-03 15:43:35,"0,574s",PASSED
"test.Metodos.tiny1(findTestObject(""2.Planes de Accion/Generales/1.Index/1.1.Crear/6.TinyMCE""), 0)",Firefox 71.0,,,2020-01-03 15:43:35,2020-01-03 15:43:36,"1,120s",PASSED
delay(5),Firefox 71.0,,,2020-01-03 15:43:36,2020-01-03 15:43:41,"5,004s",PASSED
"test.Metodos.tiny1(findTestObject(""2.Planes de Accion/Generales/1.Index/1.1.Crear/6.TinyMCE""), 1)",Firefox 71.0,,,2020-01-03 15:43:41,2020-01-03 15:43:42,"1,090s",PASSED
delay(5),Firefox 71.0,,,2020-01-03 15:43:42,2020-01-03 15:43:47,"5,004s",PASSED
"selectOptionByValue(findTestObject(""2.Planes de Accion/Generales/1.Index/1.1.Crear/7.select_track_freq""), ""4"", true)",Firefox 71.0,,,2020-01-03 15:43:47,2020-01-03 15:43:48,"1,119s",PASSED
"setText(findTestObject(""2.Planes de Accion/Generales/1.Index/1.1.Crear/8.input_num_periods""), ""1"")",Firefox 71.0,,,2020-01-03 15:43:48,2020-01-03 15:43:50,"1,568s",PASSED
"selectOptionByValue(findTestObject(""2.Planes de Accion/Generales/1.Index/1.1.Crear/9.select_criticality_id""), ""21"", true)",Firefox 71.0,,,2020-01-03 15:43:50,2020-01-03 15:43:52,"2,646s",PASSED
"test.Metodos.display_list_multi(findTestObject(""Object Repository/Generales/Select2/1.1.display_list_multi""), 2)",Firefox 71.0,,,2020-01-03 15:43:52,2020-01-03 15:44:03,"10,544s",PASSED
"test.Metodos.select2(findTestObject(""Object Repository/Generales/Select2/2.select_option""), 0)",Firefox 71.0,,,2020-01-03 15:44:03,2020-01-03 15:44:14,"11,107s",PASSED
"test.Metodos.display_list_multi(findTestObject(""Object Repository/Generales/Select2/1.1.display_list_multi""), 5)",Firefox 71.0,,,2020-01-03 15:44:14,2020-01-03 15:44:25,"10,615s",PASSED
delay(5),Firefox 71.0,,,2020-01-03 15:44:25,2020-01-03 15:44:30,"5,006s",PASSED
"test.Metodos.select2(findTestObject(""Object Repository/Generales/Select2/2.select_option""), 0)",Firefox 71.0,,,2020-01-03 15:44:30,2020-01-03 15:44:41,"11,091s",PASSED
"test.Metodos.display_list_multi(findTestObject(""Object Repository/Generales/Select2/1.1.display_list_multi""), 6)",Firefox 71.0,,,2020-01-03 15:44:41,2020-01-03 15:44:51,"10,619s",PASSED
"test.Metodos.select2(findTestObject(""Object Repository/Generales/Select2/2.select_option""), 0)",Firefox 71.0,,,2020-01-03 15:44:51,2020-01-03 15:45:02,"11,063s",PASSED
"test.Metodos.display_list_multi(findTestObject(""Object Repository/Generales/Select2/1.1.display_list_multi""), 7)",Firefox 71.0,,,2020-01-03 15:45:02,2020-01-03 15:45:13,"10,621s",PASSED
"test.Metodos.select2(findTestObject(""Object Repository/Generales/Select2/2.select_option""), 0)",Firefox 71.0,,,2020-01-03 15:45:13,2020-01-03 15:45:24,"11,022s",PASSED
"test.Metodos.display_list_multi(findTestObject(""Object Repository/Generales/Select2/1.1.display_list_multi""), 8)",Firefox 71.0,,,2020-01-03 15:45:24,2020-01-03 15:45:35,"10,575s",PASSED
"test.Metodos.select2(findTestObject(""Object Repository/Generales/Select2/2.select_option""), 0)",Firefox 71.0,,,2020-01-03 15:45:35,2020-01-03 15:45:46,"11,042s",PASSED
delay(5),Firefox 71.0,,,2020-01-03 15:45:46,2020-01-03 15:45:51,"5,006s",PASSED
"click(findTestObject(""2.Planes de Accion/Generales/1.Index/1.1.Crear/10.btn_Save""))",Firefox 71.0,,,2020-01-03 15:45:51,2020-01-03 15:45:51,"0,649s",PASSED
,,,,,,,
Test Cases/2.Planes de Accion/Generales/1.Index/1.1.Gestion del Plan/2.Agregar Accion,Firefox 71.0,,,2020-01-03 15:45:51,2020-01-03 15:47:16,"1m - 24,228s",PASSED
"callTestCase(findTestCase(""2.Planes de Accion/Daruma/Acceso al modulo""), [:])",Firefox 71.0,,,2020-01-03 15:45:52,2020-01-03 15:46:37,"45,137s",PASSED
"id = test.Metodos.lista(findTestObject(""Object Repository/2.list_inputCheck""))",Firefox 71.0,,,2020-01-03 15:46:37,2020-01-03 15:46:41,"3,840s",PASSED
"test.Metodos.select_item_managment(findTestObject(""Generales/Select Item List/1.list_index""), id)",Firefox 71.0,,,2020-01-03 15:46:41,2020-01-03 15:46:42,"1,478s",PASSED
delay(5),Firefox 71.0,,,2020-01-03 15:46:42,2020-01-03 15:46:47,"5,003s",PASSED
"click(findTestObject(""2.Planes de Accion/Generales/1.Index/1.Gestion del Plan/1.Analisis/1.btn_option_more""))",Firefox 71.0,,,2020-01-03 15:46:47,2020-01-03 15:46:49,"1,484s",PASSED
"click(findTestObject(""2.Planes de Accion/Generales/1.Index/1.Gestion del Plan/1.Analisis/2.btn_analyze""))",Firefox 71.0,,,2020-01-03 15:46:49,2020-01-03 15:46:49,"0,781s",PASSED
"test.Metodos.tiny1(findTestObject(""Object Repository/Generales/TinyMCE/Iframe""), 0)",Firefox 71.0,,,2020-01-03 15:46:49,2020-01-03 15:46:55,"5,070s",PASSED
"click(findTestObject(""2.Planes de Accion/Generales/1.Index/1.Gestion del Plan/1.Analisis/3.btn_Save""))",Firefox 71.0,,,2020-01-03 15:46:55,2020-01-03 15:46:55,"0,846s",PASSED
delay(5),Firefox 71.0,,,2020-01-03 15:46:55,2020-01-03 15:47:00,"5,003s",PASSED
"selectOptionByValue(findTestObject(""2.Planes de Accion/Generales/1.Index/1.Gestion del Plan/1.Analisis/4.select_cause_effect""), ""2"", false)",Firefox 71.0,,,2020-01-03 15:47:00,2020-01-03 15:47:01,"0,830s",PASSED
"click(findTestObject(""2.Planes de Accion/Generales/1.Index/1.Gestion del Plan/1.Analisis/5.inputCheck_add_actions""))",Firefox 71.0,,,2020-01-03 15:47:01,2020-01-03 15:47:02,"0,571s",PASSED
"click(findTestObject(""2.Planes de Accion/Generales/1.Index/1.Gestion del Plan/1.Analisis/3.btn_Save""))",Firefox 71.0,,,2020-01-03 15:47:02,2020-01-03 15:47:02,"0,530s",PASSED
"test.Metodos.tiny1(findTestObject(""Object Repository/Generales/TinyMCE/Iframe""), 0)",Firefox 71.0,,,2020-01-03 15:47:02,2020-01-03 15:47:09,"6,706s",PASSED
"selectOptionByValue(findTestObject(""2.Planes de Accion/Generales/1.Index/1.Gestion del Plan/1.Analisis/6.select_action_type""), ""1"", true)",Firefox 71.0,,,2020-01-03 15:47:09,2020-01-03 15:47:10,"1,069s",PASSED
"selectOptionByValue(findTestObject(""2.Planes de Accion/Generales/1.Index/1.Gestion del Plan/1.Analisis/7.select_end_date_month""), ""12"", true)",Firefox 71.0,,,2020-01-03 15:47:10,2020-01-03 15:47:12,"1,480s",PASSED
"selectOptionByValue(findTestObject(""2.Planes de Accion/Generales/1.Index/1.Gestion del Plan/1.Analisis/8.select_end_date_day""), ""31"", true)",Firefox 71.0,,,2020-01-03 15:47:12,2020-01-03 15:47:13,"1,849s",PASSED
"setText(findTestObject(""Object Repository/2.Planes de Accion/Generales/1.Index/1.Gestion del Plan/1.Analisis/9.input_initial_budget""), ""5000000"")",Firefox 71.0,,,2020-01-03 15:47:13,2020-01-03 15:47:14,"0,368s",PASSED
"setText(findTestObject(""Object Repository/2.Planes de Accion/Generales/1.Index/1.Gestion del Plan/1.Analisis/10.input_investment_budget""), ""5100000"")",Firefox 71.0,,,2020-01-03 15:47:14,2020-01-03 15:47:14,"0,356s",PASSED
"setText(findTestObject(""Object Repository/2.Planes de Accion/Generales/1.Index/1.Gestion del Plan/1.Analisis/11.input_operating_budget""), ""4800000"")",Firefox 71.0,,,2020-01-03 15:47:14,2020-01-03 15:47:14,"0,340s",PASSED
"click(findTestObject(""2.Planes de Accion/Generales/1.Index/1.Gestion del Plan/1.Analisis/12.inputCheck_exclude_consolidate""))",Firefox 71.0,,,2020-01-03 15:47:14,2020-01-03 15:47:15,"0,548s",PASSED
"click(findTestObject(""2.Planes de Accion/Generales/1.Index/1.Gestion del Plan/1.Analisis/3.btn_Save""))",Firefox 71.0,,,2020-01-03 15:47:15,2020-01-03 15:47:16,"0,593s",PASSED
,,,,,,,
Test Cases/2.Planes de Accion/Generales/1.Index/1.1.Gestion del Plan/25.Eliminaci\u00F3n de un plan de acci\u00F3n (sin acciones),Firefox 71.0,,,2020-01-03 15:47:16,2020-01-03 15:48:37,"1m - 21,033s",PASSED
"callTestCase(findTestCase(""2.Planes de Accion/Daruma/Acceso al modulo""), [:])",Firefox 71.0,,,2020-01-03 15:47:16,2020-01-03 15:48:05,"49,076s",PASSED
"id = test.Metodos.lista(findTestObject(""Object Repository/2.list_inputCheck""))",Firefox 71.0,,,2020-01-03 15:48:05,2020-01-03 15:48:09,"3,837s",PASSED
"test.Metodos.select_item_managment(findTestObject(""Generales/Select Item List/1.list_index""), id)",Firefox 71.0,,,2020-01-03 15:48:09,2020-01-03 15:48:10,"1,486s",PASSED
delay(5),Firefox 71.0,,,2020-01-03 15:48:10,2020-01-03 15:48:15,"5,002s",PASSED
"click(findTestObject(""2.Planes de Accion/Generales/1.Index/1.Gestion del Plan/25.Eliminación de un plan de acción (sin acciones)/1.Editar""))",Firefox 71.0,,,2020-01-03 15:48:15,2020-01-03 15:48:16,"0,638s",PASSED
delay(5),Firefox 71.0,,,2020-01-03 15:48:16,2020-01-03 15:48:21,"5,003s",PASSED
"click(findTestObject(""2.Planes de Accion/Generales/1.Index/1.Gestion del Plan/25.Eliminación de un plan de acción (sin acciones)/2.delete""))",Firefox 71.0,,,2020-01-03 15:48:21,2020-01-03 15:48:37,"15,620s",PASSED
