Suite/Test/Step Name,Browser,Description,Tag,Start time,End time,Duration,Status
Relacion Entre Variable de Impacto y Nivel de Criticidad,Firefox 71.0,,,2019-12-23 08:26:03,2019-12-23 08:34:03,"8m - 0,136s",PASSED
,,,,,,,
Test Cases/2.Planes de Accion/Configuracion/9.Relaciones entre Variables de impacto y Niveles de criticidad/1.Test Cases General/0.Ver,Firefox 71.0,,,2019-12-23 08:26:04,2019-12-23 08:26:59,"55,075s",PASSED
"callTestCase(findTestCase(""2.Planes de Accion/Daruma/Acceso al modulo""), [:])",Firefox 71.0,,,2019-12-23 08:26:04,2019-12-23 08:26:52,"47,996s",PASSED
"click(findTestObject(""2.Planes de Accion/Configuracion/9.Relacion entre Variables de Impacto y Nivel de Criticidad/1.Generales/0.Ver/1.a_Configuration""))",Firefox 71.0,,,2019-12-23 08:26:52,2019-12-23 08:26:53,"0,595s",PASSED
"click(findTestObject(""2.Planes de Accion/Configuracion/9.Relacion entre Variables de Impacto y Nivel de Criticidad/1.Generales/0.Ver/2.a_Relaciones Var_Nivel""))",Firefox 71.0,,,2019-12-23 08:26:53,2019-12-23 08:26:54,"0,873s",PASSED
delay(5),Firefox 71.0,,,2019-12-23 08:26:54,2019-12-23 08:26:59,"5,004s",PASSED
,,,,,,,
Test Cases/2.Planes de Accion/Configuracion/9.Relaciones entre Variables de impacto y Niveles de criticidad/1.Test Cases General/1.Crear,Firefox 71.0,,,2019-12-23 08:26:59,2019-12-23 08:28:07,"1m - 7,957s",PASSED
"callTestCase(findTestCase(""2.Planes de Accion/Configuracion/9.Relaciones entre Variables de impacto y Niveles de criticidad/1.Test Cases General/0.Ver""), [:])",Firefox 71.0,,,2019-12-23 08:26:59,2019-12-23 08:27:52,"53,226s",PASSED
"click(findTestObject(""2.Planes de Accion/Configuracion/9.Relacion entre Variables de Impacto y Nivel de Criticidad/1.Generales/1.Crear/1.btn_Create""))",Firefox 71.0,,,2019-12-23 08:27:52,2019-12-23 08:27:53,"0,588s",PASSED
"element = test.Metodos.select2_config(findTestObject(""2.Planes de Accion/Configuracion/9.Relacion entre Variables de Impacto y Nivel de Criticidad/1.Generales/1.Crear/2.select_variable_impact""))",Firefox 71.0,,,2019-12-23 08:27:53,2019-12-23 08:27:57,"4,394s",PASSED
"selectOptionByValue(findTestObject(""2.Planes de Accion/Configuracion/9.Relacion entre Variables de Impacto y Nivel de Criticidad/1.Generales/1.Crear/2.select_variable_impact""), element.toString(), false)",Firefox 71.0,,,2019-12-23 08:27:57,2019-12-23 08:27:58,"0,901s",PASSED
"element2 = test.Metodos.select2_config(findTestObject(""2.Planes de Accion/Configuracion/9.Relacion entre Variables de Impacto y Nivel de Criticidad/1.Generales/1.Crear/3.select_criticality_level""))",Firefox 71.0,,,2019-12-23 08:27:58,2019-12-23 08:27:59,"1,166s",PASSED
"selectOptionByValue(findTestObject(""2.Planes de Accion/Configuracion/9.Relacion entre Variables de Impacto y Nivel de Criticidad/1.Generales/1.Crear/3.select_criticality_level""), element2.toString(), false)",Firefox 71.0,,,2019-12-23 08:27:59,2019-12-23 08:28:00,"0,802s",PASSED
"test.Metodos.EdiTtiny1(findTestObject(""Object Repository/2.Planes de Accion/Configuracion/9.Relacion entre Variables de Impacto y Nivel de Criticidad/1.Generales/Iframe TinyMCE""), 0)",Firefox 71.0,,,2019-12-23 08:28:00,2019-12-23 08:28:01,"0,837s",PASSED
"click(findTestObject(""2.Planes de Accion/Configuracion/9.Relacion entre Variables de Impacto y Nivel de Criticidad/1.Generales/1.Crear/4.btn_Save""))",Firefox 71.0,,,2019-12-23 08:28:01,2019-12-23 08:28:02,"0,772s",PASSED
delay(5),Firefox 71.0,,,2019-12-23 08:28:02,2019-12-23 08:28:07,"5,007s",PASSED
,,,,,,,
Test Cases/2.Planes de Accion/Configuracion/9.Relaciones entre Variables de impacto y Niveles de criticidad/1.Test Cases General/2.Editar,Firefox 71.0,,,2019-12-23 08:28:07,2019-12-23 08:29:25,"1m - 18,353s",PASSED
"callTestCase(findTestCase(""2.Planes de Accion/Configuracion/9.Relaciones entre Variables de impacto y Niveles de criticidad/1.Test Cases General/0.Ver""), [:])",Firefox 71.0,,,2019-12-23 08:28:07,2019-12-23 08:29:01,"54,032s",PASSED
"test.Metodos.lista(findTestObject(""2.Planes de Accion/Configuracion/9.Relacion entre Variables de Impacto y Nivel de Criticidad/1.Generales/2.Editar/1.inputCheck_items""))",Firefox 71.0,,,2019-12-23 08:29:01,2019-12-23 08:29:05,"3,982s",PASSED
"click(findTestObject(""2.Planes de Accion/Configuracion/9.Relacion entre Variables de Impacto y Nivel de Criticidad/1.Generales/2.Editar/2.btn_Edit""))",Firefox 71.0,,,2019-12-23 08:29:05,2019-12-23 08:29:05,"0,550s",PASSED
"element = test.Metodos.select2_config(findTestObject(""2.Planes de Accion/Configuracion/9.Relacion entre Variables de Impacto y Nivel de Criticidad/1.Generales/1.Crear/2.select_variable_impact""))",Firefox 71.0,,,2019-12-23 08:29:05,2019-12-23 08:29:10,"4,479s",PASSED
"selectOptionByValue(findTestObject(""2.Planes de Accion/Configuracion/9.Relacion entre Variables de Impacto y Nivel de Criticidad/1.Generales/1.Crear/2.select_variable_impact""), element.toString(), false)",Firefox 71.0,,,2019-12-23 08:29:10,2019-12-23 08:29:12,"1,882s",PASSED
"element2 = test.Metodos.select2_config(findTestObject(""2.Planes de Accion/Configuracion/9.Relacion entre Variables de Impacto y Nivel de Criticidad/1.Generales/1.Crear/3.select_criticality_level""))",Firefox 71.0,,,2019-12-23 08:29:12,2019-12-23 08:29:13,"0,808s",PASSED
"selectOptionByValue(findTestObject(""2.Planes de Accion/Configuracion/9.Relacion entre Variables de Impacto y Nivel de Criticidad/1.Generales/1.Crear/3.select_criticality_level""), element2.toString(), false)",Firefox 71.0,,,2019-12-23 08:29:13,2019-12-23 08:29:13,"0,542s",PASSED
delay(5),Firefox 71.0,,,2019-12-23 08:29:13,2019-12-23 08:29:18,"5,006s",PASSED
"test.Metodos.tiny1(findTestObject(""Object Repository/2.Planes de Accion/Configuracion/9.Relacion entre Variables de Impacto y Nivel de Criticidad/1.Generales/Iframe TinyMCE""), 0)",Firefox 71.0,,,2019-12-23 08:29:18,2019-12-23 08:29:19,"1,001s",PASSED
"click(findTestObject(""2.Planes de Accion/Configuracion/9.Relacion entre Variables de Impacto y Nivel de Criticidad/1.Generales/2.Editar/5.btn_Save""))",Firefox 71.0,,,2019-12-23 08:29:19,2019-12-23 08:29:20,"0,794s",PASSED
delay(5),Firefox 71.0,,,2019-12-23 08:29:20,2019-12-23 08:29:25,"5,003s",PASSED
,,,,,,,
Test Cases/2.Planes de Accion/Configuracion/9.Relaciones entre Variables de impacto y Niveles de criticidad/1.Test Cases General/3.Eliminar,Firefox 71.0,,,2019-12-23 08:29:25,2019-12-23 08:30:25,"59,864s",PASSED
"callTestCase(findTestCase(""2.Planes de Accion/Configuracion/9.Relaciones entre Variables de impacto y Niveles de criticidad/1.Test Cases General/0.Ver""), [:])",Firefox 71.0,,,2019-12-23 08:29:26,2019-12-23 08:30:16,"49,985s",PASSED
"test.Metodos.lista(findTestObject(""Object Repository/2.list_inputCheck""))",Firefox 71.0,,,2019-12-23 08:30:16,2019-12-23 08:30:19,"3,850s",PASSED
"click(findTestObject(""2.Planes de Accion/Configuracion/9.Relacion entre Variables de Impacto y Nivel de Criticidad/1.Generales/3.Eliminar/2.btn_Delete""))",Firefox 71.0,,,2019-12-23 08:30:19,2019-12-23 08:30:20,"0,381s",PASSED
acceptAlert(),Firefox 71.0,,,2019-12-23 08:30:20,2019-12-23 08:30:20,"0,077s",PASSED
delay(5),Firefox 71.0,,,2019-12-23 08:30:20,2019-12-23 08:30:25,"5,004s",PASSED
,,,,,,,
Test Cases/2.Planes de Accion/Configuracion/9.Relaciones entre Variables de impacto y Niveles de criticidad/1.Test Cases General/4.Inhabilitar,Firefox 71.0,,,2019-12-23 08:30:25,2019-12-23 08:31:49,"1m - 24,403s",PASSED
"callTestCase(findTestCase(""2.Planes de Accion/Configuracion/9.Relaciones entre Variables de impacto y Niveles de criticidad/1.Test Cases General/0.Ver""), [:])",Firefox 71.0,,,2019-12-23 08:30:25,2019-12-23 08:31:35,"1m - 9,537s",PASSED
"test.Metodos.lista(findTestObject(""Object Repository/2.list_inputCheck""))",Firefox 71.0,,,2019-12-23 08:31:35,2019-12-23 08:31:40,"5,524s",PASSED
"click(findTestObject(""Object Repository/2.Planes de Accion/Configuracion/9.Relacion entre Variables de Impacto y Nivel de Criticidad/1.Generales/4.Inhabilitar/2.btn_Disable_1""))",Firefox 71.0,,,2019-12-23 08:31:40,2019-12-23 08:31:43,"2,544s",PASSED
"click(findTestObject(""2.Planes de Accion/Configuracion/9.Relacion entre Variables de Impacto y Nivel de Criticidad/1.Generales/4.Inhabilitar/3.btn_Disable_2""))",Firefox 71.0,,,2019-12-23 08:31:43,2019-12-23 08:31:44,"1,371s",PASSED
acceptAlert(),Firefox 71.0,,,2019-12-23 08:31:44,2019-12-23 08:31:44,"0,082s",PASSED
delay(5),Firefox 71.0,,,2019-12-23 08:31:44,2019-12-23 08:31:49,"5,002s",PASSED
,,,,,,,
Test Cases/2.Planes de Accion/Configuracion/9.Relaciones entre Variables de impacto y Niveles de criticidad/1.Test Cases General/5.Filtrar,Firefox 71.0,,,2019-12-23 08:31:49,2019-12-23 08:32:57,"1m - 7,612s",PASSED
"callTestCase(findTestCase(""2.Planes de Accion/Configuracion/9.Relaciones entre Variables de impacto y Niveles de criticidad/1.Test Cases General/0.Ver""), [:])",Firefox 71.0,,,2019-12-23 08:31:50,2019-12-23 08:32:46,"56,435s",PASSED
"click(findTestObject(""2.Planes de Accion/Configuracion/9.Relacion entre Variables de Impacto y Nivel de Criticidad/1.Generales/5.Filtrar/1.open_filter""))",Firefox 71.0,,,2019-12-23 08:32:46,2019-12-23 08:32:47,"0,596s",PASSED
"selectOptionByValue(findTestObject(""2.Planes de Accion/Configuracion/9.Relacion entre Variables de Impacto y Nivel de Criticidad/1.Generales/5.Filtrar/2.select_variable_impact""), ""4"", true)",Firefox 71.0,,,2019-12-23 08:32:47,2019-12-23 08:32:48,"1,277s",PASSED
"selectOptionByValue(findTestObject(""2.Planes de Accion/Configuracion/9.Relacion entre Variables de Impacto y Nivel de Criticidad/1.Generales/5.Filtrar/3.select_criticality_level""), ""10"", true)",Firefox 71.0,,,2019-12-23 08:32:48,2019-12-23 08:32:49,"1,187s",PASSED
"click(findTestObject(""2.Planes de Accion/Configuracion/9.Relacion entre Variables de Impacto y Nivel de Criticidad/1.Generales/5.Filtrar/4.btn_filter""))",Firefox 71.0,,,2019-12-23 08:32:49,2019-12-23 08:32:50,"0,522s",PASSED
delay(5),Firefox 71.0,,,2019-12-23 08:32:50,2019-12-23 08:32:55,"5,007s",PASSED
"click(findTestObject(""2.Planes de Accion/Configuracion/9.Relacion entre Variables de Impacto y Nivel de Criticidad/1.Generales/5.Filtrar/1.open_filter""))",Firefox 71.0,,,2019-12-23 08:32:55,2019-12-23 08:32:55,"0,644s",PASSED
"click(findTestObject(""2.Planes de Accion/Configuracion/9.Relacion entre Variables de Impacto y Nivel de Criticidad/1.Generales/5.Filtrar/5.btn_Reset""))",Firefox 71.0,,,2019-12-23 08:32:55,2019-12-23 08:32:57,"1,696s",PASSED
,,,,,,,
Test Cases/2.Planes de Accion/Configuracion/9.Relaciones entre Variables de impacto y Niveles de criticidad/1.Test Cases General/7.Mostrar,Firefox 71.0,,,2019-12-23 08:32:57,2019-12-23 08:34:03,"1m - 6,246s",PASSED
"callTestCase(findTestCase(""2.Planes de Accion/Configuracion/9.Relaciones entre Variables de impacto y Niveles de criticidad/1.Test Cases General/0.Ver""), [:])",Firefox 71.0,,,2019-12-23 08:32:57,2019-12-23 08:33:49,"51,637s",PASSED
delay(5),Firefox 71.0,,,2019-12-23 08:33:49,2019-12-23 08:33:54,"5,004s",PASSED
"test.Metodos.lista(findTestObject(""Object Repository/2.list_inputCheck""))",Firefox 71.0,,,2019-12-23 08:33:54,2019-12-23 08:33:58,"3,835s",PASSED
delay(5),Firefox 71.0,,,2019-12-23 08:33:58,2019-12-23 08:34:03,"5,003s",PASSED
"click(findTestObject(""2.Planes de Accion/Configuracion/9.Relacion entre Variables de Impacto y Nivel de Criticidad/1.Generales/7.Mostrar/1.Show""))",Firefox 71.0,,,2019-12-23 08:34:03,2019-12-23 08:34:03,"0,545s",PASSED
