Suite/Test/Step Name,Browser,Description,Tag,Start time,End time,Duration,Status
1.Tipos de Opinion_SAC,Firefox 71.0,,,2020-01-09 09:43:56,2020-01-09 09:47:14,"3m - 18,507s",FAILED
,,,,,,,
Test Cases/5.SAC/Configuracion/1.Tipos de opinion/1.Test Case Generales/0.Ver,Firefox 71.0,,,2020-01-09 09:43:57,2020-01-09 09:44:47,"50,252s",PASSED
"callTestCase(findTestCase(""5.SAC/Daruma/Acceso al modulo""), [:])",Firefox 71.0,,,2020-01-09 09:43:57,2020-01-09 09:44:40,"42,731s",PASSED
"click(findTestObject(""5.SAC/Configuracion/1.Tipos de opinion/0.Ver/1.Configuration""))",Firefox 71.0,,,2020-01-09 09:44:40,2020-01-09 09:44:46,"6,053s",PASSED
"click(findTestObject(""5.SAC/Configuracion/1.Tipos de opinion/0.Ver/2.OpinionTypes""))",Firefox 71.0,,,2020-01-09 09:44:46,2020-01-09 09:44:47,"0,802s",PASSED
,,,,,,,
Test Cases/5.SAC/Configuracion/1.Tipos de opinion/1.Test Case Generales/1.Crear,Firefox 71.0,,,2020-01-09 09:44:47,2020-01-09 09:46:36,"1m - 49,064s",FAILED
palabra = test.Metodos.randomString(),Firefox 71.0,,,2020-01-09 09:44:47,2020-01-09 09:44:47,"0,068s",PASSED
"callTestCase(findTestCase(""5.SAC/Configuracion/1.Tipos de opinion/1.Test Case Generales/0.Ver""), [:])",Firefox 71.0,,,2020-01-09 09:44:47,2020-01-09 09:45:33,"46,357s",PASSED
delay(5),Firefox 71.0,,,2020-01-09 09:45:33,2020-01-09 09:45:38,"5,009s",PASSED
"click(findTestObject(""5.SAC/Configuracion/1.Tipos de opinion/1.Crear/create""))",Firefox 71.0,,,2020-01-09 09:45:38,2020-01-09 09:45:39,"0,616s",PASSED
"setText(findTestObject(""Object Repository/2.Planes de Accion/Configuracion/1.Tipos/1.Generales/1.Crear/2.input_name""), palabra)",Firefox 71.0,,,2020-01-09 09:45:39,2020-01-09 09:46:36,"56,710s",FAILED
,,,,,,,
Test Cases/5.SAC/Configuracion/1.Tipos de opinion/1.Test Case Generales/2.Editar,Firefox 71.0,,,2020-01-09 09:46:36,2020-01-09 09:46:37,"1,105s",FAILED
palabra = test.Metodos.randomStringEdit(),Firefox 71.0,,,2020-01-09 09:46:37,2020-01-09 09:46:37,"0,004s",PASSED
"callTestCase(findTestCase(""5.SAC/Configuracion/1.Tipos de opinion/1.Test Case Generales/0.Ver""), [:])",Firefox 71.0,,,2020-01-09 09:46:37,2020-01-09 09:46:37,"0,421s",FAILED
,,,,,,,
Test Cases/5.SAC/Configuracion/1.Tipos de opinion/1.Test Case Generales/3.Eliminar,Firefox 71.0,,,2020-01-09 09:46:37,2020-01-09 09:46:49,"11,293s",FAILED
"callTestCase(findTestCase(""5.SAC/Configuracion/1.Tipos de opinion/1.Test Case Generales/0.Ver""), [:])",Firefox 71.0,,,2020-01-09 09:46:38,2020-01-09 09:46:49,"10,287s",FAILED
,,,,,,,
Test Cases/5.SAC/Configuracion/1.Tipos de opinion/1.Test Case Generales/4.Inhabilitar,Firefox 71.0,,,2020-01-09 09:46:49,2020-01-09 09:46:50,"0,989s",FAILED
"callTestCase(findTestCase(""5.SAC/Configuracion/1.Tipos de opinion/1.Test Case Generales/0.Ver""), [:])",Firefox 71.0,,,2020-01-09 09:46:49,2020-01-09 09:46:49,"0,346s",FAILED
,,,,,,,
Test Cases/5.SAC/Configuracion/1.Tipos de opinion/1.Test Case Generales/5.Filtrar,Firefox 71.0,,,2020-01-09 09:46:50,2020-01-09 09:47:00,"10,627s",FAILED
"callTestCase(findTestCase(""5.SAC/Configuracion/1.Tipos de opinion/1.Test Case Generales/0.Ver""), [:])",Firefox 71.0,,,2020-01-09 09:46:50,2020-01-09 09:47:00,"10,348s",FAILED
,,,,,,,
Test Cases/5.SAC/Configuracion/1.Tipos de opinion/1.Test Case Generales/6.Desfiltrar,Firefox 71.0,,,2020-01-09 09:47:00,2020-01-09 09:47:13,"12,655s",FAILED
"callTestCase(findTestCase(""5.SAC/Configuracion/1.Tipos de opinion/1.Test Case Generales/0.Ver""), [:])",Firefox 71.0,,,2020-01-09 09:47:01,2020-01-09 09:47:13,"11,883s",FAILED
,,,,,,,
Test Cases/5.SAC/Configuracion/1.Tipos de opinion/1.Test Case Generales/7.Mostrar,Firefox 71.0,,,2020-01-09 09:47:13,2020-01-09 09:47:14,"1,456s",FAILED
"callTestCase(findTestCase(""5.SAC/Configuracion/1.Tipos de opinion/1.Test Case Generales/0.Ver""), [:])",Firefox 71.0,,,2020-01-09 09:47:13,2020-01-09 09:47:14,"0,808s",FAILED
