%YAML 1.1
%TAG !u! tag:unity3d.com,2011:
--- !u!114 &11400000
MonoBehaviour:
  m_ObjectHideFlags: 0
  m_CorrespondingSourceObject: {fileID: 0}
  m_PrefabInstance: {fileID: 0}
  m_PrefabAsset: {fileID: 0}
  m_GameObject: {fileID: 0}
  m_Enabled: 1
  m_EditorHideFlags: 0
  m_Script: {fileID: 11500000, guid: 71c1514a6bd24e1e882cebbe1904ce04, type: 3}
  m_Name: "Rebel Kids SDF"
  m_EditorClassIdentifier: 
  hashCode: 1470004376
  material: {fileID: 2100000, guid: 246151c00a2c405daef93deb922f6d8c, type: 2}
  materialHashCode: 1576281400
  m_Version: "1.1.0"
  m_SourceFontFileGUID: "851bc87b4eebc574699f5e746e6ef192"
  m_SourceFontFile_EditorRef: {fileID: 0}
  m_SourceFontFile: {fileID: 0}
  m_AtlasPopulationMode: 1700947282
  m_FaceInfo:
    m_FaceIndex: 1766531180
    m_FamilyName: 
    m_StyleName: "Regular"
    m_PointSize: 60
    m_Scale: 1
    m_LineHeight: 63.78
    m_AscentLine: 51.78
    m_CapLine: 43
    m_MeanLine: 40
    m_Baseline: 0
    m_DescentLine: -12
    m_SuperscriptOffset: 51.78
    m_SuperscriptSize: 0.5
    m_SubscriptOffset: -12
    m_SubscriptSize: 0.5
    m_UnderlineOffset: -9
    m_UnderlineThickness: 3
    m_StrikethroughOffset: 16
    m_StrikethroughThickness: 3
    m_TabWidth: 14
  m_GlyphTable:
  - m_Index: 5
    m_Metrics:
      m_Width: 0
      m_Height: 0
      m_HorizontalBearingX: 0
      m_HorizontalBearingY: 0
      m_HorizontalAdvance: 13.6875
    m_GlyphRect:
      m_X: 0
      m_Y: 0
      m_Width: 0
      m_Height: 0
    m_Scale: 1
    m_AtlasIndex: 0
  - m_Index: 6
    m_Metrics:
      m_Width: 11.03125
      m_Height: 44.45313
      m_HorizontalBearingX: 0.90625
      m_HorizontalBearingY: 44.21875
      m_HorizontalAdvance: 13.01563
    m_GlyphRect:
      m_X: 176
      m_Y: 116
      m_Width: 11
      m_Height: 44
    m_Scale: 1
    m_AtlasIndex: 0
  - m_Index: 7
    m_Metrics:
      m_Width: 23.57813
      m_Height: 12.96875
      m_HorizontalBearingX: 0.546875
      m_HorizontalBearingY: 43.92188
      m_HorizontalAdvance: 24.48438
    m_GlyphRect:
      m_X: 261
      m_Y: 491
      m_Width: 23
      m_Height: 13
    m_Scale: 1
    m_AtlasIndex: 0
  - m_Index: 8
    m_Metrics:
      m_Width: 29.6875
      m_Height: 29.70313
      m_HorizontalBearingX: 0.90625
      m_HorizontalBearingY: 39.42188
      m_HorizontalAdvance: 31.5
    m_GlyphRect:
      m_X: 161
      m_Y: 410
      m_Width: 30
      m_Height: 29
    m_Scale: 1
    m_AtlasIndex: 0
  - m_Index: 9
    m_Metrics:
      m_Width: 25.375
      m_Height: 52.98438
      m_HorizontalBearingX: 0.71875
      m_HorizontalBearingY: 48.71875
      m_HorizontalAdvance: 25.4375
    m_GlyphRect:
      m_X: 43
      m_Y: 6
      m_Width: 25
      m_Height: 53
    m_Scale: 1
    m_AtlasIndex: 0
  - m_Index: 10
    m_Metrics:
      m_Width: 42.89063
      m_Height: 44.15625
      m_HorizontalBearingX: 2.765625
      m_HorizontalBearingY: 44.57813
      m_HorizontalAdvance: 48.23438
    m_GlyphRect:
      m_X: 43
      m_Y: 135
      m_Width: 43
      m_Height: 45
    m_Scale: 1
    m_AtlasIndex: 0
  - m_Index: 11
    m_Metrics:
      m_Width: 36
      m_Height: 43.85938
      m_HorizontalBearingX: 0.59375
      m_HorizontalBearingY: 43.98438
      m_HorizontalAdvance: 39.59375
    m_GlyphRect:
      m_X: 34
      m_Y: 322
      m_Width: 36
      m_Height: 44
    m_Scale: 1
    m_AtlasIndex: 0
  - m_Index: 12
    m_Metrics:
      m_Width: 10.67188
      m_Height: 12.96875
      m_HorizontalBearingX: 0.546875
      m_HorizontalBearingY: 43.92188
      m_HorizontalAdvance: 11.57813
    m_GlyphRect:
      m_X: 295
      m_Y: 491
      m_Width: 10
      m_Height: 13
    m_Scale: 1
    m_AtlasIndex: 0
  - m_Index: 13
    m_Metrics:
      m_Width: 21.35938
      m_Height: 52.79688
      m_HorizontalBearingX: 0.546875
      m_HorizontalBearingY: 48.42188
      m_HorizontalAdvance: 24.95313
    m_GlyphRect:
      m_X: 6
      m_Y: 392
      m_Width: 21
      m_Height: 52
    m_Scale: 1
    m_AtlasIndex: 0
  - m_Index: 14
    m_Metrics:
      m_Width: 21.35938
      m_Height: 52.98438
      m_HorizontalBearingX: 3
      m_HorizontalBearingY: 48.35938
      m_HorizontalAdvance: 24.95313
    m_GlyphRect:
      m_X: 6
      m_Y: 200
      m_Width: 21
      m_Height: 53
    m_Scale: 1
    m_AtlasIndex: 0
  - m_Index: 15
    m_Metrics:
      m_Width: 20.64063
      m_Height: 19.20313
      m_HorizontalBearingX: 0.59375
      m_HorizontalBearingY: 43.85938
      m_HorizontalAdvance: 21.78125
    m_GlyphRect:
      m_X: 297
      m_Y: 433
      m_Width: 20
      m_Height: 19
    m_Scale: 1
    m_AtlasIndex: 0
  - m_Index: 16
    m_Metrics:
      m_Width: 20.89063
      m_Height: 20.8125
      m_HorizontalBearingX: 0.59375
      m_HorizontalBearingY: 34.79688
      m_HorizontalAdvance: 21.90625
    m_GlyphRect:
      m_X: 369
      m_Y: 106
      m_Width: 20
      m_Height: 21
    m_Scale: 1
    m_AtlasIndex: 0
  - m_Index: 17
    m_Metrics:
      m_Width: 10.67188
      m_Height: 12.95313
      m_HorizontalBearingX: 0.546875
      m_HorizontalBearingY: 8.578125
      m_HorizontalAdvance: 11.64063
    m_GlyphRect:
      m_X: 369
      m_Y: 138
      m_Width: 10
      m_Height: 13
    m_Scale: 1
    m_AtlasIndex: 0
  - m_Index: 18
    m_Metrics:
      m_Width: 20.82813
      m_Height: 10.14063
      m_HorizontalBearingX: 0.65625
      m_HorizontalBearingY: 29.51563
      m_HorizontalAdvance: 21.90625
    m_GlyphRect:
      m_X: 76
      m_Y: 432
      m_Width: 20
      m_Height: 11
    m_Scale: 1
    m_AtlasIndex: 0
  - m_Index: 19
    m_Metrics:
      m_Width: 11.04688
      m_Height: 9.1875
      m_HorizontalBearingX: 0.359375
      m_HorizontalBearingY: 9.125
      m_HorizontalAdvance: 11.51563
    m_GlyphRect:
      m_X: 107
      m_Y: 432
      m_Width: 11
      m_Height: 9
    m_Scale: 1
    m_AtlasIndex: 0
  - m_Index: 20
    m_Metrics:
      m_Width: 31.98438
      m_Height: 43.25
      m_HorizontalBearingX: 3
      m_HorizontalBearingY: 43.73438
      m_HorizontalAdvance: 37.79688
    m_GlyphRect:
      m_X: 74
      m_Y: 191
      m_Width: 32
      m_Height: 44
    m_Scale: 1
    m_AtlasIndex: 0
  - m_Index: 21
    m_Metrics:
      m_Width: 31.96875
      m_Height: 44.32813
      m_HorizontalBearingX: 0.84375
      m_HorizontalBearingY: 43.73438
      m_HorizontalAdvance: 33.125
    m_GlyphRect:
      m_X: 65
      m_Y: 70
      m_Width: 32
      m_Height: 45
    m_Scale: 1
    m_AtlasIndex: 0
  - m_Index: 22
    m_Metrics:
      m_Width: 16.375
      m_Height: 43.6875
      m_HorizontalBearingX: 3
      m_HorizontalBearingY: 42.78125
      m_HorizontalAdvance: 20.76563
    m_GlyphRect:
      m_X: 153
      m_Y: 172
      m_Width: 16
      m_Height: 44
    m_Scale: 1
    m_AtlasIndex: 0
  - m_Index: 23
    m_Metrics:
      m_Width: 26.45313
      m_Height: 43.26563
      m_HorizontalBearingX: 0.125
      m_HorizontalBearingY: 43.07813
      m_HorizontalAdvance: 27
    m_GlyphRect:
      m_X: 191
      m_Y: 345
      m_Width: 27
      m_Height: 43
    m_Scale: 1
    m_AtlasIndex: 0
  - m_Index: 24
    m_Metrics:
      m_Width: 25.32813
      m_Height: 44.64063
      m_HorizontalBearingX: 2.9375
      m_HorizontalBearingY: 43.26563
      m_HorizontalAdvance: 28.85938
    m_GlyphRect:
      m_X: 115
      m_Y: 246
      m_Width: 25
      m_Height: 44
    m_Scale: 1
    m_AtlasIndex: 0
  - m_Index: 25
    m_Metrics:
      m_Width: 25.20313
      m_Height: 43.6875
      m_HorizontalBearingX: 3
      m_HorizontalBearingY: 43.26563
      m_HorizontalAdvance: 29.51563
    m_GlyphRect:
      m_X: 253
      m_Y: 6
      m_Width: 25
      m_Height: 43
    m_Scale: 1
    m_AtlasIndex: 0
  - m_Index: 26
    m_Metrics:
      m_Width: 26.9375
      m_Height: 43.25
      m_HorizontalBearingX: 0.65625
      m_HorizontalBearingY: 43.01563
      m_HorizontalAdvance: 28.375
    m_GlyphRect:
      m_X: 186
      m_Y: 225
      m_Width: 27
      m_Height: 43
    m_Scale: 1
    m_AtlasIndex: 0
  - m_Index: 27
    m_Metrics:
      m_Width: 25.96875
      m_Height: 43.3125
      m_HorizontalBearingX: 0.84375
      m_HorizontalBearingY: 43.01563
      m_HorizontalAdvance: 27.65625
    m_GlyphRect:
      m_X: 224
      m_Y: 225
      m_Width: 26
      m_Height: 43
    m_Scale: 1
    m_AtlasIndex: 0
  - m_Index: 28
    m_Metrics:
      m_Width: 24.71875
      m_Height: 43.85938
      m_HorizontalBearingX: 3
      m_HorizontalBearingY: 43.20313
      m_HorizontalAdvance: 30.71875
    m_GlyphRect:
      m_X: 117
      m_Y: 181
      m_Width: 25
      m_Height: 44
    m_Scale: 1
    m_AtlasIndex: 0
  - m_Index: 29
    m_Metrics:
      m_Width: 26.28125
      m_Height: 44.28125
      m_HorizontalBearingX: 0.71875
      m_HorizontalBearingY: 43.5625
      m_HorizontalAdvance: 27.35938
    m_GlyphRect:
      m_X: 79
      m_Y: 6
      m_Width: 26
      m_Height: 45
    m_Scale: 1
    m_AtlasIndex: 0
  - m_Index: 30
    m_Metrics:
      m_Width: 25.96875
      m_Height: 43.3125
      m_HorizontalBearingX: 0.84375
      m_HorizontalBearingY: 43.07813
      m_HorizontalAdvance: 27.65625
    m_GlyphRect:
      m_X: 229
      m_Y: 170
      m_Width: 26
      m_Height: 43
    m_Scale: 1
    m_AtlasIndex: 0
  - m_Index: 31
    m_Metrics:
      m_Width: 11.04688
      m_Height: 22.625
      m_HorizontalBearingX: 0.59375
      m_HorizontalBearingY: 22.5625
      m_HorizontalAdvance: 12
    m_GlyphRect:
      m_X: 360
      m_Y: 164
      m_Width: 11
      m_Height: 23
    m_Scale: 1
    m_AtlasIndex: 0
  - m_Index: 32
    m_Metrics:
      m_Width: 11.04688
      m_Height: 26.9375
      m_HorizontalBearingX: 0.65625
      m_HorizontalBearingY: 22.5625
      m_HorizontalAdvance: 12.0625
    m_GlyphRect:
      m_X: 338
      m_Y: 164
      m_Width: 11
      m_Height: 27
    m_Scale: 1
    m_AtlasIndex: 0
  - m_Index: 33
    m_Metrics:
      m_Width: 24.25
      m_Height: 33.78125
      m_HorizontalBearingX: 0.234375
      m_HorizontalBearingY: 39.23438
      m_HorizontalAdvance: 25.4375
    m_GlyphRect:
      m_X: 307
      m_Y: 274
      m_Width: 24
      m_Height: 34
    m_Scale: 1
    m_AtlasIndex: 0
  - m_Index: 34
    m_Metrics:
      m_Width: 21.0625
      m_Height: 18.35938
      m_HorizontalBearingX: 0.59375
      m_HorizontalBearingY: 33.65625
      m_HorizontalAdvance: 22.26563
    m_GlyphRect:
      m_X: 129
      m_Y: 422
      m_Width: 21
      m_Height: 19
    m_Scale: 1
    m_AtlasIndex: 0
  - m_Index: 35
    m_Metrics:
      m_Width: 24.25
      m_Height: 33.78125
      m_HorizontalBearingX: 0.953125
      m_HorizontalBearingY: 39.23438
      m_HorizontalAdvance: 25.4375
    m_GlyphRect:
      m_X: 333
      m_Y: 219
      m_Width: 24
      m_Height: 34
    m_Scale: 1
    m_AtlasIndex: 0
  - m_Index: 36
    m_Metrics:
      m_Width: 23.9375
      m_Height: 44.04688
      m_HorizontalBearingX: 2.875
      m_HorizontalBearingY: 43.98438
      m_HorizontalAdvance: 29.76563
    m_GlyphRect:
      m_X: 151
      m_Y: 236
      m_Width: 24
      m_Height: 44
    m_Scale: 1
    m_AtlasIndex: 0
  - m_Index: 37
    m_Metrics:
      m_Width: 38.40625
      m_Height: 43.60938
      m_HorizontalBearingX: 0.71875
      m_HorizontalBearingY: 44.45313
      m_HorizontalAdvance: 38.875
    m_GlyphRect:
      m_X: 180
      m_Y: 171
      m_Width: 38
      m_Height: 43
    m_Scale: 1
    m_AtlasIndex: 0
  - m_Index: 38
    m_Metrics:
      m_Width: 31.20313
      m_Height: 43.3125
      m_HorizontalBearingX: -0.484375
      m_HorizontalBearingY: 43.07813
      m_HorizontalAdvance: 30.35938
    m_GlyphRect:
      m_X: 211
      m_Y: 6
      m_Width: 31
      m_Height: 43
    m_Scale: 1
    m_AtlasIndex: 0
  - m_Index: 39
    m_Metrics:
      m_Width: 24.375
      m_Height: 43.79688
      m_HorizontalBearingX: 1.3125
      m_HorizontalBearingY: 43.14063
      m_HorizontalAdvance: 26.34375
    m_GlyphRect:
      m_X: 140
      m_Y: 117
      m_Width: 25
      m_Height: 44
    m_Scale: 1
    m_AtlasIndex: 0
  - m_Index: 40
    m_Metrics:
      m_Width: 24.40625
      m_Height: 42.96875
      m_HorizontalBearingX: 0.546875
      m_HorizontalBearingY: 42.84375
      m_HorizontalAdvance: 25.14063
    m_GlyphRect:
      m_X: 286
      m_Y: 60
      m_Width: 24
      m_Height: 43
    m_Scale: 1
    m_AtlasIndex: 0
  - m_Index: 41
    m_Metrics:
      m_Width: 24.375
      m_Height: 42.96875
      m_HorizontalBearingX: 1.3125
      m_HorizontalBearingY: 42.84375
      m_HorizontalAdvance: 26.21875
    m_GlyphRect:
      m_X: 192
      m_Y: 450
      m_Width: 25
      m_Height: 43
    m_Scale: 1
    m_AtlasIndex: 0
  - m_Index: 42
    m_Metrics:
      m_Width: 25.4375
      m_Height: 43.32813
      m_HorizontalBearingX: 1.203125
      m_HorizontalBearingY: 43.26563
      m_HorizontalAdvance: 26.8125
    m_GlyphRect:
      m_X: 246
      m_Y: 115
      m_Width: 26
      m_Height: 43
    m_Scale: 1
    m_AtlasIndex: 0
  - m_Index: 43
    m_Metrics:
      m_Width: 24.42188
      m_Height: 42.71875
      m_HorizontalBearingX: 1.265625
      m_HorizontalBearingY: 43.07813
      m_HorizontalAdvance: 25.375
    m_GlyphRect:
      m_X: 229
      m_Y: 333
      m_Width: 25
      m_Height: 43
    m_Scale: 1
    m_AtlasIndex: 0
  - m_Index: 44
    m_Metrics:
      m_Width: 24.35938
      m_Height: 43.01563
      m_HorizontalBearingX: 0.359375
      m_HorizontalBearingY: 43.01563
      m_HorizontalAdvance: 25.5625
    m_GlyphRect:
      m_X: 234
      m_Y: 279
      m_Width: 25
      m_Height: 43
    m_Scale: 1
    m_AtlasIndex: 0
  - m_Index: 45
    m_Metrics:
      m_Width: 27.04688
      m_Height: 43.3125
      m_HorizontalBearingX: 1.265625
      m_HorizontalBearingY: 42.71875
      m_HorizontalAdvance: 29.40625
    m_GlyphRect:
      m_X: 108
      m_Y: 62
      m_Width: 27
      m_Height: 44
    m_Scale: 1
    m_AtlasIndex: 0
  - m_Index: 46
    m_Metrics:
      m_Width: 10.85938
      m_Height: 43.01563
      m_HorizontalBearingX: 1.265625
      m_HorizontalBearingY: 42.59375
      m_HorizontalAdvance: 13.3125
    m_GlyphRect:
      m_X: 252
      m_Y: 387
      m_Width: 11
      m_Height: 43
    m_Scale: 1
    m_AtlasIndex: 0
  - m_Index: 47
    m_Metrics:
      m_Width: 22.3125
      m_Height: 42.78125
      m_HorizontalBearingX: -0.53125
      m_HorizontalBearingY: 42.59375
      m_HorizontalAdvance: 22.6875
    m_GlyphRect:
      m_X: 289
      m_Y: 6
      m_Width: 23
      m_Height: 43
    m_Scale: 1
    m_AtlasIndex: 0
  - m_Index: 48
    m_Metrics:
      m_Width: 24.78125
      m_Height: 42.84375
      m_HorizontalBearingX: 1.3125
      m_HorizontalBearingY: 43.20313
      m_HorizontalAdvance: 26.76563
    m_GlyphRect:
      m_X: 261
      m_Y: 224
      m_Width: 25
      m_Height: 43
    m_Scale: 1
    m_AtlasIndex: 0
  - m_Index: 49
    m_Metrics:
      m_Width: 21.35938
      m_Height: 43.14063
      m_HorizontalBearingX: 1.265625
      m_HorizontalBearingY: 43.375
      m_HorizontalAdvance: 21.95313
    m_GlyphRect:
      m_X: 228
      m_Y: 450
      m_Width: 22
      m_Height: 43
    m_Scale: 1
    m_AtlasIndex: 0
  - m_Index: 50
    m_Metrics:
      m_Width: 33.23438
      m_Height: 43.26563
      m_HorizontalBearingX: 0.84375
      m_HorizontalBearingY: 42.71875
      m_HorizontalAdvance: 35.21875
    m_GlyphRect:
      m_X: 71
      m_Y: 257
      m_Width: 33
      m_Height: 44
    m_Scale: 1
    m_AtlasIndex: 0
  - m_Index: 51
    m_Metrics:
      m_Width: 25.75
      m_Height: 43.5625
      m_HorizontalBearingX: 1.3125
      m_HorizontalBearingY: 42.84375
      m_HorizontalAdvance: 28.375
    m_GlyphRect:
      m_X: 38
      m_Y: 377
      m_Width: 26
      m_Height: 44
    m_Scale: 1
    m_AtlasIndex: 0
  - m_Index: 52
    m_Metrics:
      m_Width: 27.65625
      m_Height: 43.26563
      m_HorizontalBearingX: 0.546875
      m_HorizontalBearingY: 43.5625
      m_HorizontalAdvance: 28.375
    m_GlyphRect:
      m_X: 116
      m_Y: 6
      m_Width: 27
      m_Height: 44
    m_Scale: 1
    m_AtlasIndex: 0
  - m_Index: 53
    m_Metrics:
      m_Width: 24.375
      m_Height: 43.3125
      m_HorizontalBearingX: 1.3125
      m_HorizontalBearingY: 42.95313
      m_HorizontalAdvance: 25.73438
    m_GlyphRect:
      m_X: 266
      m_Y: 169
      m_Width: 25
      m_Height: 43
    m_Scale: 1
    m_AtlasIndex: 0
  - m_Index: 54
    m_Metrics:
      m_Width: 27.65625
      m_Height: 48.29688
      m_HorizontalBearingX: 0.546875
      m_HorizontalBearingY: 43.375
      m_HorizontalAdvance: 28.4375
    m_GlyphRect:
      m_X: 6
      m_Y: 455
      m_Width: 27
      m_Height: 48
    m_Scale: 1
    m_AtlasIndex: 0
  - m_Index: 55
    m_Metrics:
      m_Width: 24.78125
      m_Height: 43.5
      m_HorizontalBearingX: 1.3125
      m_HorizontalBearingY: 42.95313
      m_HorizontalAdvance: 26.57813
    m_GlyphRect:
      m_X: 146
      m_Y: 61
      m_Width: 25
      m_Height: 44
    m_Scale: 1
    m_AtlasIndex: 0
  - m_Index: 56
    m_Metrics:
      m_Width: 25.4375
      m_Height: 43.26563
      m_HorizontalBearingX: -0.953125
      m_HorizontalBearingY: 42.90625
      m_HorizontalAdvance: 24.78125
    m_GlyphRect:
      m_X: 283
      m_Y: 114
      m_Width: 25
      m_Height: 43
    m_Scale: 1
    m_AtlasIndex: 0
  - m_Index: 57
    m_Metrics:
      m_Width: 26.89063
      m_Height: 43.07813
      m_HorizontalBearingX: -0.484375
      m_HorizontalBearingY: 42.84375
      m_HorizontalAdvance: 25.6875
    m_GlyphRect:
      m_X: 249
      m_Y: 60
      m_Width: 26
      m_Height: 43
    m_Scale: 1
    m_AtlasIndex: 0
  - m_Index: 58
    m_Metrics:
      m_Width: 25.5625
      m_Height: 43.5625
      m_HorizontalBearingX: 1.078125
      m_HorizontalBearingY: 42.84375
      m_HorizontalAdvance: 27.71875
    m_GlyphRect:
      m_X: 75
      m_Y: 377
      m_Width: 26
      m_Height: 44
    m_Scale: 1
    m_AtlasIndex: 0
  - m_Index: 59
    m_Metrics:
      m_Width: 31.20313
      m_Height: 43.39063
      m_HorizontalBearingX: -0.359375
      m_HorizontalBearingY: 43.26563
      m_HorizontalAdvance: 30.25
    m_GlyphRect:
      m_X: 149
      m_Y: 356
      m_Width: 31
      m_Height: 43
    m_Scale: 1
    m_AtlasIndex: 0
  - m_Index: 60
    m_Metrics:
      m_Width: 37.07813
      m_Height: 43.5
      m_HorizontalBearingX: -0.0625
      m_HorizontalBearingY: 43.01563
      m_HorizontalAdvance: 37.14063
    m_GlyphRect:
      m_X: 198
      m_Y: 116
      m_Width: 37
      m_Height: 43
    m_Scale: 1
    m_AtlasIndex: 0
  - m_Index: 61
    m_Metrics:
      m_Width: 34.07813
      m_Height: 43.32813
      m_HorizontalBearingX: -0.59375
      m_HorizontalBearingY: 42.84375
      m_HorizontalAdvance: 32.82813
    m_GlyphRect:
      m_X: 204
      m_Y: 61
      m_Width: 34
      m_Height: 43
    m_Scale: 1
    m_AtlasIndex: 0
  - m_Index: 62
    m_Metrics:
      m_Width: 30.90625
      m_Height: 43.5625
      m_HorizontalBearingX: -0.84375
      m_HorizontalBearingY: 43.07813
      m_HorizontalAdvance: 29.21875
    m_GlyphRect:
      m_X: 154
      m_Y: 291
      m_Width: 31
      m_Height: 43
    m_Scale: 1
    m_AtlasIndex: 0
  - m_Index: 63
    m_Metrics:
      m_Width: 26.51563
      m_Height: 43.03125
      m_HorizontalBearingX: 0.0625
      m_HorizontalBearingY: 42.54688
      m_HorizontalAdvance: 26.9375
    m_GlyphRect:
      m_X: 196
      m_Y: 279
      m_Width: 27
      m_Height: 43
    m_Scale: 1
    m_AtlasIndex: 0
  - m_Index: 64
    m_Metrics:
      m_Width: 17.17188
      m_Height: 53.21875
      m_HorizontalBearingX: 1.3125
      m_HorizontalBearingY: 48.78125
      m_HorizontalAdvance: 21.48438
    m_GlyphRect:
      m_X: 6
      m_Y: 264
      m_Width: 17
      m_Height: 53
    m_Scale: 1
    m_AtlasIndex: 0
  - m_Index: 65
    m_Metrics:
      m_Width: 31.98438
      m_Height: 43.26563
      m_HorizontalBearingX: 3
      m_HorizontalBearingY: 43.6875
      m_HorizontalAdvance: 37.79688
    m_GlyphRect:
      m_X: 97
      m_Y: 126
      m_Width: 32
      m_Height: 44
    m_Scale: 1
    m_AtlasIndex: 0
  - m_Index: 66
    m_Metrics:
      m_Width: 17.28125
      m_Height: 53.21875
      m_HorizontalBearingX: 3
      m_HorizontalBearingY: 48.78125
      m_HorizontalAdvance: 21.35938
    m_GlyphRect:
      m_X: 6
      m_Y: 328
      m_Width: 17
      m_Height: 53
    m_Scale: 1
    m_AtlasIndex: 0
  - m_Index: 67
    m_Metrics:
      m_Width: 26.8125
      m_Height: 19.20313
      m_HorizontalBearingX: 3
      m_HorizontalBearingY: 43.5625
      m_HorizontalAdvance: 32.8125
    m_GlyphRect:
      m_X: 382
      m_Y: 162
      m_Width: 27
      m_Height: 20
    m_Scale: 1
    m_AtlasIndex: 0
  - m_Index: 68
    m_Metrics:
      m_Width: 29.28125
      m_Height: 7.6875
      m_HorizontalBearingX: 0.59375
      m_HorizontalBearingY: 7.625
      m_HorizontalAdvance: 30.48438
    m_GlyphRect:
      m_X: 360
      m_Y: 198
      m_Width: 29
      m_Height: 8
    m_Scale: 1
    m_AtlasIndex: 0
  - m_Index: 69
    m_Metrics:
      m_Width: 14.875
      m_Height: 16.26563
      m_HorizontalBearingX: 3
      m_HorizontalBearingY: 43.92188
      m_HorizontalAdvance: 18
    m_GlyphRect:
      m_X: 297
      m_Y: 463
      m_Width: 15
      m_Height: 16
    m_Scale: 1
    m_AtlasIndex: 0
  - m_Index: 70
    m_Metrics:
      m_Width: 26.10938
      m_Height: 40.20313
      m_HorizontalBearingX: 0.234375
      m_HorizontalBearingY: 39.71875
      m_HorizontalAdvance: 27.23438
    m_GlyphRect:
      m_X: 270
      m_Y: 278
      m_Width: 26
      m_Height: 40
    m_Scale: 1
    m_AtlasIndex: 0
  - m_Index: 71
    m_Metrics:
      m_Width: 26.46875
      m_Height: 44.39063
      m_HorizontalBearingX: 1.015625
      m_HorizontalBearingY: 44.15625
      m_HorizontalAdvance: 27.23438
    m_GlyphRect:
      m_X: 44
      m_Y: 454
      m_Width: 26
      m_Height: 44
    m_Scale: 1
    m_AtlasIndex: 0
  - m_Index: 72
    m_Metrics:
      m_Width: 26.15625
      m_Height: 39.54688
      m_HorizontalBearingX: 0.421875
      m_HorizontalBearingY: 39
      m_HorizontalAdvance: 26.76563
    m_GlyphRect:
      m_X: 265
      m_Y: 333
      m_Width: 27
      m_Height: 40
    m_Scale: 1
    m_AtlasIndex: 0
  - m_Index: 73
    m_Metrics:
      m_Width: 26.46875
      m_Height: 44.39063
      m_HorizontalBearingX: -0.125
      m_HorizontalBearingY: 44.15625
      m_HorizontalAdvance: 27.29688
    m_GlyphRect:
      m_X: 81
      m_Y: 454
      m_Width: 26
      m_Height: 44
    m_Scale: 1
    m_AtlasIndex: 0
  - m_Index: 74
    m_Metrics:
      m_Width: 25.92188
      m_Height: 39.125
      m_HorizontalBearingX: 0.59375
      m_HorizontalBearingY: 38.76563
      m_HorizontalAdvance: 27.125
    m_GlyphRect:
      m_X: 363
      m_Y: 6
      m_Width: 26
      m_Height: 39
    m_Scale: 1
    m_AtlasIndex: 0
  - m_Index: 75
    m_Metrics:
      m_Width: 25.375
      m_Height: 44.39063
      m_HorizontalBearingX: 0
      m_HorizontalBearingY: 44.15625
      m_HorizontalAdvance: 24.54688
    m_GlyphRect:
      m_X: 154
      m_Y: 6
      m_Width: 25
      m_Height: 44
    m_Scale: 1
    m_AtlasIndex: 0
  - m_Index: 76
    m_Metrics:
      m_Width: 25.07813
      m_Height: 46.90625
      m_HorizontalBearingX: 0.65625
      m_HorizontalBearingY: 38.45313
      m_HorizontalAdvance: 26.875
    m_GlyphRect:
      m_X: 38
      m_Y: 200
      m_Width: 25
      m_Height: 46
    m_Scale: 1
    m_AtlasIndex: 0
  - m_Index: 77
    m_Metrics:
      m_Width: 25.92188
      m_Height: 44.51563
      m_HorizontalBearingX: 1.015625
      m_HorizontalBearingY: 44.28125
      m_HorizontalAdvance: 27.42188
    m_GlyphRect:
      m_X: 118
      m_Y: 452
      m_Width: 26
      m_Height: 44
    m_Scale: 1
    m_AtlasIndex: 0
  - m_Index: 78
    m_Metrics:
      m_Width: 11.04688
      m_Height: 44.45313
      m_HorizontalBearingX: 1.015625
      m_HorizontalBearingY: 44.21875
      m_HorizontalAdvance: 13.01563
    m_GlyphRect:
      m_X: 182
      m_Y: 61
      m_Width: 11
      m_Height: 44
    m_Scale: 1
    m_AtlasIndex: 0
  - m_Index: 79
    m_Metrics:
      m_Width: 25.14063
      m_Height: 53.03125
      m_HorizontalBearingX: -0.546875
      m_HorizontalBearingY: 44.21875
      m_HorizontalAdvance: 25.6875
    m_GlyphRect:
      m_X: 6
      m_Y: 136
      m_Width: 26
      m_Height: 53
    m_Scale: 1
    m_AtlasIndex: 0
  - m_Index: 80
    m_Metrics:
      m_Width: 26.10938
      m_Height: 44.17188
      m_HorizontalBearingX: 1.078125
      m_HorizontalBearingY: 43.98438
      m_HorizontalAdvance: 27.42188
    m_GlyphRect:
      m_X: 81
      m_Y: 312
      m_Width: 26
      m_Height: 44
    m_Scale: 1
    m_AtlasIndex: 0
  - m_Index: 81
    m_Metrics:
      m_Width: 10.39063
      m_Height: 44.32813
      m_HorizontalBearingX: 1.015625
      m_HorizontalBearingY: 44.09375
      m_HorizontalAdvance: 12.59375
    m_GlyphRect:
      m_X: 190
      m_Y: 6
      m_Width: 10
      m_Height: 44
    m_Scale: 1
    m_AtlasIndex: 0
  - m_Index: 82
    m_Metrics:
      m_Width: 39
      m_Height: 39.95313
      m_HorizontalBearingX: 1.015625
      m_HorizontalBearingY: 39.71875
      m_HorizontalAdvance: 41.04688
    m_GlyphRect:
      m_X: 202
      m_Y: 399
      m_Width: 39
      m_Height: 40
    m_Scale: 1
    m_AtlasIndex: 0
  - m_Index: 83
    m_Metrics:
      m_Width: 25.20313
      m_Height: 39.82813
      m_HorizontalBearingX: 1.015625
      m_HorizontalBearingY: 39.59375
      m_HorizontalAdvance: 27.1875
    m_GlyphRect:
      m_X: 297
      m_Y: 223
      m_Width: 25
      m_Height: 40
    m_Scale: 1
    m_AtlasIndex: 0
  - m_Index: 84
    m_Metrics:
      m_Width: 29.03125
      m_Height: 39.67188
      m_HorizontalBearingX: -0.171875
      m_HorizontalBearingY: 39.1875
      m_HorizontalAdvance: 29.40625
    m_GlyphRect:
      m_X: 323
      m_Y: 6
      m_Width: 29
      m_Height: 39
    m_Scale: 1
    m_AtlasIndex: 0
  - m_Index: 85
    m_Metrics:
      m_Width: 26.46875
      m_Height: 44.40625
      m_HorizontalBearingX: 1.015625
      m_HorizontalBearingY: 39.125
      m_HorizontalAdvance: 27.23438
    m_GlyphRect:
      m_X: 112
      m_Y: 367
      m_Width: 26
      m_Height: 44
    m_Scale: 1
    m_AtlasIndex: 0
  - m_Index: 86
    m_Metrics:
      m_Width: 26.70313
      m_Height: 44.34375
      m_HorizontalBearingX: -0.234375
      m_HorizontalBearingY: 39.0625
      m_HorizontalAdvance: 27.48438
    m_GlyphRect:
      m_X: 155
      m_Y: 452
      m_Width: 26
      m_Height: 44
    m_Scale: 1
    m_AtlasIndex: 0
  - m_Index: 87
    m_Metrics:
      m_Width: 25.375
      m_Height: 39.42188
      m_HorizontalBearingX: 0.90625
      m_HorizontalBearingY: 39.23438
      m_HorizontalAdvance: 25.73438
    m_GlyphRect:
      m_X: 364
      m_Y: 56
      m_Width: 25
      m_Height: 39
    m_Scale: 1
    m_AtlasIndex: 0
  - m_Index: 88
    m_Metrics:
      m_Width: 25.20313
      m_Height: 38.89063
      m_HorizontalBearingX: -0.234375
      m_HorizontalBearingY: 38.34375
      m_HorizontalAdvance: 24.71875
    m_GlyphRect:
      m_X: 261
      m_Y: 441
      m_Width: 25
      m_Height: 39
    m_Scale: 1
    m_AtlasIndex: 0
  - m_Index: 89
    m_Metrics:
      m_Width: 25.39063
      m_Height: 44.40625
      m_HorizontalBearingX: -0.125
      m_HorizontalBearingY: 44.40625
      m_HorizontalAdvance: 24.71875
    m_GlyphRect:
      m_X: 118
      m_Y: 301
      m_Width: 25
      m_Height: 44
    m_Scale: 1
    m_AtlasIndex: 0
  - m_Index: 90
    m_Metrics:
      m_Width: 25.20313
      m_Height: 39.84375
      m_HorizontalBearingX: 0.953125
      m_HorizontalBearingY: 39.29688
      m_HorizontalAdvance: 27.1875
    m_GlyphRect:
      m_X: 302
      m_Y: 168
      m_Width: 25
      m_Height: 40
    m_Scale: 1
    m_AtlasIndex: 0
  - m_Index: 91
    m_Metrics:
      m_Width: 29.39063
      m_Height: 38.45313
      m_HorizontalBearingX: -0.234375
      m_HorizontalBearingY: 40.3125
      m_HorizontalAdvance: 28.85938
    m_GlyphRect:
      m_X: 274
      m_Y: 384
      m_Width: 29
      m_Height: 38
    m_Scale: 1
    m_AtlasIndex: 0
  - m_Index: 92
    m_Metrics:
      m_Width: 39
      m_Height: 39.90625
      m_HorizontalBearingX: 0.953125
      m_HorizontalBearingY: 39.48438
      m_HorizontalAdvance: 41.04688
    m_GlyphRect:
      m_X: 319
      m_Y: 114
      m_Width: 39
      m_Height: 39
    m_Scale: 1
    m_AtlasIndex: 0
  - m_Index: 93
    m_Metrics:
      m_Width: 32.28125
      m_Height: 38.76563
      m_HorizontalBearingX: -0.484375
      m_HorizontalBearingY: 39.54688
      m_HorizontalAdvance: 31.20313
    m_GlyphRect:
      m_X: 321
      m_Y: 60
      m_Width: 32
      m_Height: 39
    m_Scale: 1
    m_AtlasIndex: 0
  - m_Index: 94
    m_Metrics:
      m_Width: 25.67188
      m_Height: 46.98438
      m_HorizontalBearingX: 0.84375
      m_HorizontalBearingY: 39.29688
      m_HorizontalAdvance: 27.65625
    m_GlyphRect:
      m_X: 34
      m_Y: 264
      m_Width: 26
      m_Height: 47
    m_Scale: 1
    m_AtlasIndex: 0
  - m_Index: 95
    m_Metrics:
      m_Width: 24.78125
      m_Height: 38.45313
      m_HorizontalBearingX: 0.421875
      m_HorizontalBearingY: 39.23438
      m_HorizontalAdvance: 25.625
    m_GlyphRect:
      m_X: 303
      m_Y: 329
      m_Width: 25
      m_Height: 38
    m_Scale: 1
    m_AtlasIndex: 0
  - m_Index: 96
    m_Metrics:
      m_Width: 25.98438
      m_Height: 53.57813
      m_HorizontalBearingX: 3
      m_HorizontalBearingY: 48.71875
      m_HorizontalAdvance: 31.98438
    m_GlyphRect:
      m_X: 6
      m_Y: 6
      m_Width: 26
      m_Height: 54
    m_Scale: 1
    m_AtlasIndex: 0
  - m_Index: 97
    m_Metrics:
      m_Width: 10.5625
      m_Height: 53.51563
      m_HorizontalBearingX: 1.3125
      m_HorizontalBearingY: 48.71875
      m_HorizontalAdvance: 12.95313
    m_GlyphRect:
      m_X: 6
      m_Y: 71
      m_Width: 11
      m_Height: 54
    m_Scale: 1
    m_AtlasIndex: 0
  - m_Index: 98
    m_Metrics:
      m_Width: 25.98438
      m_Height: 53.51563
      m_HorizontalBearingX: 3
      m_HorizontalBearingY: 49.07813
      m_HorizontalAdvance: 31.98438
    m_GlyphRect:
      m_X: 28
      m_Y: 71
      m_Width: 26
      m_Height: 53
    m_Scale: 1
    m_AtlasIndex: 0
  - m_Index: 99
    m_Metrics:
      m_Width: 26.34375
      m_Height: 11.28125
      m_HorizontalBearingX: 0.421875
      m_HorizontalBearingY: 29.34375
      m_HorizontalAdvance: 27.23438
    m_GlyphRect:
      m_X: 38
      m_Y: 432
      m_Width: 27
      m_Height: 11
    m_Scale: 1
    m_AtlasIndex: 0
  - m_Index: 100
    m_Metrics:
      m_Width: 0
      m_Height: 0
      m_HorizontalBearingX: 0
      m_HorizontalBearingY: 0
      m_HorizontalAdvance: 13.6875
    m_GlyphRect:
      m_X: 0
      m_Y: 0
      m_Width: 0
      m_Height: 0
    m_Scale: 1
    m_AtlasIndex: 0
  m_CharacterTable:
  - m_ElementType: 1
    m_Unicode: 32
    m_GlyphIndex: 5
    m_Scale: 1
  - m_ElementType: 1
    m_Unicode: 33
    m_GlyphIndex: 6
    m_Scale: 1
  - m_ElementType: 1
    m_Unicode: 34
    m_GlyphIndex: 7
    m_Scale: 1
  - m_ElementType: 1
    m_Unicode: 35
    m_GlyphIndex: 8
    m_Scale: 1
  - m_ElementType: 1
    m_Unicode: 36
    m_GlyphIndex: 9
    m_Scale: 1
  - m_ElementType: 1
    m_Unicode: 37
    m_GlyphIndex: 10
    m_Scale: 1
  - m_ElementType: 1
    m_Unicode: 38
    m_GlyphIndex: 11
    m_Scale: 1
  - m_ElementType: 1
    m_Unicode: 39
    m_GlyphIndex: 12
    m_Scale: 1
  - m_ElementType: 1
    m_Unicode: 40
    m_GlyphIndex: 13
    m_Scale: 1
  - m_ElementType: 1
    m_Unicode: 41
    m_GlyphIndex: 14
    m_Scale: 1
  - m_ElementType: 1
    m_Unicode: 42
    m_GlyphIndex: 15
    m_Scale: 1
  - m_ElementType: 1
    m_Unicode: 43
    m_GlyphIndex: 16
    m_Scale: 1
  - m_ElementType: 1
    m_Unicode: 44
    m_GlyphIndex: 17
    m_Scale: 1
  - m_ElementType: 1
    m_Unicode: 45
    m_GlyphIndex: 18
    m_Scale: 1
  - m_ElementType: 1
    m_Unicode: 46
    m_GlyphIndex: 19
    m_Scale: 1
  - m_ElementType: 1
    m_Unicode: 47
    m_GlyphIndex: 20
    m_Scale: 1
  - m_ElementType: 1
    m_Unicode: 48
    m_GlyphIndex: 21
    m_Scale: 1
  - m_ElementType: 1
    m_Unicode: 49
    m_GlyphIndex: 22
    m_Scale: 1
  - m_ElementType: 1
    m_Unicode: 50
    m_GlyphIndex: 23
    m_Scale: 1
  - m_ElementType: 1
    m_Unicode: 51
    m_GlyphIndex: 24
    m_Scale: 1
  - m_ElementType: 1
    m_Unicode: 52
    m_GlyphIndex: 25
    m_Scale: 1
  - m_ElementType: 1
    m_Unicode: 53
    m_GlyphIndex: 26
    m_Scale: 1
  - m_ElementType: 1
    m_Unicode: 54
    m_GlyphIndex: 27
    m_Scale: 1
  - m_ElementType: 1
    m_Unicode: 55
    m_GlyphIndex: 28
    m_Scale: 1
  - m_ElementType: 1
    m_Unicode: 56
    m_GlyphIndex: 29
    m_Scale: 1
  - m_ElementType: 1
    m_Unicode: 57
    m_GlyphIndex: 30
    m_Scale: 1
  - m_ElementType: 1
    m_Unicode: 58
    m_GlyphIndex: 31
    m_Scale: 1
  - m_ElementType: 1
    m_Unicode: 59
    m_GlyphIndex: 32
    m_Scale: 1
  - m_ElementType: 1
    m_Unicode: 60
    m_GlyphIndex: 33
    m_Scale: 1
  - m_ElementType: 1
    m_Unicode: 61
    m_GlyphIndex: 34
    m_Scale: 1
  - m_ElementType: 1
    m_Unicode: 62
    m_GlyphIndex: 35
    m_Scale: 1
  - m_ElementType: 1
    m_Unicode: 63
    m_GlyphIndex: 36
    m_Scale: 1
  - m_ElementType: 1
    m_Unicode: 64
    m_GlyphIndex: 37
    m_Scale: 1
  - m_ElementType: 1
    m_Unicode: 65
    m_GlyphIndex: 38
    m_Scale: 1
  - m_ElementType: 1
    m_Unicode: 66
    m_GlyphIndex: 39
    m_Scale: 1
  - m_ElementType: 1
    m_Unicode: 67
    m_GlyphIndex: 40
    m_Scale: 1
  - m_ElementType: 1
    m_Unicode: 68
    m_GlyphIndex: 41
    m_Scale: 1
  - m_ElementType: 1
    m_Unicode: 69
    m_GlyphIndex: 42
    m_Scale: 1
  - m_ElementType: 1
    m_Unicode: 70
    m_GlyphIndex: 43
    m_Scale: 1
  - m_ElementType: 1
    m_Unicode: 71
    m_GlyphIndex: 44
    m_Scale: 1
  - m_ElementType: 1
    m_Unicode: 72
    m_GlyphIndex: 45
    m_Scale: 1
  - m_ElementType: 1
    m_Unicode: 73
    m_GlyphIndex: 46
    m_Scale: 1
  - m_ElementType: 1
    m_Unicode: 74
    m_GlyphIndex: 47
    m_Scale: 1
  - m_ElementType: 1
    m_Unicode: 75
    m_GlyphIndex: 48
    m_Scale: 1
  - m_ElementType: 1
    m_Unicode: 76
    m_GlyphIndex: 49
    m_Scale: 1
  - m_ElementType: 1
    m_Unicode: 77
    m_GlyphIndex: 50
    m_Scale: 1
  - m_ElementType: 1
    m_Unicode: 78
    m_GlyphIndex: 51
    m_Scale: 1
  - m_ElementType: 1
    m_Unicode: 79
    m_GlyphIndex: 52
    m_Scale: 1
  - m_ElementType: 1
    m_Unicode: 80
    m_GlyphIndex: 53
    m_Scale: 1
  - m_ElementType: 1
    m_Unicode: 81
    m_GlyphIndex: 54
    m_Scale: 1
  - m_ElementType: 1
    m_Unicode: 82
    m_GlyphIndex: 55
    m_Scale: 1
  - m_ElementType: 1
    m_Unicode: 83
    m_GlyphIndex: 56
    m_Scale: 1
  - m_ElementType: 1
    m_Unicode: 84
    m_GlyphIndex: 57
    m_Scale: 1
  - m_ElementType: 1
    m_Unicode: 85
    m_GlyphIndex: 58
    m_Scale: 1
  - m_ElementType: 1
    m_Unicode: 86
    m_GlyphIndex: 59
    m_Scale: 1
  - m_ElementType: 1
    m_Unicode: 87
    m_GlyphIndex: 60
    m_Scale: 1
  - m_ElementType: 1
    m_Unicode: 88
    m_GlyphIndex: 61
    m_Scale: 1
  - m_ElementType: 1
    m_Unicode: 89
    m_GlyphIndex: 62
    m_Scale: 1
  - m_ElementType: 1
    m_Unicode: 90
    m_GlyphIndex: 63
    m_Scale: 1
  - m_ElementType: 1
    m_Unicode: 91
    m_GlyphIndex: 64
    m_Scale: 1
  - m_ElementType: 1
    m_Unicode: 92
    m_GlyphIndex: 65
    m_Scale: 1
  - m_ElementType: 1
    m_Unicode: 93
    m_GlyphIndex: 66
    m_Scale: 1
  - m_ElementType: 1
    m_Unicode: 94
    m_GlyphIndex: 67
    m_Scale: 1
  - m_ElementType: 1
    m_Unicode: 95
    m_GlyphIndex: 68
    m_Scale: 1
  - m_ElementType: 1
    m_Unicode: 96
    m_GlyphIndex: 69
    m_Scale: 1
  - m_ElementType: 1
    m_Unicode: 97
    m_GlyphIndex: 70
    m_Scale: 1
  - m_ElementType: 1
    m_Unicode: 98
    m_GlyphIndex: 71
    m_Scale: 1
  - m_ElementType: 1
    m_Unicode: 99
    m_GlyphIndex: 72
    m_Scale: 1
  - m_ElementType: 1
    m_Unicode: 100
    m_GlyphIndex: 73
    m_Scale: 1
  - m_ElementType: 1
    m_Unicode: 101
    m_GlyphIndex: 74
    m_Scale: 1
  - m_ElementType: 1
    m_Unicode: 102
    m_GlyphIndex: 75
    m_Scale: 1
  - m_ElementType: 1
    m_Unicode: 103
    m_GlyphIndex: 76
    m_Scale: 1
  - m_ElementType: 1
    m_Unicode: 104
    m_GlyphIndex: 77
    m_Scale: 1
  - m_ElementType: 1
    m_Unicode: 105
    m_GlyphIndex: 78
    m_Scale: 1
  - m_ElementType: 1
    m_Unicode: 106
    m_GlyphIndex: 79
    m_Scale: 1
  - m_ElementType: 1
    m_Unicode: 107
    m_GlyphIndex: 80
    m_Scale: 1
  - m_ElementType: 1
    m_Unicode: 108
    m_GlyphIndex: 81
    m_Scale: 1
  - m_ElementType: 1
    m_Unicode: 109
    m_GlyphIndex: 82
    m_Scale: 1
  - m_ElementType: 1
    m_Unicode: 110
    m_GlyphIndex: 83
    m_Scale: 1
  - m_ElementType: 1
    m_Unicode: 111
    m_GlyphIndex: 84
    m_Scale: 1
  - m_ElementType: 1
    m_Unicode: 112
    m_GlyphIndex: 85
    m_Scale: 1
  - m_ElementType: 1
    m_Unicode: 113
    m_GlyphIndex: 86
    m_Scale: 1
  - m_ElementType: 1
    m_Unicode: 114
    m_GlyphIndex: 87
    m_Scale: 1
  - m_ElementType: 1
    m_Unicode: 115
    m_GlyphIndex: 88
    m_Scale: 1
  - m_ElementType: 1
    m_Unicode: 116
    m_GlyphIndex: 89
    m_Scale: 1
  - m_ElementType: 1
    m_Unicode: 117
    m_GlyphIndex: 90
    m_Scale: 1
  - m_ElementType: 1
    m_Unicode: 118
    m_GlyphIndex: 91
    m_Scale: 1
  - m_ElementType: 1
    m_Unicode: 119
    m_GlyphIndex: 92
    m_Scale: 1
  - m_ElementType: 1
    m_Unicode: 120
    m_GlyphIndex: 93
    m_Scale: 1
  - m_ElementType: 1
    m_Unicode: 121
    m_GlyphIndex: 94
    m_Scale: 1
  - m_ElementType: 1
    m_Unicode: 122
    m_GlyphIndex: 95
    m_Scale: 1
  - m_ElementType: 1
    m_Unicode: 123
    m_GlyphIndex: 96
    m_Scale: 1
  - m_ElementType: 1
    m_Unicode: 124
    m_GlyphIndex: 97
    m_Scale: 1
  - m_ElementType: 1
    m_Unicode: 125
    m_GlyphIndex: 98
    m_Scale: 1
  - m_ElementType: 1
    m_Unicode: 126
    m_GlyphIndex: 99
    m_Scale: 1
  - m_ElementType: 1
    m_Unicode: 160
    m_GlyphIndex: 100
    m_Scale: 1
  m_AtlasTextures:
  - {fileID: 2800000, guid: 59c8697bf10d485abdd3f0edf81230c3, type: 3}
  m_AtlasTextureIndex: 0
  m_IsMultiAtlasTexturesEnabled: 0
  m_ClearDynamicDataOnBuild: 0
  m_UsedGlyphRects:
  - m_X: 0
    m_Y: 0
    m_Width: 37
    m_Height: 65
  - m_X: 0
    m_Y: 65
    m_Width: 22
    m_Height: 65
  - m_X: 0
    m_Y: 130
    m_Width: 37
    m_Height: 64
  - m_X: 22
    m_Y: 65
    m_Width: 37
    m_Height: 64
  - m_X: 37
    m_Y: 0
    m_Width: 36
    m_Height: 64
  - m_X: 0
    m_Y: 194
    m_Width: 32
    m_Height: 64
  - m_X: 0
    m_Y: 258
    m_Width: 28
    m_Height: 64
  - m_X: 0
    m_Y: 322
    m_Width: 28
    m_Height: 64
  - m_X: 0
    m_Y: 386
    m_Width: 32
    m_Height: 63
  - m_X: 0
    m_Y: 449
    m_Width: 38
    m_Height: 59
  - m_X: 28
    m_Y: 258
    m_Width: 37
    m_Height: 58
  - m_X: 32
    m_Y: 194
    m_Width: 36
    m_Height: 57
  - m_X: 37
    m_Y: 129
    m_Width: 54
    m_Height: 56
  - m_X: 59
    m_Y: 64
    m_Width: 43
    m_Height: 56
  - m_X: 73
    m_Y: 0
    m_Width: 37
    m_Height: 56
  - m_X: 28
    m_Y: 316
    m_Width: 47
    m_Height: 55
  - m_X: 65
    m_Y: 251
    m_Width: 44
    m_Height: 55
  - m_X: 68
    m_Y: 185
    m_Width: 43
    m_Height: 55
  - m_X: 91
    m_Y: 120
    m_Width: 43
    m_Height: 55
  - m_X: 102
    m_Y: 56
    m_Width: 38
    m_Height: 55
  - m_X: 110
    m_Y: 0
    m_Width: 38
    m_Height: 55
  - m_X: 32
    m_Y: 371
    m_Width: 37
    m_Height: 55
  - m_X: 32
    m_Y: 426
    m_Width: 38
    m_Height: 22
  - m_X: 69
    m_Y: 371
    m_Width: 37
    m_Height: 55
  - m_X: 38
    m_Y: 448
    m_Width: 37
    m_Height: 55
  - m_X: 70
    m_Y: 426
    m_Width: 31
    m_Height: 22
  - m_X: 75
    m_Y: 448
    m_Width: 37
    m_Height: 55
  - m_X: 101
    m_Y: 426
    m_Width: 22
    m_Height: 20
  - m_X: 112
    m_Y: 446
    m_Width: 37
    m_Height: 55
  - m_X: 75
    m_Y: 306
    m_Width: 37
    m_Height: 55
  - m_X: 106
    m_Y: 361
    m_Width: 37
    m_Height: 55
  - m_X: 123
    m_Y: 416
    m_Width: 32
    m_Height: 30
  - m_X: 149
    m_Y: 446
    m_Width: 37
    m_Height: 55
  - m_X: 109
    m_Y: 240
    m_Width: 36
    m_Height: 55
  - m_X: 111
    m_Y: 175
    m_Width: 36
    m_Height: 55
  - m_X: 134
    m_Y: 111
    m_Width: 36
    m_Height: 55
  - m_X: 140
    m_Y: 55
    m_Width: 36
    m_Height: 55
  - m_X: 148
    m_Y: 0
    m_Width: 36
    m_Height: 55
  - m_X: 112
    m_Y: 295
    m_Width: 36
    m_Height: 55
  - m_X: 145
    m_Y: 230
    m_Width: 35
    m_Height: 55
  - m_X: 147
    m_Y: 166
    m_Width: 27
    m_Height: 55
  - m_X: 170
    m_Y: 110
    m_Width: 22
    m_Height: 55
  - m_X: 176
    m_Y: 55
    m_Width: 22
    m_Height: 55
  - m_X: 184
    m_Y: 0
    m_Width: 21
    m_Height: 55
  - m_X: 174
    m_Y: 165
    m_Width: 49
    m_Height: 54
  - m_X: 192
    m_Y: 110
    m_Width: 48
    m_Height: 54
  - m_X: 198
    m_Y: 55
    m_Width: 45
    m_Height: 54
  - m_X: 205
    m_Y: 0
    m_Width: 42
    m_Height: 54
  - m_X: 143
    m_Y: 350
    m_Width: 42
    m_Height: 54
  - m_X: 155
    m_Y: 404
    m_Width: 41
    m_Height: 40
  - m_X: 148
    m_Y: 285
    m_Width: 42
    m_Height: 54
  - m_X: 185
    m_Y: 339
    m_Width: 38
    m_Height: 54
  - m_X: 180
    m_Y: 219
    m_Width: 38
    m_Height: 54
  - m_X: 190
    m_Y: 273
    m_Width: 38
    m_Height: 54
  - m_X: 218
    m_Y: 219
    m_Width: 37
    m_Height: 54
  - m_X: 223
    m_Y: 164
    m_Width: 37
    m_Height: 54
  - m_X: 240
    m_Y: 109
    m_Width: 37
    m_Height: 54
  - m_X: 243
    m_Y: 54
    m_Width: 37
    m_Height: 54
  - m_X: 247
    m_Y: 0
    m_Width: 36
    m_Height: 54
  - m_X: 186
    m_Y: 444
    m_Width: 36
    m_Height: 54
  - m_X: 196
    m_Y: 393
    m_Width: 50
    m_Height: 51
  - m_X: 223
    m_Y: 327
    m_Width: 36
    m_Height: 54
  - m_X: 228
    m_Y: 273
    m_Width: 36
    m_Height: 54
  - m_X: 255
    m_Y: 218
    m_Width: 36
    m_Height: 54
  - m_X: 260
    m_Y: 163
    m_Width: 36
    m_Height: 54
  - m_X: 277
    m_Y: 108
    m_Width: 36
    m_Height: 54
  - m_X: 280
    m_Y: 54
    m_Width: 35
    m_Height: 54
  - m_X: 283
    m_Y: 0
    m_Width: 34
    m_Height: 54
  - m_X: 222
    m_Y: 444
    m_Width: 33
    m_Height: 54
  - m_X: 246
    m_Y: 381
    m_Width: 22
    m_Height: 54
  - m_X: 259
    m_Y: 327
    m_Width: 38
    m_Height: 51
  - m_X: 264
    m_Y: 272
    m_Width: 37
    m_Height: 51
  - m_X: 291
    m_Y: 217
    m_Width: 36
    m_Height: 51
  - m_X: 296
    m_Y: 162
    m_Width: 36
    m_Height: 51
  - m_X: 313
    m_Y: 108
    m_Width: 50
    m_Height: 50
  - m_X: 315
    m_Y: 54
    m_Width: 43
    m_Height: 50
  - m_X: 317
    m_Y: 0
    m_Width: 40
    m_Height: 50
  - m_X: 357
    m_Y: 0
    m_Width: 37
    m_Height: 50
  - m_X: 358
    m_Y: 50
    m_Width: 36
    m_Height: 50
  - m_X: 255
    m_Y: 435
    m_Width: 36
    m_Height: 50
  - m_X: 255
    m_Y: 485
    m_Width: 34
    m_Height: 24
  - m_X: 289
    m_Y: 485
    m_Width: 21
    m_Height: 24
  - m_X: 268
    m_Y: 378
    m_Width: 40
    m_Height: 49
  - m_X: 297
    m_Y: 323
    m_Width: 36
    m_Height: 49
  - m_X: 301
    m_Y: 268
    m_Width: 35
    m_Height: 45
  - m_X: 327
    m_Y: 213
    m_Width: 35
    m_Height: 45
  - m_X: 332
    m_Y: 158
    m_Width: 22
    m_Height: 38
  - m_X: 354
    m_Y: 158
    m_Width: 22
    m_Height: 34
  - m_X: 354
    m_Y: 192
    m_Width: 40
    m_Height: 19
  - m_X: 363
    m_Y: 100
    m_Width: 31
    m_Height: 32
  - m_X: 363
    m_Y: 132
    m_Width: 21
    m_Height: 24
  - m_X: 376
    m_Y: 156
    m_Width: 38
    m_Height: 31
  - m_X: 291
    m_Y: 427
    m_Width: 31
    m_Height: 30
  - m_X: 291
    m_Y: 457
    m_Width: 26
    m_Height: 27
  m_FreeGlyphRects:
  - m_X: 22
    m_Y: 129
    m_Width: 15
    m_Height: 1
  - m_X: 37
    m_Y: 64
    m_Width: 22
    m_Height: 1
  - m_X: 32
    m_Y: 251
    m_Width: 33
    m_Height: 7
  - m_X: 37
    m_Y: 185
    m_Width: 31
    m_Height: 9
  - m_X: 59
    m_Y: 120
    m_Width: 32
    m_Height: 9
  - m_X: 73
    m_Y: 56
    m_Width: 29
    m_Height: 8
  - m_X: 28
    m_Y: 371
    m_Width: 4
    m_Height: 15
  - m_X: 32
    m_Y: 448
    m_Width: 6
    m_Height: 1
  - m_X: 101
    m_Y: 446
    m_Width: 11
    m_Height: 2
  - m_X: 65
    m_Y: 306
    m_Width: 10
    m_Height: 10
  - m_X: 75
    m_Y: 361
    m_Width: 31
    m_Height: 10
  - m_X: 106
    m_Y: 416
    m_Width: 17
    m_Height: 10
  - m_X: 68
    m_Y: 240
    m_Width: 41
    m_Height: 11
  - m_X: 91
    m_Y: 175
    m_Width: 20
    m_Height: 10
  - m_X: 102
    m_Y: 111
    m_Width: 32
    m_Height: 9
  - m_X: 110
    m_Y: 55
    m_Width: 30
    m_Height: 1
  - m_X: 109
    m_Y: 295
    m_Width: 3
    m_Height: 11
  - m_X: 111
    m_Y: 230
    m_Width: 34
    m_Height: 10
  - m_X: 134
    m_Y: 166
    m_Width: 13
    m_Height: 9
  - m_X: 140
    m_Y: 110
    m_Width: 30
    m_Height: 1
  - m_X: 170
    m_Y: 165
    m_Width: 4
    m_Height: 1
  - m_X: 112
    m_Y: 350
    m_Width: 31
    m_Height: 11
  - m_X: 143
    m_Y: 404
    m_Width: 12
    m_Height: 12
  - m_X: 145
    m_Y: 285
    m_Width: 3
    m_Height: 10
  - m_X: 148
    m_Y: 339
    m_Width: 37
    m_Height: 11
  - m_X: 147
    m_Y: 221
    m_Width: 33
    m_Height: 9
  - m_X: 174
    m_Y: 219
    m_Width: 6
    m_Height: 11
  - m_X: 180
    m_Y: 273
    m_Width: 10
    m_Height: 12
  - m_X: 192
    m_Y: 164
    m_Width: 31
    m_Height: 1
  - m_X: 198
    m_Y: 109
    m_Width: 42
    m_Height: 1
  - m_X: 205
    m_Y: 54
    m_Width: 38
    m_Height: 1
  - m_X: 155
    m_Y: 444
    m_Width: 31
    m_Height: 2
  - m_X: 185
    m_Y: 393
    m_Width: 11
    m_Height: 11
  - m_X: 190
    m_Y: 327
    m_Width: 33
    m_Height: 12
  - m_X: 223
    m_Y: 218
    m_Width: 32
    m_Height: 1
  - m_X: 240
    m_Y: 163
    m_Width: 20
    m_Height: 1
  - m_X: 243
    m_Y: 108
    m_Width: 34
    m_Height: 1
  - m_X: 223
    m_Y: 381
    m_Width: 23
    m_Height: 12
  - m_X: 255
    m_Y: 272
    m_Width: 9
    m_Height: 1
  - m_X: 260
    m_Y: 217
    m_Width: 31
    m_Height: 1
  - m_X: 277
    m_Y: 162
    m_Width: 19
    m_Height: 1
  - m_X: 317
    m_Y: 50
    m_Width: 41
    m_Height: 4
  - m_X: 246
    m_Y: 435
    m_Width: 9
    m_Height: 9
  - m_X: 0
    m_Y: 509
    m_Width: 511
    m_Height: 2
  - m_X: 0
    m_Y: 508
    m_Width: 255
    m_Height: 3
  - m_X: 38
    m_Y: 503
    m_Width: 217
    m_Height: 8
  - m_X: 112
    m_Y: 501
    m_Width: 143
    m_Height: 10
  - m_X: 186
    m_Y: 498
    m_Width: 69
    m_Height: 13
  - m_X: 259
    m_Y: 378
    m_Width: 9
    m_Height: 3
  - m_X: 264
    m_Y: 323
    m_Width: 33
    m_Height: 4
  - m_X: 297
    m_Y: 372
    m_Width: 214
    m_Height: 6
  - m_X: 291
    m_Y: 268
    m_Width: 10
    m_Height: 4
  - m_X: 333
    m_Y: 313
    m_Width: 178
    m_Height: 198
  - m_X: 301
    m_Y: 313
    m_Width: 210
    m_Height: 10
  - m_X: 296
    m_Y: 213
    m_Width: 31
    m_Height: 4
  - m_X: 327
    m_Y: 258
    m_Width: 184
    m_Height: 10
  - m_X: 336
    m_Y: 258
    m_Width: 175
    m_Height: 253
  - m_X: 313
    m_Y: 158
    m_Width: 19
    m_Height: 4
  - m_X: 332
    m_Y: 211
    m_Width: 179
    m_Height: 2
  - m_X: 332
    m_Y: 196
    m_Width: 22
    m_Height: 17
  - m_X: 362
    m_Y: 211
    m_Width: 149
    m_Height: 300
  - m_X: 315
    m_Y: 104
    m_Width: 48
    m_Height: 4
  - m_X: 358
    m_Y: 100
    m_Width: 5
    m_Height: 8
  - m_X: 394
    m_Y: 0
    m_Width: 117
    m_Height: 156
  - m_X: 394
    m_Y: 187
    m_Width: 117
    m_Height: 324
  - m_X: 414
    m_Y: 0
    m_Width: 97
    m_Height: 511
  - m_X: 363
    m_Y: 156
    m_Width: 13
    m_Height: 2
  - m_X: 376
    m_Y: 187
    m_Width: 135
    m_Height: 5
  - m_X: 384
    m_Y: 132
    m_Width: 127
    m_Height: 24
  - m_X: 268
    m_Y: 427
    m_Width: 23
    m_Height: 8
  - m_X: 322
    m_Y: 372
    m_Width: 189
    m_Height: 139
  - m_X: 308
    m_Y: 372
    m_Width: 203
    m_Height: 55
  - m_X: 291
    m_Y: 484
    m_Width: 220
    m_Height: 1
  - m_X: 310
    m_Y: 484
    m_Width: 201
    m_Height: 27
  - m_X: 317
    m_Y: 457
    m_Width: 194
    m_Height: 54
  m_fontInfo:
    Name: 
    PointSize: 0
    Scale: 0
    CharacterCount: 0
    LineHeight: 0
    Baseline: 0
    Ascender: 0
    CapHeight: 0
    Descender: 0
    CenterLine: 0
    SuperscriptOffset: 0
    SubscriptOffset: 0
    SubSize: 0
    Underline: 0
    UnderlineThickness: 0
    strikethrough: 0
    strikethroughThickness: 0
    TabWidth: 0
    Padding: 0
    AtlasWidth: 0
    AtlasHeight: 0
  atlas: {fileID: 0}
  m_AtlasWidth: 512
  m_AtlasHeight: 512
  m_AtlasPadding: 5
  m_AtlasRenderMode: 32806
  m_glyphInfoList: []
  m_KerningTable:
    kerningPairs: []
  m_FontFeatureTable:
    m_GlyphPairAdjustmentRecords: []
  fallbackFontAssets: []
  m_FallbackFontAssetTable: []
  m_CreationSettings:
    sourceFontFileName: 
    sourceFontFileGUID: "851bc87b4eebc574699f5e746e6ef192"
    pointSizeSamplingMode: 1
    pointSize: 60
    padding: 5
    packingMode: 0
    atlasWidth: 512
    atlasHeight: 512
    characterSetSelectionMode: 0
    characterSequence: "32 - 126, 160, 8203, 8230, 9633"
    referencedFontAssetGUID: 
    referencedTextAssetGUID: 
    fontStyle: 0
    fontStyleModifier: 0
    renderMode: 32806
    includeFontFeatures: 0
  m_FontWeightTable:
  - regularTypeface: {fileID: 0}
    italicTypeface: {fileID: 0}
  - regularTypeface: {fileID: 0}
    italicTypeface: {fileID: 0}
  - regularTypeface: {fileID: 0}
    italicTypeface: {fileID: 0}
  - regularTypeface: {fileID: 0}
    italicTypeface: {fileID: 0}
  - regularTypeface: {fileID: 0}
    italicTypeface: {fileID: 0}
  - regularTypeface: {fileID: 0}
    italicTypeface: {fileID: 0}
  - regularTypeface: {fileID: 0}
    italicTypeface: {fileID: 0}
  - regularTypeface: {fileID: 0}
    italicTypeface: {fileID: 0}
  - regularTypeface: {fileID: 0}
    italicTypeface: {fileID: 0}
  - regularTypeface: {fileID: 0}
    italicTypeface: {fileID: 0}
  fontWeights: []
  normalStyle: 0
  normalSpacingOffset: 0
  boldStyle: 0.75
  boldSpacing: 7
  italicStyle: 35
  tabSize: 10
