%YAML 1.1
%TAG !u! tag:unity3d.com,2011:
--- !u!90 &9000000
Avatar:
  m_ObjectHideFlags: 0
  m_PrefabParentObject: {fileID: 0}
  m_PrefabInternal: {fileID: 0}
  m_Name: "agoi_blueAvatar"
  m_AvatarSize: 7976
  m_Avatar:
    serializedVersion: 3
    m_AvatarSkeleton:
      data:
        m_Node:
        - m_ParentId: -1
          m_AxesId: -1
        - m_ParentId: 0
          m_AxesId: -1
        - m_ParentId: 0
          m_AxesId: -1
        - m_ParentId: 2
          m_AxesId: -1
        - m_ParentId: 3
          m_AxesId: -1
        - m_ParentId: 4
          m_AxesId: -1
        - m_ParentId: 5
          m_AxesId: -1
        - m_ParentId: 6
          m_AxesId: -1
        - m_ParentId: 7
          m_AxesId: -1
        - m_ParentId: 7
          m_AxesId: -1
        - m_ParentId: 7
          m_AxesId: -1
        - m_ParentId: 10
          m_AxesId: -1
        - m_ParentId: 11
          m_AxesId: -1
        - m_ParentId: 12
          m_AxesId: -1
        - m_ParentId: 13
          m_AxesId: -1
        - m_ParentId: 14
          m_AxesId: -1
        - m_ParentId: 6
          m_AxesId: -1
        - m_ParentId: 16
          m_AxesId: -1
        - m_ParentId: 17
          m_AxesId: -1
        - m_ParentId: 18
          m_AxesId: -1
        - m_ParentId: 6
          m_AxesId: -1
        - m_ParentId: 20
          m_AxesId: -1
        - m_ParentId: 21
          m_AxesId: -1
        - m_ParentId: 22
          m_AxesId: -1
        - m_ParentId: 4
          m_AxesId: -1
        - m_ParentId: 24
          m_AxesId: -1
        - m_ParentId: 25
          m_AxesId: -1
        - m_ParentId: 26
          m_AxesId: -1
        - m_ParentId: 4
          m_AxesId: -1
        - m_ParentId: 28
          m_AxesId: -1
        - m_ParentId: 29
          m_AxesId: -1
        - m_ParentId: 30
          m_AxesId: -1
        m_ID: 00000000ff7e32203d6cbca629d2f1fd4a870984b294a63696e35dc8c80b09354ede5f7267ce4ef4c1f1ab7ada255132532720f968e27b05f044764850b292fbf81c463cbfad6a379fa3d8f827ca2f77a3ad2105922b411da715c9e6f5aab7ba5eb60bb092bd52cdd50b14b3f3d8d292cd51ea8725c0a56c41179e3a377482ff
        m_AxesArray: []
    m_AvatarSkeletonPose:
      data:
        m_X:
        - t: {x: 0, y: 0, z: 0}
          q: {x: 0, y: 2.114617E-06, z: 0, w: 1}
          s: {x: 1, y: 1, z: 1}
        - t: {x: 0, y: 0, z: 0}
          q: {x: 0, y: 0, z: 0, w: 1}
          s: {x: 1, y: 1, z: 1}
        - t: {x: -1.386719E-11, y: 0.006466041, z: -0.0003433409}
          q: {x: -0.5000004, y: 0.4999996, z: 0.4999996, w: 0.5000004}
          s: {x: 1, y: 1, z: 1}
        - t: {x: 5.820766E-11, y: 0, z: 0.0002355985}
          q: {x: 0.5, y: -0.5, z: -0.5, w: -0.5}
          s: {x: 1, y: 1, z: 1}
        - t: {x: -0.0006699, y: -2.956929E-06, z: 4.100359E-12}
          q: {x: 0, y: 0, z: 0, w: 1}
          s: {x: 1, y: 1, z: 1}
        - t: {x: -0.003712576, y: -5.091391E-06, z: -1.821462E-11}
          q: {x: 0, y: 0, z: 0, w: 1}
          s: {x: 1, y: 0.9999999, z: 1}
        - t: {x: -0.00639414, y: -3.32912E-07, z: 1.493704E-08}
          q: {x: 0, y: 0, z: 0, w: 1}
          s: {x: 0.9999998, y: 0.9999998, z: 1}
        - t: {x: -0.0004368891, y: -1.536588E-08, z: -1.555094E-08}
          q: {x: 0, y: 0, z: 0, w: 1}
          s: {x: 1, y: 1, z: 0.9999999}
        - t: {x: -0.00307511, y: 0.0008056504, z: -9.603999E-15}
          q: {x: 0, y: 0, z: 0, w: 1}
          s: {x: 0.9999997, y: 1, z: 1}
        - t: {x: -0.00307511, y: 0.0008056504, z: -9.603999E-15}
          q: {x: 0, y: 0, z: 0, w: 1}
          s: {x: 1.000001, y: 1, z: 1}
        - t: {x: -0.002004619, y: 0.001276724, z: 7.717205E-16}
          q: {x: 0, y: 0, z: 0, w: 1}
          s: {x: 0.9999996, y: 0.9999997, z: 0.9999998}
        - t: {x: -0.0007643158, y: 8.137322E-09, z: -1.665469E-08}
          q: {x: 0, y: 0, z: 0, w: 1}
          s: {x: 1, y: 0.9999999, z: 1}
        - t: {x: -0.002861455, y: -7.862864E-10, z: -3.214509E-09}
          q: {x: 0, y: 0, z: 0, w: 1}
          s: {x: 1, y: 0.9999999, z: 1}
        - t: {x: -0.00265906, y: 2.534913E-09, z: 2.257582E-08}
          q: {x: 0, y: 0, z: 0, w: 1}
          s: {x: 0.9999998, y: 1, z: 1}
        - t: {x: -0.001798839, y: 0.0004048049, z: -2.05886E-05}
          q: {x: 0, y: 0, z: 0, w: 1}
          s: {x: 1.000001, y: 1.000001, z: 1}
        - t: {x: -0.0007341513, y: -4.369898E-09, z: 9.572083E-11}
          q: {x: 0, y: 0, z: 0, w: 1}
          s: {x: 1.000001, y: 1, z: 1}
        - t: {x: 0.001729098, y: 1.707239E-06, z: 0.001579587}
          q: {x: 0.7071068, y: -3.090862E-08, z: -0.7071068, w: 3.090862E-08}
          s: {x: 0.9999998, y: 0.9999998, z: 0.9999999}
        - t: {x: -0.00232768, y: 7.268155E-09, z: -3.939911E-09}
          q: {x: 0, y: 0, z: 0, w: 1}
          s: {x: 1, y: 1.000001, z: 1.000001}
        - t: {x: -0.00363794, y: -4.182307E-10, z: 8.014883E-10}
          q: {x: 0, y: 0, z: 0, w: 1}
          s: {x: 1, y: 0.9999998, z: 1}
        - t: {x: -0.004215047, y: 3.72529E-10, z: 0}
          q: {x: 0.7071068, y: 0, z: 0, w: -0.7071068}
          s: {x: 1, y: 0.9999999, z: 1}
        - t: {x: 0.001729102, y: 1.71567E-06, z: -0.001579612}
          q: {x: 0.7071068, y: -3.090862E-08, z: 0.7071068, w: -3.090862E-08}
          s: {x: 1, y: 1, z: 1}
        - t: {x: -0.00232768, y: -6.256642E-09, z: 1.04974E-08}
          q: {x: 0, y: 0, z: 0, w: 1}
          s: {x: 1.000001, y: 1, z: 1.000001}
        - t: {x: -0.00363794, y: -2.757444E-09, z: -9.219364E-10}
          q: {x: 0, y: 0, z: 0, w: 1}
          s: {x: 0.9999999, y: 1, z: 0.9999999}
        - t: {x: -0.004215047, y: 2.235174E-10, z: -1.192093E-09}
          q: {x: 0.7071068, y: 0, z: 0, w: 0.7071068}
          s: {x: 1.000001, y: 1, z: 1}
        - t: {x: 0.0006698972, y: 3.484826E-06, z: 0.00187133}
          q: {x: 0, y: 1, z: 0, w: -4.371139E-08}
          s: {x: 0.9999994, y: 0.9999993, z: 0.9999999}
        - t: {x: -0.003335313, y: -1.601305E-11, z: -7.029874E-10}
          q: {x: 0, y: 0, z: 0, w: 1}
          s: {x: 1.000001, y: 1.000001, z: 1}
        - t: {x: -0.002501232, y: 0, z: -1.490116E-10}
          q: {x: 0, y: 0, z: 0, w: 1}
          s: {x: 0.9999996, y: 0.9999996, z: 0.9999998}
        - t: {x: -0.0006699028, y: 0.000862136, z: 0}
          q: {x: 0, y: 0, z: 0.7071068, w: -0.7071068}
          s: {x: 1, y: 1, z: 1}
        - t: {x: 0.0006698972, y: 3.495076E-06, z: -0.00187133}
          q: {x: 0, y: 1, z: 0, w: -4.371139E-08}
          s: {x: 0.9999993, y: 0.9999993, z: 0.9999998}
        - t: {x: -0.003335313, y: -1.601426E-11, z: 1.799495E-10}
          q: {x: 0, y: 0, z: 0, w: 1}
          s: {x: 1.000001, y: 1.000001, z: 1}
        - t: {x: -0.002501232, y: 0, z: 0}
          q: {x: 0, y: 0, z: 0, w: 1}
          s: {x: 0.9999998, y: 0.9999996, z: 1}
        - t: {x: -0.0006699028, y: 0.000862136, z: 0}
          q: {x: 0, y: 0, z: 0.7071068, w: -0.7071068}
          s: {x: 1, y: 0.9999999, z: 1}
    m_DefaultPose:
      data:
        m_X:
        - t: {x: 0, y: 0, z: 0}
          q: {x: 0, y: 0, z: 0, w: 1}
          s: {x: 1, y: 1, z: 1}
        - t: {x: 0, y: 0, z: 0}
          q: {x: 0, y: 0, z: 0, w: 1}
          s: {x: 1, y: 1, z: 1}
        - t: {x: -1.386719E-11, y: 0.006466041, z: -0.0003433409}
          q: {x: -0.5000004, y: 0.4999996, z: 0.4999996, w: 0.5000004}
          s: {x: 1, y: 1, z: 1}
        - t: {x: 6.667709E-11, y: 9.623816E-17, z: -1.207314E-09}
          q: {x: -0.5, y: 0.5, z: 0.4999993, w: 0.5000007}
          s: {x: 1, y: 1, z: 1}
        - t: {x: -0.0006699, y: -2.956929E-06, z: 4.100359E-12}
          q: {x: -2.080199E-06, y: 2.755723E-10, z: -0.0003974655, w: 0.9999999}
          s: {x: 1, y: 1, z: 1}
        - t: {x: -0.003712576, y: -5.091391E-06, z: -1.821462E-11}
          q: {x: 6.340108E-22, y: -5.512354E-10, z: -2.292817E-15, w: 1}
          s: {x: 1, y: 1, z: 1}
        - t: {x: -0.00639414, y: -3.32912E-07, z: 1.493704E-08}
          q: {x: -5.537378E-10, y: 6.928507E-07, z: -6.934847E-07, w: 1}
          s: {x: 0.9999997, y: 0.9999997, z: 1}
        - t: {x: -0.0004368891, y: -1.536588E-08, z: -1.555094E-08}
          q: {x: 1.677486E-08, y: -4.413258E-07, z: -0.09121101, w: 0.9958316}
          s: {x: 1, y: 1, z: 1}
        - t: {x: -0.00307511, y: 0.0008056504, z: -9.603999E-15}
          q: {x: 0.789928, y: -0.5751072, z: 0.1763963, w: 0.1189536}
          s: {x: 0.9999997, y: 1, z: 1}
        - t: {x: -0.00307511, y: 0.0008056504, z: -9.603999E-15}
          q: {x: 0.7896127, y: -0.5748951, z: 0.177801, w: 0.1199765}
          s: {x: 1, y: 1, z: 0.9999996}
        - t: {x: -0.002004619, y: 0.001276724, z: 7.717205E-16}
          q: {x: -0.660968, y: 0.7504141, z: 2.705916E-07, w: 7.347663E-07}
          s: {x: 0.9999998, y: 0.9999998, z: 1}
        - t: {x: -0.0007643158, y: 8.137322E-09, z: -1.665469E-08}
          q: {x: -0.09880622, y: -0.4658224, z: -0.07760115, w: 0.8759137}
          s: {x: 1, y: 1, z: 1}
        - t: {x: -0.002861455, y: -7.862864E-10, z: -3.214509E-09}
          q: {x: -0.4017318, y: -0.01594416, z: 0.9013128, w: 0.1612223}
          s: {x: 1, y: 0.9999999, z: 1}
        - t: {x: -0.00265906, y: 2.534913E-09, z: 2.257582E-08}
          q: {x: -0.004891868, y: -0.005248067, z: 0.9823698, w: -0.1868106}
          s: {x: 0.9999997, y: 1, z: 1}
        - t: {x: -0.001798839, y: 0.0004048049, z: -2.05886E-05}
          q: {x: 0.09141485, y: 0.07669605, z: 0.6295021, w: 0.7677813}
          s: {x: 1.000001, y: 1, z: 1}
        - t: {x: -0.0007341513, y: -4.369898E-09, z: 9.572083E-11}
          q: {x: -0.01252472, y: -0.1439724, z: 0.1386361, w: 0.9797424}
          s: {x: 1, y: 1, z: 1}
        - t: {x: 0.001729098, y: 1.707239E-06, z: 0.001579587}
          q: {x: 0.7071078, y: 0.0002819401, z: -0.7071056, w: 0.0002819409}
          s: {x: 1, y: 1, z: 1}
        - t: {x: -0.00232768, y: 7.268155E-09, z: -3.939911E-09}
          q: {x: -0.006039128, y: -0.4458005, z: 0.06927899, w: 0.892427}
          s: {x: 1, y: 1, z: 1}
        - t: {x: -0.00363794, y: -4.182307E-10, z: 8.014883E-10}
          q: {x: 0, y: 0, z: 0.04282883, w: 0.9990824}
          s: {x: 1, y: 1, z: 1}
        - t: {x: -0.004215047, y: 3.72529E-10, z: 0}
          q: {x: -0.7068252, y: 5.266258E-09, z: -5.270453E-09, w: 0.7073882}
          s: {x: 1, y: 1, z: 1}
        - t: {x: 0.001729102, y: 1.71567E-06, z: -0.001579612}
          q: {x: 0.7071078, y: 0.0002819524, z: 0.7071056, w: -0.0002819533}
          s: {x: 1, y: 1, z: 1}
        - t: {x: -0.00232768, y: -6.256642E-09, z: 1.04974E-08}
          q: {x: 0.006038282, y: 0.4458016, z: 0.06928092, w: 0.8924263}
          s: {x: 1, y: 0.9999995, z: 1}
        - t: {x: -0.00363794, y: -2.757444E-09, z: -9.219364E-10}
          q: {x: 0, y: 0, z: 0.04282944, w: 0.9990824}
          s: {x: 0.9999998, y: 1, z: 1}
        - t: {x: -0.004215047, y: 2.235174E-10, z: -1.192093E-09}
          q: {x: 0.7068252, y: 5.266258E-09, z: 5.270453E-09, w: 0.7073883}
          s: {x: 1, y: 1, z: 1}
        - t: {x: 0.0006698972, y: 3.484826E-06, z: 0.00187133}
          q: {x: -0.003684975, y: 0.9999932, z: 1.386114E-06, w: -1.042282E-07}
          s: {x: 0.9999993, y: 0.9999993, z: 1}
        - t: {x: -0.003335313, y: -1.601305E-11, z: -7.029874E-10}
          q: {x: 0, y: 0, z: -0.001911517, w: 0.9999982}
          s: {x: 1, y: 1, z: 1}
        - t: {x: -0.002501232, y: 0, z: -1.490116E-10}
          q: {x: -4.219281E-10, y: -1.098909E-07, z: 0.005198344, w: 0.9999865}
          s: {x: 1, y: 1, z: 1}
        - t: {x: -0.0006699028, y: 0.000862136, z: 0}
          q: {x: 1.545431E-08, y: -1.545431E-08, z: -0.7071068, w: 0.7071068}
          s: {x: 1, y: 1, z: 1}
        - t: {x: 0.0006698972, y: 3.495076E-06, z: -0.00187133}
          q: {x: -0.003684975, y: 0.9999932, z: 1.387716E-06, w: 2.812877E-08}
          s: {x: 0.9999993, y: 0.9999993, z: 1}
        - t: {x: -0.003335313, y: -1.601426E-11, z: 1.799495E-10}
          q: {x: 0, y: 0, z: -0.001911517, w: 0.9999982}
          s: {x: 1, y: 1, z: 1}
        - t: {x: -0.002501232, y: 0, z: 0}
          q: {x: 8.765484E-10, y: 2.24693E-08, z: 0.005198344, w: 0.9999865}
          s: {x: 1, y: 1, z: 1}
        - t: {x: -0.0006699028, y: 0.000862136, z: 0}
          q: {x: -1.545431E-08, y: 1.545431E-08, z: -0.7071068, w: 0.7071068}
          s: {x: 1, y: 1, z: 1}
    m_SkeletonNameIDArray: 00000000ff7e32203d6cbca6661287588ccc354d70159f67ff56dcba30763e3d2afa862691833df36aef3947d2f7401be51b533768a649825f4a5aaec97a5dd952322aa7d5350134b349f3d923992b4609834d9e8e84660d50d0f1bdc8faf77f432c30c58c1d124d3fe2c6a8281088d9d0cbd1f2677ece74d4811a91c37354e0
    m_Human:
      data:
        serializedVersion: 2
        m_RootX:
          t: {x: 3.306932E-05, y: 0.009899398, z: -0.0003426271}
          q: {x: -0.0003980681, y: -1.846855E-08, z: 8.364356E-08, w: 1}
          s: {x: 1, y: 1, z: 1}
        m_Skeleton:
          data:
            m_Node:
            - m_ParentId: -1
              m_AxesId: -1
            - m_ParentId: 0
              m_AxesId: 0
            - m_ParentId: 1
              m_AxesId: 1
            - m_ParentId: 2
              m_AxesId: 2
            - m_ParentId: 3
              m_AxesId: 3
            - m_ParentId: 4
              m_AxesId: 4
            - m_ParentId: 4
              m_AxesId: 5
            - m_ParentId: 6
              m_AxesId: 6
            - m_ParentId: 7
              m_AxesId: 7
            - m_ParentId: 8
              m_AxesId: 8
            - m_ParentId: 4
              m_AxesId: 9
            - m_ParentId: 10
              m_AxesId: 10
            - m_ParentId: 11
              m_AxesId: 11
            - m_ParentId: 12
              m_AxesId: 12
            - m_ParentId: 2
              m_AxesId: 13
            - m_ParentId: 14
              m_AxesId: 14
            - m_ParentId: 15
              m_AxesId: 15
            - m_ParentId: 16
              m_AxesId: 16
            - m_ParentId: 2
              m_AxesId: 17
            - m_ParentId: 18
              m_AxesId: 18
            - m_ParentId: 19
              m_AxesId: 19
            - m_ParentId: 20
              m_AxesId: 20
            m_ID: 3d6cbca629d2f1fd4a870984b294a63696e35dc8c80b0935f81c463cbfad6a379fa3d8f827ca2f77a3ad2105922b411da715c9e6f5aab7ba5eb60bb092bd52cdd50b14b3f3d8d292cd51ea8725c0a56c41179e3a377482ff
            m_AxesArray:
            - m_PreQ: {x: -0.5011023, y: -0.4988953, z: 0.5011023, w: 0.4988953}
              m_PostQ: {x: -1.490116E-08, y: -1.41561E-06, z: 0.9999976, w: -0.002206966}
              m_Sgn: {x: 1, y: 1, z: 1}
              m_Limit:
                m_Min: {x: -0.6981317, y: -0.6981317, z: -0.6981317}
                m_Max: {x: 0.6981317, y: 0.6981317, z: 0.6981317}
              m_Length: 0.0006699064
              m_Type: 1
            - m_PreQ: {x: 5.960464E-08, y: 1.445413E-06, z: -0.9999998, w: 0.000685662}
              m_PostQ: {x: 5.960464E-08, y: 1.445413E-06, z: -0.9999998, w: 0.000685662}
              m_Sgn: {x: 1, y: 1, z: 1}
              m_Limit:
                m_Min: {x: -0.6981317, y: -0.6981317, z: -0.6981317}
                m_Max: {x: 0.6981317, y: 0.6981317, z: 0.6981317}
              m_Length: 0.003712581
              m_Type: 1
            - m_PreQ: {x: 1.147389E-06, y: -1.41561E-06, z: 1, w: -2.603232E-05}
              m_PostQ: {x: 1.147389E-06, y: -1.41561E-06, z: 1, w: -2.603232E-05}
              m_Sgn: {x: 1, y: 1, z: 1}
              m_Limit:
                m_Min: {x: -0.6981317, y: -0.6981317, z: -0.6981317}
                m_Max: {x: 0.6981317, y: 0.6981317, z: 0.6981317}
              m_Length: 0.006394144
              m_Type: 1
            - m_PreQ: {x: 1.780689E-05, y: 1.41561E-06, z: -1, w: 1.756847E-05}
              m_PostQ: {x: 1.780689E-05, y: 1.41561E-06, z: -1, w: 1.756847E-05}
              m_Sgn: {x: 1, y: 1, z: 1}
              m_Limit:
                m_Min: {x: -0.6981317, y: -0.6981317, z: -0.6981317}
                m_Max: {x: 0.6981317, y: 0.6981317, z: 0.6981317}
              m_Length: 0.000436889
              m_Type: 1
            - m_PreQ: {x: -1.490116E-08, y: -1.41561E-06, z: 1, w: 0}
              m_PostQ: {x: -1.490116E-08, y: -1.41561E-06, z: 1, w: 0}
              m_Sgn: {x: 1, y: 1, z: 1}
              m_Limit:
                m_Min: {x: -0.6981317, y: -0.6981317, z: -0.6981317}
                m_Max: {x: 0.6981317, y: 0.6981317, z: 0.6981317}
              m_Length: 0.000436889
              m_Type: 1
            - m_PreQ: {x: 0.4999996, y: 0.4999989, z: 0.5000004, w: -0.5000012}
              m_PostQ: {x: 1.668635E-06, y: 0.7071068, z: -0.7071068, w: -5.369596E-07}
              m_Sgn: {x: 1, y: 1, z: -1}
              m_Limit:
                m_Min: {x: 0, y: -0.2617994, z: -0.2617994}
                m_Max: {x: 0, y: 0.2617994, z: 0.5235988}
              m_Length: 0.00232768
              m_Type: 1
            - m_PreQ: {x: 0.06185647, y: 0.6443379, z: -0.6443392, w: 0.407222}
              m_PostQ: {x: -4.062906E-08, y: 0.7071068, z: -0.7071068, w: 4.062906E-08}
              m_Sgn: {x: 1, y: 1, z: -1}
              m_Limit:
                m_Min: {x: -1.570796, y: -1.745329, z: -1.047198}
                m_Max: {x: 1.570796, y: 1.745329, z: 1.745329}
              m_Length: 0.003637941
              m_Type: 1
            - m_PreQ: {x: 0, y: 1.842501E-08, z: -0.7660822, w: 0.6427428}
              m_PostQ: {x: 0, y: -9.979539E-13, z: -1, w: -4.325159E-08}
              m_Sgn: {x: 1, y: 1, z: -1}
              m_Limit:
                m_Min: {x: -1.570796, y: 0, z: -1.396263}
                m_Max: {x: 1.570796, y: 0, z: 1.396263}
              m_Length: 0.004215049
              m_Type: 1
            - m_PreQ: {x: 3.058346E-08, y: 0.7071068, z: -0.7071068, w: -3.058346E-08}
              m_PostQ: {x: 0, y: -1, z: 0, w: 4.32517E-08}
              m_Sgn: {x: 1, y: 1, z: -1}
              m_Limit:
                m_Min: {x: 0, y: -0.6981317, z: -1.396263}
                m_Max: {x: 0, y: 0.6981317, z: 1.396263}
              m_Length: 0.001053762
              m_Type: 1
            - m_PreQ: {x: -0.5000005, y: 0.4999981, z: 0.4999995, w: 0.5000019}
              m_PostQ: {x: -2.648994E-06, y: 0.7071068, z: -0.7071068, w: -7.460301E-07}
              m_Sgn: {x: 1, y: 1, z: 1}
              m_Limit:
                m_Min: {x: 0, y: -0.2617994, z: -0.2617994}
                m_Max: {x: 0, y: 0.2617994, z: 0.5235988}
              m_Length: 0.002327682
              m_Type: 1
            - m_PreQ: {x: -0.4072222, y: 0.644338, z: -0.644339, w: -0.06185627}
              m_PostQ: {x: -2.678765E-07, y: 0.7071068, z: -0.7071068, w: 2.678765E-07}
              m_Sgn: {x: -1, y: 1, z: 1}
              m_Limit:
                m_Min: {x: -1.570796, y: -1.745329, z: -1.047198}
                m_Max: {x: 1.570796, y: 1.745329, z: 1.745329}
              m_Length: 0.003637945
              m_Type: 1
            - m_PreQ: {x: -0.6427428, y: 0.7660822, z: 1.980987E-07, w: 2.054792E-07}
              m_PostQ: {x: 2.648517E-08, y: 1, z: -7.512434E-13, w: 2.209516E-07}
              m_Sgn: {x: -1, y: 1, z: 1}
              m_Limit:
                m_Min: {x: -1.570796, y: 0, z: -1.396263}
                m_Max: {x: 1.570796, y: 0, z: 1.396263}
              m_Length: 0.004215053
              m_Type: 1
            - m_PreQ: {x: 1.749642E-07, y: 0.7071068, z: -0.7071068, w: 1.375086E-07}
              m_PostQ: {x: 2.648505E-08, y: 5.921882E-13, z: -1, w: 2.209516E-07}
              m_Sgn: {x: 1, y: 1, z: 1}
              m_Limit:
                m_Min: {x: 0, y: -0.6981317, z: -1.396263}
                m_Max: {x: 0, y: 0.6981317, z: 1.396263}
              m_Length: 0.001053763
              m_Type: 1
            - m_PreQ: {x: -0.9659137, y: -0.2588648, z: -4.174038E-07, w: 1.367357E-06}
              m_PostQ: {x: 8.940697E-08, y: -1.400709E-06, z: -1, w: 2.980232E-08}
              m_Sgn: {x: 1, y: 1, z: 1}
              m_Limit:
                m_Min: {x: -1.047198, y: -1.047198, z: -1.570796}
                m_Max: {x: 1.047198, y: 1.047198, z: 0.8726646}
              m_Length: 0.003335313
              m_Type: 1
            - m_PreQ: {x: -8.67579E-07, y: -1.095889E-06, z: -0.7660821, w: 0.6427429}
              m_PostQ: {x: 0, y: -1.400709E-06, z: -1, w: -2.980232E-08}
              m_Sgn: {x: 1, y: 1, z: -1}
              m_Limit:
                m_Min: {x: -1.570796, y: 0, z: -1.396263}
                m_Max: {x: 1.570796, y: 0, z: 1.396263}
              m_Length: 0.002501234
              m_Type: 1
            - m_PreQ: {x: 0, y: -1.400709E-06, z: -1, w: -2.980232E-08}
              m_PostQ: {x: 0, y: -1.400709E-06, z: -1, w: -2.980232E-08}
              m_Sgn: {x: 1, y: 1, z: 1}
              m_Limit:
                m_Min: {x: 0, y: -0.5235988, z: -0.8726646}
                m_Max: {x: 0, y: 0.5235988, z: 0.8726646}
              m_Length: 0.0008650951
              m_Type: 1
            - m_PreQ: {x: -1.013279E-06, y: 9.834766E-07, z: 0.7071068, w: 0.7071068}
              m_PostQ: {x: 1.370907E-06, y: 2.107342E-08, z: -1, w: -2.107342E-08}
              m_Sgn: {x: 1, y: 1, z: 1}
              m_Limit:
                m_Min: {x: 0, y: 0, z: -0.8726646}
                m_Max: {x: 0, y: 0, z: 0.8726646}
              m_Length: 0.0002729525
              m_Type: 1
            - m_PreQ: {x: -0.9659137, y: -0.2588648, z: -2.44685E-07, w: 1.367357E-06}
              m_PostQ: {x: -8.940695E-08, y: -1.400709E-06, z: -1, w: 2.980232E-08}
              m_Sgn: {x: -1, y: -1, z: 1}
              m_Limit:
                m_Min: {x: -1.047198, y: -1.047198, z: -1.570796}
                m_Max: {x: 1.047198, y: 1.047198, z: 0.8726646}
              m_Length: 0.003335312
              m_Type: 1
            - m_PreQ: {x: -9.13241E-07, y: -1.141551E-06, z: -0.7660822, w: 0.6427429}
              m_PostQ: {x: -5.960464E-08, y: -1.400709E-06, z: -1, w: -2.980232E-08}
              m_Sgn: {x: -1, y: 1, z: -1}
              m_Limit:
                m_Min: {x: -1.570796, y: 0, z: -1.396263}
                m_Max: {x: 1.570796, y: 0, z: 1.396263}
              m_Length: 0.002501233
              m_Type: 1
            - m_PreQ: {x: 0, y: -1.400709E-06, z: -1, w: -2.980232E-08}
              m_PostQ: {x: 0, y: -1.400709E-06, z: -1, w: -2.980232E-08}
              m_Sgn: {x: 1, y: -1, z: 1}
              m_Limit:
                m_Min: {x: 0, y: -0.5235988, z: -0.8726646}
                m_Max: {x: 0, y: 0.5235988, z: 0.8726646}
              m_Length: 0.0008650962
              m_Type: 1
            - m_PreQ: {x: -1.013279E-06, y: 9.834766E-07, z: 0.7071068, w: 0.7071068}
              m_PostQ: {x: 1.370907E-06, y: 2.107342E-08, z: -1, w: -2.107342E-08}
              m_Sgn: {x: 1, y: 1, z: 1}
              m_Limit:
                m_Min: {x: 0, y: 0, z: -0.8726646}
                m_Max: {x: 0, y: 0, z: 0.8726646}
              m_Length: 0.0002729524
              m_Type: 1
        m_SkeletonPose:
          data:
            m_X:
            - t: {x: 0, y: 0, z: 0}
              q: {x: 0, y: 0, z: 0, w: 1}
              s: {x: 1, y: 1, z: 1}
            - t: {x: -1.465936E-09, y: 0.006701639, z: -0.000343341}
              q: {x: 0.4999993, y: -0.4999993, z: -0.5000007, w: 0.5000007}
              s: {x: 1, y: 1, z: 1}
            - t: {x: -0.0006698999, y: -2.956949E-06, z: 4.092726E-12}
              q: {x: 0, y: 0, z: 2.980232E-08, w: 1}
              s: {x: 1, y: 1, z: 1}
            - t: {x: -0.003712576, y: -5.091306E-06, z: -1.818989E-11}
              q: {x: 0, y: 0, z: 2.980232E-08, w: 1}
              s: {x: 1, y: 0.9999999, z: 1}
            - t: {x: -0.006394141, y: -3.329478E-07, z: 1.493706E-08}
              q: {x: 0, y: 0, z: 2.980232E-08, w: 1}
              s: {x: 0.9999998, y: 0.9999998, z: 1}
            - t: {x: -0.0004368889, y: -1.536682E-08, z: -1.555094E-08}
              q: {x: 0, y: 0, z: 2.980232E-08, w: 1}
              s: {x: 1, y: 1, z: 0.9999999}
            - t: {x: 0.001729099, y: 1.707115E-06, z: 0.001579587}
              q: {x: 0.7071068, y: -2.980232E-08, z: -0.7071068, w: 3.090867E-08}
              s: {x: 0.9999998, y: 0.9999998, z: 0.9999999}
            - t: {x: -0.00232768, y: 7.26046E-09, z: -3.725291E-09}
              q: {x: 0, y: 0, z: 0, w: 1}
              s: {x: 1, y: 1.000001, z: 1.000001}
            - t: {x: -0.00363794, y: -4.180583E-10, z: -8.881778E-16}
              q: {x: 0, y: 0, z: 0, w: 1}
              s: {x: 1, y: 0.9999998, z: 1}
            - t: {x: -0.004215047, y: 3.646149E-10, z: -1.776355E-15}
              q: {x: 0.7071069, y: 0, z: 0, w: -0.7071069}
              s: {x: 1, y: 0.9999999, z: 1}
            - t: {x: 0.001729102, y: 1.715729E-06, z: -0.001579612}
              q: {x: 0.7071068, y: -3.753013E-08, z: 0.7071068, w: -5.960464E-08}
              s: {x: 1, y: 1, z: 1}
            - t: {x: -0.002327681, y: -6.264249E-09, z: 1.117587E-08}
              q: {x: 0, y: 0, z: 0, w: 1}
              s: {x: 1.000001, y: 1, z: 1.000001}
            - t: {x: -0.003637942, y: -2.756359E-09, z: 8.881776E-16}
              q: {x: 0, y: 0, z: 0, w: 1}
              s: {x: 0.9999999, y: 1, z: 0.9999999}
            - t: {x: -0.00421505, y: 2.23272E-10, z: -1.862642E-09}
              q: {x: 0.7071069, y: 0, z: 0, w: 0.7071069}
              s: {x: 1.000001, y: 1, z: 1}
            - t: {x: 0.0006698973, y: 3.484659E-06, z: 0.00187133}
              q: {x: 2.980232E-08, y: 1, z: 2.980232E-08, w: -2.980232E-08}
              s: {x: 0.9999994, y: 0.9999993, z: 0.9999999}
            - t: {x: -0.003335313, y: 2.328308E-10, z: -4.316302E-10}
              q: {x: 0, y: 0, z: -2.980232E-08, w: 1}
              s: {x: 1.000001, y: 1.000001, z: 1}
            - t: {x: -0.002501232, y: 0, z: -3.266941E-11}
              q: {x: 0, y: 0, z: -2.980232E-08, w: 1}
              s: {x: 0.9999996, y: 0.9999996, z: 0.9999998}
            - t: {x: -0.0006699028, y: 0.000862136, z: -5.820765E-11}
              q: {x: 2.980232E-08, y: 0, z: 0.7071069, w: -0.7071068}
              s: {x: 1, y: 1, z: 1}
            - t: {x: 0.0006698973, y: 3.495136E-06, z: -0.00187133}
              q: {x: 2.980232E-08, y: 1, z: 2.980232E-08, w: -2.980232E-08}
              s: {x: 0.9999993, y: 0.9999993, z: 0.9999998}
            - t: {x: -0.003335313, y: 2.328308E-10, z: 4.996925E-10}
              q: {x: 0, y: 0, z: -2.980232E-08, w: 1}
              s: {x: 1.000001, y: 1.000001, z: 1}
            - t: {x: -0.002501232, y: 0, z: 8.374592E-11}
              q: {x: 0, y: 0, z: -2.980232E-08, w: 1}
              s: {x: 0.9999998, y: 0.9999996, z: 1}
            - t: {x: -0.0006699028, y: 0.000862136, z: -5.820765E-11}
              q: {x: 2.980232E-08, y: 0, z: 0.7071069, w: -0.7071068}
              s: {x: 1, y: 0.9999999, z: 1}
        m_LeftHand:
          data:
            m_HandBoneIndex: ffffffffffffffffffffffffffffffffffffffffffffffffffffffffffffffffffffffffffffffffffffffffffffffffffffffffffffffffffffffff
        m_RightHand:
          data:
            m_HandBoneIndex: ffffffffffffffffffffffffffffffffffffffffffffffffffffffffffffffffffffffffffffffffffffffffffffffffffffffffffffffffffffffff
        m_Handles:
        m_ColliderArray: []
        m_HumanBoneIndex: 010000000e000000120000000f0000001300000010000000140000000200000003000000ffffffff0400000005000000060000000a000000070000000b000000080000000c000000090000000d0000001100000015000000ffffffffffffffffffffffff
        m_HumanBoneMass:
        - 0.1454546
        - 0.1212121
        - 0.1212121
        - 0.04848485
        - 0.04848485
        - 0.009696971
        - 0.009696971
        - 0.03030303
        - 0.2909091
        - 0
        - 0.01212121
        - 0.04848485
        - 0.006060607
        - 0.006060607
        - 0.02424243
        - 0.02424243
        - 0.01818182
        - 0.01818182
        - 0.006060607
        - 0.006060607
        - 0.002424243
        - 0.002424243
        - 0
        - 0
        - 0
        m_ColliderIndex: 
        m_Scale: 0.009899398
        m_ArmTwist: 0.5
        m_ForeArmTwist: 0.5
        m_UpperLegTwist: 0.5
        m_LegTwist: 0.5
        m_ArmStretch: 0.05
        m_LegStretch: 0.05
        m_FeetSpacing: 0
        m_HasLeftHand: 0
        m_HasRightHand: 0
        m_HasTDoF: 1
    m_HumanSkeletonIndexArray: 020000000300000004000000050000000600000007000000100000001100000012000000130000001400000015000000160000001700000018000000190000001a0000001b0000001c0000001d0000001e0000001f000000
    m_HumanSkeletonReverseIndexArray: ffffffffffffffff000000000100000002000000030000000400000005000000ffffffffffffffffffffffffffffffffffffffffffffffffffffffffffffffff060000000700000008000000090000000a0000000b0000000c0000000d0000000e0000000f000000100000001100000012000000130000001400000015000000
    m_RootMotionBoneIndex: -1
    m_RootMotionBoneX:
      t: {x: 0, y: 0, z: 0}
      q: {x: 0, y: 0, z: 0, w: 1}
      s: {x: 1, y: 1, z: 1}
    m_RootMotionSkeleton:
      data:
        m_Node:
        m_ID: 
        m_AxesArray: []
    m_RootMotionSkeletonPose:
      data:
        m_X:
    m_RootMotionSkeletonIndexArray: 
  m_TOS:
    889785288: Bip001/Bip001 Pelvis/Bip001 Spine/Bip001 Spine1/Bip001 Neck/Bip001 Head
    4098805351: Bip001/Bip001 Pelvis/Bip001 Spine/Bip001 Spine1/Bip001 Neck/Bip001 Head/Live
    2058088897: Bip001/Bip001 Pelvis/Bip001 Spine/Bip001 Spine1/Bip001 Neck/Bip001 Head/Bone004
    1918885454: Bip001/Bip001 Pelvis/Bip001 Spine/Bip001 Spine1/Bip001 Neck/Bip001 Head/Death
    540180223: polySurface6
    4174947231: Bip001/Bip001 Pelvis/Bip001 Spine/Bip001 Spine1/Bip001 Neck/Bip001 L Clavicle/Bip001 L UpperArm/Bip001 L Forearm
    490810258: Bip001/Bip001 Pelvis/Bip001 Spine/Bip001 Spine1/Bip001 Neck/Bip001 R Clavicle/Bip001 R UpperArm
    4220695120: Bip001/Bip001 Pelvis/Bip001 Spine/Bip001 Spine1/Bip001 Neck/Bip001 Head/Bone004/connectBone001/Bone001/connectBone002/Bone002/Bone003
    4179634003: Bip001/Bip001 Pelvis/Bip001 Spine/Bip001 Spine1/Bip001 Neck/Bip001 Head/Bone004/connectBone001/Bone001
    92004968: Bip001/Bip001 Pelvis/Bip001 Spine/Bip001 Spine1/Bip001 Neck/Bip001 Head/Bone004/connectBone001/Bone001/connectBone002
    844178906: Bip001/Bip001 Pelvis/Bip001 Spine/Bip001 Spine1/Bip001 Neck/Bip001 Head/Bone004/connectBone001
    929738175: Bip001/Bip001 Pelvis/Bip001 Spine/Bip001 Spine1/Bip001 Neck/Bip001 L Clavicle/Bip001 L UpperArm
    3132599029: Bip001/Bip001 Pelvis/Bip001 Spine/Bip001 Spine1/Bip001 Neck/Bip001 R Clavicle/Bip001 R UpperArm/Bip001 R Forearm/Bip001 R Hand
    2797366333: Bip001
    2280280525: Bip001/Bip001 Pelvis/Bip001 Spine/Bip001 R Thigh
    1011227896: Bip001/Bip001 Pelvis/Bip001 Spine/Bip001 Spine1/Bip001 Neck/Bip001 L Clavicle
    983439169: Bip001/Bip001 Pelvis/Bip001 Spine/Bip001 R Thigh/Bip001 R Calf/Bip001 R Foot
    2463291635: Bip001/Bip001 Pelvis/Bip001 Spine/Bip001 L Thigh/Bip001 L Calf/Bip001 L Foot/Bip001 L Toe0
    4286739511: Bip001/Bip001 Pelvis/Bip001 Spine/Bip001 R Thigh/Bip001 R Calf/Bip001 R Foot/Bip001 R Toe0
    2953557598: Bip001/Bip001 Pelvis/Bip001 Spine/Bip001 L Thigh
    0: 
    3004435413: Bip001/Bip001 Pelvis/Bip001 Spine/Bip001 L Thigh/Bip001 L Calf/Bip001 L Foot
    1215710448: Bip001/Bip001 Pelvis/Bip001 Spine/Bip001 Spine1/Bip001 Neck/Bip001 Head/Bone004/connectBone001/Bone001/connectBone002/Bone002
    1822801957: Bip001/Bip001 Pelvis/Bip001 Spine/Bip001 R Thigh/Bip001 R Calf
    916886706: Bip001/Bip001 Pelvis/Bip001 Spine/Bip001 Spine1
    3361596310: Bip001/Bip001 Pelvis/Bip001 Spine/Bip001 Spine1/Bip001 Neck
    1999620647: Bip001/Bip001 Pelvis/Bip001 Spine/Bip001 Spine1/Bip001 Neck/Bip001 L Clavicle/Bip001 L UpperArm/Bip001 L Forearm/Bip001 L Hand
    86093219: Bip001/Bip001 Pelvis/Bip001 Spine/Bip001 Spine1/Bip001 Neck/Bip001 R Clavicle
    3444751762: Bip001/Bip001 Pelvis/Bip001 Spine/Bip001 L Thigh/Bip001 L Calf
    4260483625: Bip001/Bip001 Pelvis
    3871937959: Bip001/Bip001 Pelvis/Bip001 Spine/Bip001 Spine1/Bip001 Neck/Bip001 R Clavicle/Bip001 R UpperArm/Bip001 R Forearm
    2215216970: Bip001/Bip001 Pelvis/Bip001 Spine
