%YAML 1.1
%TAG !u! tag:unity3d.com,2011:
--- !u!1045 &1
EditorBuildSettings:
  m_ObjectHideFlags: 0
  serializedVersion: 2
  m_Scenes:
  - enabled: 1
    path: Assets/Scenes/LauncherScene.unity
    guid: 0d199b8ba018e6548b09318fdefdbbdc
  - enabled: 1
    path: Assets/Scenes/HomeScene.unity
    guid: 0fc38c2ad8e89d643984f5bcd2c376b9
  - enabled: 1
    path: Assets/Scenes/GameScene.unity
    guid: bbfbdf3476e00ef4faca9a3c426e5c0d
  m_configObjects: {}
