%YAML 1.1
%TAG !u! tag:unity3d.com,2011:
--- !u!90 &9000000
Avatar:
  m_ObjectHideFlags: 0
  m_PrefabParentObject: {fileID: 0}
  m_PrefabInternal: {fileID: 0}
  m_Name: "main_agoiAvatar"
  m_AvatarSize: 9508
  m_Avatar:
    serializedVersion: 3
    m_AvatarSkeleton:
      data:
        m_Node:
        - m_ParentId: -1
          m_AxesId: -1
        - m_ParentId: 0
          m_AxesId: -1
        - m_ParentId: 0
          m_AxesId: -1
        - m_ParentId: 2
          m_AxesId: -1
        - m_ParentId: 3
          m_AxesId: -1
        - m_ParentId: 4
          m_AxesId: -1
        - m_ParentId: 5
          m_AxesId: -1
        - m_ParentId: 6
          m_AxesId: -1
        - m_ParentId: 7
          m_AxesId: -1
        - m_ParentId: 8
          m_AxesId: -1
        - m_ParentId: 9
          m_AxesId: -1
        - m_ParentId: 10
          m_AxesId: -1
        - m_ParentId: 11
          m_AxesId: -1
        - m_ParentId: 10
          m_AxesId: -1
        - m_ParentId: 13
          m_AxesId: -1
        - m_ParentId: 6
          m_AxesId: -1
        - m_ParentId: 15
          m_AxesId: -1
        - m_ParentId: 16
          m_AxesId: -1
        - m_ParentId: 17
          m_AxesId: -1
        - m_ParentId: 18
          m_AxesId: -1
        - m_ParentId: 19
          m_AxesId: -1
        - m_ParentId: 18
          m_AxesId: -1
        - m_ParentId: 21
          m_AxesId: -1
        - m_ParentId: 6
          m_AxesId: -1
        - m_ParentId: 23
          m_AxesId: -1
        - m_ParentId: 4
          m_AxesId: -1
        - m_ParentId: 25
          m_AxesId: -1
        - m_ParentId: 26
          m_AxesId: -1
        - m_ParentId: 27
          m_AxesId: -1
        - m_ParentId: 4
          m_AxesId: -1
        - m_ParentId: 29
          m_AxesId: -1
        - m_ParentId: 30
          m_AxesId: -1
        - m_ParentId: 31
          m_AxesId: -1
        m_ID: 00000000868ea92c3d6cbca629d2f1fd4a870984b294a63696e35dc8f81c463cbfad6a379fa3d8f827ca2f77e12dfb047fd500f0771dfc736664f93ea3ad2105922b411da715c9e6f5aab7ba185543cd1c243bf88e6544ba0595c236c80b09357294f2b35eb60bb092bd52cdd50b14b3f3d8d292cd51ea8725c0a56c41179e3a377482ff
        m_AxesArray: []
    m_AvatarSkeletonPose:
      data:
        m_X:
        - t: {x: 0, y: 0, z: 0}
          q: {x: 0, y: 1.772879E-06, z: 0, w: 1}
          s: {x: 1, y: 1, z: 1}
        - t: {x: 0, y: 0, z: 1.173663E-10}
          q: {x: 8.146034E-08, y: 0, z: 0, w: 1}
          s: {x: 0.222561, y: 0.222561, z: 0.222561}
        - t: {x: 0, y: 0.008779943, z: 1.482503E-10}
          q: {x: -0.5000004, y: 0.4999996, z: 0.4999996, w: 0.5000004}
          s: {x: 1, y: 1, z: 1}
        - t: {x: 0, y: 0, z: 0.0004348969}
          q: {x: 0.5, y: -0.5, z: -0.5, w: -0.5}
          s: {x: 1, y: 1, z: 1}
        - t: {x: -0.001816438, y: -9.84695E-07, z: 2.5204E-09}
          q: {x: 0, y: 0, z: 0, w: 1}
          s: {x: 1, y: 1, z: 1}
        - t: {x: -0.002495464, y: -2.784396E-06, z: -7.722798E-12}
          q: {x: 0, y: 0, z: 0, w: 1}
          s: {x: 1, y: 1, z: 1}
        - t: {x: -0.003496779, y: -5.255127E-07, z: -1.457561E-12}
          q: {x: 0, y: 0, z: 0, w: 1}
          s: {x: 1, y: 1, z: 1}
        - t: {x: 0.001373092, y: -0.0001312615, z: 0.001482953}
          q: {x: 0.7071068, y: -3.090862E-08, z: -0.7071068, w: 3.090862E-08}
          s: {x: 0.9999999, y: 1, z: 1}
        - t: {x: -0.001339315, y: 0, z: 0}
          q: {x: 0, y: 0, z: 0, w: 1}
          s: {x: 0.9999999, y: 1, z: 1}
        - t: {x: -0.002282344, y: 0, z: 0}
          q: {x: 0, y: 0, z: 0, w: 1}
          s: {x: 1, y: 0.9999999, z: 0.9999999}
        - t: {x: -0.002146711, y: -7.45058E-11, z: -1.192093E-09}
          q: {x: 0.7071068, y: 0, z: 0, w: -0.7071068}
          s: {x: 0.9999999, y: 1, z: 1}
        - t: {x: -0.0004746914, y: 0.0004760647, z: -0.0009517093}
          q: {x: 0, y: 0.3826835, z: 0, w: -0.9238795}
          s: {x: 0.9999998, y: 1, z: 1}
        - t: {x: -0.0007984829, y: -2.980232E-10, z: 0}
          q: {x: 0, y: 0, z: 0, w: 1}
          s: {x: 1, y: 0.9999997, z: 0.9999999}
        - t: {x: -0.001525025, y: 1.192093E-09, z: -7.45058E-11}
          q: {x: 0, y: 0, z: 0, w: 1}
          s: {x: 1, y: 1, z: 1}
        - t: {x: -0.0004631346, y: -1.192093E-09, z: 0}
          q: {x: 0, y: 0, z: 0, w: 1}
          s: {x: 1, y: 1.000001, z: 1}
        - t: {x: 0.001373092, y: -0.0001312533, z: -0.001482953}
          q: {x: 0.7071068, y: -3.090862E-08, z: 0.7071068, w: -3.090862E-08}
          s: {x: 1, y: 1, z: 1}
        - t: {x: -0.001339315, y: 0, z: 0}
          q: {x: 0, y: 0, z: 0, w: 1}
          s: {x: 1.000001, y: 1, z: 1}
        - t: {x: -0.002282343, y: 0, z: -1.192093E-09}
          q: {x: 0, y: 0, z: 0, w: 1}
          s: {x: 1, y: 1, z: 1}
        - t: {x: -0.002146712, y: 0, z: 0}
          q: {x: 0.7071068, y: 0, z: 0, w: 0.7071068}
          s: {x: 0.9999998, y: 0.9999998, z: 0.9999999}
        - t: {x: -0.000474692, y: 0.0004760635, z: 0.0009517095}
          q: {x: 0, y: 0.3826835, z: 0, w: 0.9238795}
          s: {x: 0.9999998, y: 0.9999998, z: 0.9999995}
        - t: {x: -0.0007984811, y: -2.980232E-10, z: 0}
          q: {x: 0, y: 0, z: 0, w: 1}
          s: {x: 0.9999997, y: 0.9999999, z: 1}
        - t: {x: -0.001525025, y: 0, z: 0}
          q: {x: 0, y: 0, z: 0, w: 1}
          s: {x: 1, y: 1, z: 0.9999999}
        - t: {x: -0.000463134, y: 0, z: -1.490116E-10}
          q: {x: 0, y: 0, z: 0, w: 1}
          s: {x: 1.000001, y: 1, z: 0.9999998}
        - t: {x: -0.000659964, y: 0, z: 0}
          q: {x: 0, y: 0, z: 0, w: 1}
          s: {x: 1, y: 1, z: 1}
        - t: {x: -0.006496104, y: -0.0003944112, z: -0.0001089946}
          q: {x: 0, y: 0, z: 0, w: 1}
          s: {x: 0.02375156, y: 0.02378406, z: 0.02375964}
        - t: {x: 0.001816435, y: 2.426918E-06, z: 0.001666742}
          q: {x: 0, y: 1, z: 0, w: -4.371139E-08}
          s: {x: 1, y: 1, z: 1}
        - t: {x: -0.003460437, y: 0, z: 0}
          q: {x: 0, y: 0, z: 0, w: 1}
          s: {x: 1, y: 1, z: 1}
        - t: {x: -0.004164928, y: 0, z: 0}
          q: {x: 0, y: 0, z: 0, w: 1}
          s: {x: 1, y: 1, z: 1}
        - t: {x: -0.001321081, y: 0.001700174, z: 0}
          q: {x: 0, y: 0, z: 0.7071068, w: -0.7071068}
          s: {x: 1, y: 1, z: 1}
        - t: {x: 0.001816435, y: 2.436163E-06, z: -0.001666742}
          q: {x: 0, y: 1, z: 0, w: -4.371139E-08}
          s: {x: 1, y: 1, z: 1}
        - t: {x: -0.003460437, y: 0, z: 0}
          q: {x: 0, y: 0, z: 0, w: 1}
          s: {x: 1, y: 1, z: 1}
        - t: {x: -0.004164928, y: -3.72529E-11, z: 2.980232E-10}
          q: {x: 0, y: 0, z: 0, w: 1}
          s: {x: 1, y: 1, z: 1}
        - t: {x: -0.001321081, y: 0.001700174, z: 0}
          q: {x: 0, y: 0, z: 0.7071068, w: -0.7071068}
          s: {x: 1, y: 1, z: 1}
    m_DefaultPose:
      data:
        m_X:
        - t: {x: 0, y: 0, z: 0}
          q: {x: 0, y: 0, z: 0, w: 1}
          s: {x: 1, y: 1, z: 1}
        - t: {x: 0, y: 0, z: 1.173663E-10}
          q: {x: 8.146034E-08, y: 0, z: 0, w: 1}
          s: {x: 0.222561, y: 0.222561, z: 0.222561}
        - t: {x: 0, y: 0.008779943, z: 1.482503E-10}
          q: {x: -0.5000004, y: 0.4999996, z: 0.4999996, w: 0.5000004}
          s: {x: 1, y: 1, z: 1}
        - t: {x: 0, y: 0, z: 0}
          q: {x: -0.5, y: 0.5, z: 0.4999993, w: 0.5000007}
          s: {x: 1, y: 1, z: 1}
        - t: {x: -0.001816438, y: -9.84695E-07, z: 2.5204E-09}
          q: {x: -2.080476E-06, y: 6.93676E-07, z: -0.000398159, w: 0.9999999}
          s: {x: 1, y: 1, z: 1}
        - t: {x: -0.002495464, y: -2.784396E-06, z: -7.722798E-12}
          q: {x: -3.011767E-14, y: 0, z: 0, w: 1}
          s: {x: 1, y: 1, z: 1}
        - t: {x: -0.003496779, y: -5.255127E-07, z: -1.457561E-12}
          q: {x: -3.011767E-14, y: 0, z: 0, w: 1}
          s: {x: 1, y: 1, z: 1}
        - t: {x: 0.001373092, y: -0.0001312615, z: 0.001482953}
          q: {x: 0.7071077, y: 0.0002815406, z: -0.7071058, w: 0.0002815413}
          s: {x: 1, y: 1, z: 1}
        - t: {x: -0.001339315, y: 0, z: 0}
          q: {x: 0.04061555, y: -0.2592376, z: 0.01361226, w: 0.9648632}
          s: {x: 1, y: 1, z: 1}
        - t: {x: -0.002282344, y: 0, z: 0}
          q: {x: 0, y: 0, z: 0.01787913, w: 0.9998402}
          s: {x: 1, y: 1, z: 1}
        - t: {x: -0.002146711, y: -7.45058E-11, z: -1.192093E-09}
          q: {x: -0.7300551, y: 0.05857425, z: -0.06317822, w: 0.6779359}
          s: {x: 1, y: 1, z: 1}
        - t: {x: -0.0004746914, y: 0.0004760647, z: -0.0009517093}
          q: {x: 0.5948273, y: -0.4344206, z: -0.02140416, w: 0.6760185}
          s: {x: 1, y: 1, z: 1}
        - t: {x: -0.0007984829, y: -2.980232E-10, z: 0}
          q: {x: 1.080543E-08, y: -3.396951E-08, z: -0.2694147, w: 0.9630243}
          s: {x: 1, y: 1, z: 1}
        - t: {x: -0.001525025, y: 1.192093E-09, z: -7.45058E-11}
          q: {x: 0.02153194, y: 0.04934405, z: -0.2615373, w: 0.9636908}
          s: {x: 1, y: 1, z: 1}
        - t: {x: -0.0004631346, y: -1.192093E-09, z: 0}
          q: {x: -6.877958E-09, y: 1.767104E-09, z: -0.2488412, w: 0.9685444}
          s: {x: 1, y: 1, z: 1}
        - t: {x: 0.001373092, y: -0.0001312533, z: -0.001482953}
          q: {x: 0.7071077, y: 0.0002815406, z: 0.7071058, w: -0.0002815413}
          s: {x: 1, y: 1, z: 1}
        - t: {x: -0.001339315, y: 0, z: 0}
          q: {x: -0.04061555, y: 0.2592376, z: 0.01361226, w: 0.9648632}
          s: {x: 1, y: 1, z: 1}
        - t: {x: -0.002282343, y: 0, z: -1.192093E-09}
          q: {x: 0, y: 0, z: 0.01787913, w: 0.9998402}
          s: {x: 1, y: 1, z: 1}
        - t: {x: -0.002146712, y: 0, z: 0}
          q: {x: 0.7300551, y: -0.05857427, z: -0.0631782, w: 0.6779359}
          s: {x: 1, y: 1, z: 1}
        - t: {x: -0.000474692, y: 0.0004760635, z: 0.0009517095}
          q: {x: -0.5948273, y: 0.4344206, z: -0.02140414, w: 0.6760185}
          s: {x: 1, y: 1, z: 1}
        - t: {x: -0.0007984811, y: -2.980232E-10, z: 0}
          q: {x: -1.968871E-08, y: -2.543851E-08, z: -0.2694146, w: 0.9630243}
          s: {x: 1, y: 1, z: 1}
        - t: {x: -0.001525025, y: 0, z: 0}
          q: {x: -0.02153194, y: -0.04934404, z: -0.2615372, w: 0.9636908}
          s: {x: 1, y: 1, z: 1}
        - t: {x: -0.000463134, y: 0, z: -1.490116E-10}
          q: {x: -2.079518E-09, y: -7.158279E-09, z: -0.2488411, w: 0.9685444}
          s: {x: 1, y: 1, z: 1}
        - t: {x: -0.000659964, y: 0, z: 0}
          q: {x: -7.2656E-14, y: -1.104273E-09, z: 0.0003988306, w: 0.9999999}
          s: {x: 1, y: 1, z: 1}
        - t: {x: -0.006496104, y: -0.0003944112, z: -0.0001089946}
          q: {x: -0.5000005, y: -0.4999996, z: -0.4999996, w: 0.5000005}
          s: {x: 0.02375156, y: 0.02378406, z: 0.02375964}
        - t: {x: 0.001816435, y: 2.426918E-06, z: 0.001666742}
          q: {x: -0.007000483, y: 0.9984602, z: -0.007915937, w: 0.05445698}
          s: {x: 1, y: 1, z: 1}
        - t: {x: -0.003460437, y: 0, z: 0}
          q: {x: 0, y: 0, z: 0.05633695, w: 0.9984118}
          s: {x: 1, y: 1, z: 1}
        - t: {x: -0.004164928, y: 0, z: 0}
          q: {x: -0.004858631, y: 0.05481458, z: -0.04965782, w: 0.9972492}
          s: {x: 1, y: 1, z: 1}
        - t: {x: -0.001321081, y: 0.001700174, z: 0}
          q: {x: 1.545431E-08, y: -1.545431E-08, z: -0.7071068, w: 0.7071068}
          s: {x: 1, y: 1, z: 1}
        - t: {x: 0.001816435, y: 2.436163E-06, z: -0.001666742}
          q: {x: -0.006962218, y: 0.9981858, z: 0.007948554, w: -0.05927551}
          s: {x: 1, y: 1, z: 1}
        - t: {x: -0.003460437, y: 0, z: 0}
          q: {x: 0, y: 0, z: 0.05633695, w: 0.9984118}
          s: {x: 1, y: 1, z: 1}
        - t: {x: -0.004164928, y: -3.72529E-11, z: 2.980232E-10}
          q: {x: 0.004618889, y: -0.05962726, z: -0.0496806, w: 0.996973}
          s: {x: 1, y: 1, z: 1}
        - t: {x: -0.001321081, y: 0.001700174, z: 0}
          q: {x: -1.545431E-08, y: 1.545431E-08, z: -0.7071068, w: 0.7071068}
          s: {x: 1, y: 1, z: 1}
    m_SkeletonNameIDArray: 00000000868ea92c3d6cbca6661287588ccc354d70159f67ff56dcba52322aa7d5350134b349f3d923992b46339d60123cee1e3ca5ad67657ddf052509834d9e8e84660d50d0f1bdc8faf77fd0046276675f790546346501266e621c30763e3d16b02be7432c30c58c1d124d3fe2c6a8281088d9d0cbd1f2677ece74d4811a91c37354e0
    m_Human:
      data:
        serializedVersion: 2
        m_RootX:
          t: {x: 2.074587E-05, y: 0.01127646, z: -2.656101E-05}
          q: {x: -0.01064206, y: 9.112613E-08, z: 3.520265E-08, w: 0.9999434}
          s: {x: 1, y: 1, z: 1}
        m_Skeleton:
          data:
            m_Node:
            - m_ParentId: -1
              m_AxesId: -1
            - m_ParentId: 0
              m_AxesId: 0
            - m_ParentId: 1
              m_AxesId: 1
            - m_ParentId: 2
              m_AxesId: 2
            - m_ParentId: 3
              m_AxesId: 3
            - m_ParentId: 4
              m_AxesId: 4
            - m_ParentId: 5
              m_AxesId: 5
            - m_ParentId: 6
              m_AxesId: 6
            - m_ParentId: 7
              m_AxesId: 7
            - m_ParentId: 8
              m_AxesId: 8
            - m_ParentId: 9
              m_AxesId: 9
            - m_ParentId: 8
              m_AxesId: 10
            - m_ParentId: 11
              m_AxesId: 11
            - m_ParentId: 4
              m_AxesId: 12
            - m_ParentId: 13
              m_AxesId: 13
            - m_ParentId: 14
              m_AxesId: 14
            - m_ParentId: 15
              m_AxesId: 15
            - m_ParentId: 16
              m_AxesId: 16
            - m_ParentId: 17
              m_AxesId: 17
            - m_ParentId: 16
              m_AxesId: 18
            - m_ParentId: 19
              m_AxesId: 19
            - m_ParentId: 4
              m_AxesId: 20
            - m_ParentId: 2
              m_AxesId: 21
            - m_ParentId: 22
              m_AxesId: 22
            - m_ParentId: 23
              m_AxesId: 23
            - m_ParentId: 24
              m_AxesId: 24
            - m_ParentId: 2
              m_AxesId: 25
            - m_ParentId: 26
              m_AxesId: 26
            - m_ParentId: 27
              m_AxesId: 27
            - m_ParentId: 28
              m_AxesId: 28
            m_ID: 3d6cbca629d2f1fd4a870984b294a63696e35dc8f81c463cbfad6a379fa3d8f827ca2f77e12dfb047fd500f0771dfc736664f93ea3ad2105922b411da715c9e6f5aab7ba185543cd1c243bf88e6544ba0595c236c80b09355eb60bb092bd52cdd50b14b3f3d8d292cd51ea8725c0a56c41179e3a377482ff
            m_AxesArray:
            - m_PreQ: {x: -0.5001351, y: -0.4998648, z: 0.5001359, w: 0.4998641}
              m_PostQ: {x: 7.599592E-07, y: -1.043081E-06, z: 1, w: -0.0002710074}
              m_Sgn: {x: 1, y: 1, z: 1}
              m_Limit:
                m_Min: {x: -0.6981317, y: -0.6981317, z: -0.6981317}
                m_Max: {x: 0.6981317, y: 0.6981317, z: 0.6981317}
              m_Length: 0.001816438
              m_Type: 1
            - m_PreQ: {x: 2.980232E-08, y: -1.043081E-06, z: 0.9999999, w: -0.0005579293}
              m_PostQ: {x: 2.980232E-08, y: -1.043081E-06, z: 0.9999999, w: -0.0005579293}
              m_Sgn: {x: 1, y: 1, z: 1}
              m_Limit:
                m_Min: {x: -0.6981317, y: -0.6981317, z: -0.6981317}
                m_Max: {x: 0.6981317, y: 0.6981317, z: 0.6981317}
              m_Length: 0.002495466
              m_Type: 1
            - m_PreQ: {x: 2.980232E-08, y: -1.043081E-06, z: 1, w: -7.513165E-05}
              m_PostQ: {x: 2.980232E-08, y: -1.043081E-06, z: 1, w: -7.513165E-05}
              m_Sgn: {x: 1, y: 1, z: 1}
              m_Limit:
                m_Min: {x: -0.6981317, y: -0.6981317, z: -0.6981317}
                m_Max: {x: 0.6981317, y: 0.6981317, z: 0.6981317}
              m_Length: 0.003496779
              m_Type: 1
            - m_PreQ: {x: 2.980232E-08, y: -1.043081E-06, z: 1, w: -2.980232E-08}
              m_PostQ: {x: 2.980232E-08, y: -1.043081E-06, z: 1, w: -2.980232E-08}
              m_Sgn: {x: 1, y: 1, z: 1}
              m_Limit:
                m_Min: {x: -0.6981317, y: -0.6981317, z: -0.6981317}
                m_Max: {x: 0.6981317, y: 0.6981317, z: 0.6981317}
              m_Length: 0.0006599631
              m_Type: 1
            - m_PreQ: {x: 0.5000001, y: 0.5000001, z: 0.5000001, w: -0.5}
              m_PostQ: {x: -2.980329E-08, y: 0.7071068, z: -0.7071067, w: -2.980124E-08}
              m_Sgn: {x: 1, y: 1, z: -1}
              m_Limit:
                m_Min: {x: 0, y: -0.2617994, z: -0.2617994}
                m_Max: {x: 0, y: 0.2617994, z: 0.5235988}
              m_Length: 0.001339315
              m_Type: 1
            - m_PreQ: {x: 0.06185651, y: 0.6443381, z: -0.644339, w: 0.4072219}
              m_PostQ: {x: -2.928346E-08, y: 0.7071068, z: -0.7071067, w: -3.032102E-08}
              m_Sgn: {x: 1, y: 1, z: -1}
              m_Limit:
                m_Min: {x: -1.570796, y: -1.745329, z: -1.047198}
                m_Max: {x: 1.570796, y: 1.745329, z: 1.745329}
              m_Length: 0.002282343
              m_Type: 1
            - m_PreQ: {x: 3.652964E-07, y: 3.686386E-07, z: -0.7660821, w: 0.6427429}
              m_PostQ: {x: 3.916902E-07, y: 5.960383E-08, z: -1, w: 1.771395E-08}
              m_Sgn: {x: 1, y: 1, z: -1}
              m_Limit:
                m_Min: {x: -1.570796, y: 0, z: -1.396263}
                m_Max: {x: 1.570796, y: 0, z: 1.396263}
              m_Length: 0.002146711
              m_Type: 1
            - m_PreQ: {x: 2.644412E-07, y: 0.7071068, z: -0.7071067, w: 2.894924E-07}
              m_PostQ: {x: -3.916902E-07, y: -1, z: -8.940606E-08, w: -1.771389E-08}
              m_Sgn: {x: 1, y: 1, z: -1}
              m_Limit:
                m_Min: {x: 0, y: -0.6981317, z: -1.396263}
                m_Max: {x: 0, y: 0.6981317, z: 1.396263}
              m_Length: 0.0005366778
              m_Type: 1
            - m_PreQ: {x: -0.4272934, y: -0.5766903, z: 0.6433072, w: -0.2664668}
              m_PostQ: {x: 1.490116E-07, y: 0.7071069, z: -0.7071068, w: 9.249311E-08}
              m_Sgn: {x: -1, y: -1, z: 1}
              m_Limit:
                m_Min: {x: 0, y: -0.4363323, z: -0.3490658}
                m_Max: {x: 0, y: 0.4363323, z: 0.3490658}
              m_Length: 0.0007984821
              m_Type: 1
            - m_PreQ: {x: -0.1386749, y: 0.6933753, z: -0.6933752, w: -0.1386749}
              m_PostQ: {x: 1.490116E-07, y: 0.7071068, z: -0.7071068, w: 1.222954E-07}
              m_Sgn: {x: -1, y: 1, z: 1}
              m_Limit:
                m_Min: {x: 0, y: 0, z: -0.6981317}
                m_Max: {x: 0, y: 0, z: 0.6108652}
              m_Length: 0.0004491462
              m_Type: 1
            - m_PreQ: {x: -0.2865061, y: -0.9550273, z: 6.94514E-07, w: -0.07640211}
              m_PostQ: {x: 2.053058E-06, y: -1, z: -8.941144E-08, w: -2.334673E-09}
              m_Sgn: {x: -1, y: -1, z: -1}
              m_Limit:
                m_Min: {x: 0, y: -0.3490658, z: -0.8726646}
                m_Max: {x: 0, y: 0.3490658, z: 0.8726646}
              m_Length: 0.0004631346
              m_Type: 1
            - m_PreQ: {x: -0.3133756, y: -0.9496294, z: 6.036139E-07, w: 2.58012E-08}
              m_PostQ: {x: 2.053058E-06, y: -1, z: -8.941144E-08, w: -2.334673E-09}
              m_Sgn: {x: -1, y: 1, z: -1}
              m_Limit:
                m_Min: {x: 0, y: 0, z: -0.7853982}
                m_Max: {x: 0, y: 0, z: 0.7853982}
              m_Length: 0.0002605132
              m_Type: 1
            - m_PreQ: {x: -0.5, y: 0.5, z: 0.5, w: 0.5000001}
              m_PostQ: {x: -3.046472E-08, y: 0.7071068, z: -0.7071068, w: -2.913987E-08}
              m_Sgn: {x: 1, y: 1, z: 1}
              m_Limit:
                m_Min: {x: 0, y: -0.2617994, z: -0.2617994}
                m_Max: {x: 0, y: 0.2617994, z: 0.5235988}
              m_Length: 0.001339316
              m_Type: 1
            - m_PreQ: {x: -0.4072217, y: 0.6443383, z: -0.644339, w: -0.06185629}
              m_PostQ: {x: 2.577388E-07, y: 0.7071068, z: -0.7071068, w: 2.597336E-07}
              m_Sgn: {x: -1, y: 1, z: 1}
              m_Limit:
                m_Min: {x: -1.570796, y: -1.745329, z: -1.047198}
                m_Max: {x: 1.570796, y: 1.745329, z: 1.745329}
              m_Length: 0.002282346
              m_Type: 1
            - m_PreQ: {x: -0.6427429, y: 0.7660822, z: 1.196126E-08, w: -4.566206E-08}
              m_PostQ: {x: 2.006573E-11, y: 1, z: -2.980283E-08, w: -4.214678E-08}
              m_Sgn: {x: -1, y: 1, z: 1}
              m_Limit:
                m_Min: {x: -1.570796, y: 0, z: -1.396263}
                m_Max: {x: 1.570796, y: 0, z: 1.396263}
              m_Length: 0.002146715
              m_Type: 1
            - m_PreQ: {x: -2.978817E-08, y: 0.7071068, z: -0.7071068, w: -2.981642E-08}
              m_PostQ: {x: 1.98952E-11, y: -5.960469E-08, z: -1, w: -4.214681E-08}
              m_Sgn: {x: 1, y: 1, z: 1}
              m_Limit:
                m_Min: {x: 0, y: -0.6981317, z: -1.396263}
                m_Max: {x: 0, y: 0.6981317, z: 1.396263}
              m_Length: 0.0005366788
              m_Type: 1
            - m_PreQ: {x: 0.2664665, y: -0.6433069, z: 0.5766907, w: 0.4272935}
              m_PostQ: {x: 2.980232E-08, y: 0.7071068, z: -0.7071068, w: -8.504249E-08}
              m_Sgn: {x: 1, y: -1, z: -1}
              m_Limit:
                m_Min: {x: 0, y: -0.4363323, z: -0.3490658}
                m_Max: {x: 0, y: 0.4363323, z: 0.3490658}
              m_Length: 0.0007984817
              m_Type: 1
            - m_PreQ: {x: -0.138675, y: -0.6933752, z: 0.6933752, w: -0.138675}
              m_PostQ: {x: 2.980232E-08, y: 0.7071068, z: -0.7071068, w: -8.504249E-08}
              m_Sgn: {x: 1, y: 1, z: -1}
              m_Limit:
                m_Min: {x: 0, y: 0, z: -0.6981317}
                m_Max: {x: 0, y: 0, z: 0.6108652}
              m_Length: 0.000449146
              m_Type: 1
            - m_PreQ: {x: 0.07640197, y: 6.658331E-07, z: 0.9550267, w: 0.2865081}
              m_PostQ: {x: 1.571791E-07, y: -5.960469E-08, z: -1, w: -4.21468E-08}
              m_Sgn: {x: 1, y: -1, z: 1}
              m_Limit:
                m_Min: {x: 0, y: -0.3490658, z: -0.8726646}
                m_Max: {x: 0, y: 0.3490658, z: 0.8726646}
              m_Length: 0.0004631346
              m_Type: 1
            - m_PreQ: {x: -1.679405E-07, y: 7.261385E-07, z: 0.9496287, w: 0.3133775}
              m_PostQ: {x: 1.571791E-07, y: -5.960469E-08, z: -1, w: -4.21468E-08}
              m_Sgn: {x: 1, y: 1, z: 1}
              m_Limit:
                m_Min: {x: 0, y: 0, z: -0.7853982}
                m_Max: {x: 0, y: 0, z: 0.7853982}
              m_Length: 0.0002605132
              m_Type: 1
            - m_PreQ: {x: -2.980232E-08, y: -1.043081E-06, z: 1, w: 2.980232E-08}
              m_PostQ: {x: -2.980232E-08, y: -1.043081E-06, z: 1, w: 2.980232E-08}
              m_Sgn: {x: 1, y: 1, z: 1}
              m_Limit:
                m_Min: {x: -0.6981317, y: -0.6981317, z: -0.6981317}
                m_Max: {x: 0.6981317, y: 0.6981317, z: 0.6981317}
              m_Length: 0.0006599631
              m_Type: 1
            - m_PreQ: {x: -0.9659137, y: -0.2588648, z: -2.734715E-07, w: 9.7874E-07}
              m_PostQ: {x: 5.960464E-08, y: -1.043081E-06, z: -1, w: 0}
              m_Sgn: {x: 1, y: 1, z: 1}
              m_Limit:
                m_Min: {x: -1.047198, y: -1.047198, z: -1.570796}
                m_Max: {x: 1.047198, y: 1.047198, z: 0.8726646}
              m_Length: 0.003460438
              m_Type: 1
            - m_PreQ: {x: -6.164377E-07, y: -8.447479E-07, z: -0.7660821, w: 0.6427429}
              m_PostQ: {x: 5.960464E-08, y: -1.043081E-06, z: -1, w: 0}
              m_Sgn: {x: 1, y: 1, z: -1}
              m_Limit:
                m_Min: {x: -1.570796, y: 0, z: -1.396263}
                m_Max: {x: 1.570796, y: 0, z: 1.396263}
              m_Length: 0.004164928
              m_Type: 1
            - m_PreQ: {x: 5.960464E-08, y: -1.043081E-06, z: -1, w: 0}
              m_PostQ: {x: 5.960464E-08, y: -1.043081E-06, z: -1, w: 0}
              m_Sgn: {x: 1, y: 1, z: 1}
              m_Limit:
                m_Min: {x: 0, y: -0.5235988, z: -0.8726646}
                m_Max: {x: 0, y: 0.5235988, z: 0.8726646}
              m_Length: 0.001589476
              m_Type: 1
            - m_PreQ: {x: -7.748605E-07, y: 6.854535E-07, z: 0.7071068, w: 0.7071068}
              m_PostQ: {x: 1.013279E-06, y: 6.322027E-08, z: -1, w: 2.107342E-08}
              m_Sgn: {x: 1, y: 1, z: 1}
              m_Limit:
                m_Min: {x: 0, y: 0, z: -0.8726646}
                m_Max: {x: 0, y: 0, z: 0.8726646}
              m_Length: 0.0005382756
              m_Type: 1
            - m_PreQ: {x: -0.9659137, y: -0.2588648, z: -2.734715E-07, w: 9.7874E-07}
              m_PostQ: {x: 5.960464E-08, y: -1.043081E-06, z: -1, w: 0}
              m_Sgn: {x: -1, y: -1, z: 1}
              m_Limit:
                m_Min: {x: -1.047198, y: -1.047198, z: -1.570796}
                m_Max: {x: 1.047198, y: 1.047198, z: 0.8726646}
              m_Length: 0.003460438
              m_Type: 1
            - m_PreQ: {x: -6.620998E-07, y: -8.9041E-07, z: -0.7660821, w: 0.6427429}
              m_PostQ: {x: -2.980232E-08, y: -1.043081E-06, z: -1, w: 0}
              m_Sgn: {x: -1, y: 1, z: -1}
              m_Limit:
                m_Min: {x: -1.570796, y: 0, z: -1.396263}
                m_Max: {x: 1.570796, y: 0, z: 1.396263}
              m_Length: 0.00416493
              m_Type: 1
            - m_PreQ: {x: 5.960464E-08, y: -1.043081E-06, z: -1, w: 0}
              m_PostQ: {x: 5.960464E-08, y: -1.043081E-06, z: -1, w: 0}
              m_Sgn: {x: 1, y: -1, z: 1}
              m_Limit:
                m_Min: {x: 0, y: -0.5235988, z: -0.8726646}
                m_Max: {x: 0, y: 0.5235988, z: 0.8726646}
              m_Length: 0.001589474
              m_Type: 1
            - m_PreQ: {x: -7.748605E-07, y: 6.854535E-07, z: 0.7071068, w: 0.7071068}
              m_PostQ: {x: 1.013279E-06, y: 6.322027E-08, z: -1, w: 2.107342E-08}
              m_Sgn: {x: 1, y: 1, z: 1}
              m_Limit:
                m_Min: {x: 0, y: 0, z: -0.8726646}
                m_Max: {x: 0, y: 0, z: 0.8726646}
              m_Length: 0.0005382757
              m_Type: 1
        m_SkeletonPose:
          data:
            m_X:
            - t: {x: 0, y: 0, z: 0}
              q: {x: 0, y: 0, z: 0, w: 1}
              s: {x: 1, y: 1, z: 1}
            - t: {x: 5.256598E-16, y: 0.00921484, z: 1.482503E-10}
              q: {x: 0.4999995, y: -0.4999995, z: -0.5000005, w: 0.5000005}
              s: {x: 1, y: 1, z: 1}
            - t: {x: -0.001816437, y: -9.845244E-07, z: 2.644924E-09}
              q: {x: 0, y: 0, z: 0, w: 0.9999999}
              s: {x: 1, y: 1, z: 1}
            - t: {x: -0.002495463, y: -2.784421E-06, z: 7.639755E-11}
              q: {x: 0, y: 0, z: 0, w: 0.9999999}
              s: {x: 1, y: 1, z: 1}
            - t: {x: -0.003496778, y: -5.252659E-07, z: 2.557385E-10}
              q: {x: 0, y: 0, z: 0, w: 0.9999999}
              s: {x: 1, y: 1, z: 1}
            - t: {x: 0.001373091, y: -0.0001312615, z: 0.001482953}
              q: {x: 0.7071067, y: -2.980232E-08, z: -0.7071068, w: 6.071093E-08}
              s: {x: 0.9999999, y: 1, z: 1}
            - t: {x: -0.001339315, y: -3.774757E-15, z: 1.128957E-10}
              q: {x: 0, y: 0, z: 0, w: 1}
              s: {x: 0.9999999, y: 1, z: 1}
            - t: {x: -0.002282344, y: 3.34932E-12, z: 1.92387E-10}
              q: {x: 0, y: 0, z: 0, w: 1}
              s: {x: 1, y: 0.9999999, z: 0.9999999}
            - t: {x: -0.002146711, y: -7.60527E-11, z: -1.681691E-09}
              q: {x: 0.7071068, y: 7.539626E-14, z: -3.552714E-14, w: -0.7071068}
              s: {x: 0.9999999, y: 1, z: 1}
            - t: {x: -0.0004746913, y: 0.0004760649, z: -0.0009517093}
              q: {x: 0, y: 0.3826835, z: 1.776357E-15, w: -0.9238795}
              s: {x: 0.9999998, y: 1, z: 1}
            - t: {x: -0.0007984825, y: 5.336742E-11, z: -3.492459E-10}
              q: {x: 0, y: 0, z: -4.440892E-16, w: 1}
              s: {x: 1, y: 0.9999997, z: 0.9999999}
            - t: {x: -0.001525025, y: 1.734094E-09, z: -7.262901E-11}
              q: {x: 0, y: 0, z: 0, w: 1}
              s: {x: 1, y: 1, z: 1}
            - t: {x: -0.0004631347, y: -1.901683E-09, z: -2.162714E-12}
              q: {x: 0, y: 0, z: 0, w: 1}
              s: {x: 1, y: 1.000001, z: 1}
            - t: {x: 0.001373092, y: -0.0001312533, z: -0.001482953}
              q: {x: 0.7071067, y: -5.243101E-08, z: 0.7071068, w: -5.960464E-08}
              s: {x: 1, y: 1, z: 1}
            - t: {x: -0.001339315, y: -2.50977E-12, z: 1.128957E-10}
              q: {x: 0, y: 0, z: 0, w: 1}
              s: {x: 1.000001, y: 1, z: 1}
            - t: {x: -0.002282343, y: -6.438625E-12, z: -1.670257E-09}
              q: {x: 0, y: 0, z: 0, w: 1}
              s: {x: 1, y: 1, z: 1}
            - t: {x: -0.002146712, y: 8.526507E-14, z: 1.809542E-10}
              q: {x: 0.7071068, y: -2.842171E-14, z: -2.927692E-14, w: 0.7071068}
              s: {x: 0.9999998, y: 0.9999998, z: 0.9999999}
            - t: {x: -0.0004746922, y: 0.0004760632, z: 0.0009517096}
              q: {x: 7.142656E-16, y: 0.3826835, z: 4.096248E-15, w: 0.9238795}
              s: {x: 0.9999998, y: 0.9999998, z: 0.9999995}
            - t: {x: -0.000798481, y: 1.149002E-10, z: 7.275955E-11}
              q: {x: 0, y: 0, z: 8.881784E-16, w: 0.9999999}
              s: {x: 0.9999997, y: 0.9999999, z: 1}
            - t: {x: -0.001525025, y: 1.2855E-10, z: 6.296069E-12}
              q: {x: 0, y: 0, z: 1.407281E-15, w: 1}
              s: {x: 1, y: 1, z: 0.9999999}
            - t: {x: -0.000463134, y: 3.903926E-11, z: -1.4559E-10}
              q: {x: 0, y: 0, z: 1.407281E-15, w: 1}
              s: {x: 1.000001, y: 1, z: 0.9999998}
            - t: {x: -0.000659963, y: 0, z: 1.887071E-11}
              q: {x: 0, y: 0, z: 0, w: 0.9999999}
              s: {x: 1, y: 1, z: 1}
            - t: {x: 0.001816435, y: 2.42691E-06, z: 0.001666741}
              q: {x: 2.980232E-08, y: 0.9999999, z: -1.490116E-08, w: -4.470348E-08}
              s: {x: 1, y: 1, z: 1}
            - t: {x: -0.003460437, y: -2.328305E-10, z: -3.093871E-10}
              q: {x: 0, y: 0, z: 0, w: 0.9999999}
              s: {x: 1, y: 1, z: 1}
            - t: {x: -0.004164927, y: -4.65661E-10, z: -3.723734E-10}
              q: {x: 0, y: 0, z: 0, w: 0.9999999}
              s: {x: 1, y: 1, z: 1}
            - t: {x: -0.001321081, y: 0.001700173, z: -1.164153E-10}
              q: {x: 2.980232E-08, y: 2.980232E-08, z: 0.7071068, w: -0.7071068}
              s: {x: 1, y: 1, z: 1}
            - t: {x: 0.001816436, y: 2.435874E-06, z: -0.001666742}
              q: {x: 2.980232E-08, y: 0.9999999, z: -1.490116E-08, w: -4.470348E-08}
              s: {x: 1, y: 1, z: 1}
            - t: {x: -0.003460437, y: -2.328306E-10, z: -3.093872E-10}
              q: {x: 0, y: 0, z: 0, w: 0.9999999}
              s: {x: 1, y: 1, z: 1}
            - t: {x: -0.004164927, y: -4.656611E-10, z: -2.312769E-11}
              q: {x: 0, y: 0, z: 0, w: 0.9999999}
              s: {x: 1, y: 1, z: 1}
            - t: {x: -0.001321081, y: 0.001700173, z: -1.164153E-10}
              q: {x: 2.980232E-08, y: 2.980232E-08, z: 0.7071068, w: -0.7071068}
              s: {x: 1, y: 1, z: 1}
        m_LeftHand:
          data:
            m_HandBoneIndex: 090000000a000000ffffffff0b0000000c000000ffffffffffffffffffffffffffffffffffffffffffffffffffffffffffffffffffffffffffffffff
        m_RightHand:
          data:
            m_HandBoneIndex: 1100000012000000ffffffff1300000014000000ffffffffffffffffffffffffffffffffffffffffffffffffffffffffffffffffffffffffffffffff
        m_Handles:
        m_ColliderArray: []
        m_HumanBoneIndex: 01000000160000001a000000170000001b000000180000001c0000000200000003000000ffffffff0400000015000000050000000d000000060000000e000000070000000f0000000800000010000000190000001d000000ffffffffffffffffffffffff
        m_HumanBoneMass:
        - 0.1454546
        - 0.1212121
        - 0.1212121
        - 0.04848485
        - 0.04848485
        - 0.009696971
        - 0.009696971
        - 0.03030303
        - 0.2909091
        - 0
        - 0.01212121
        - 0.04848485
        - 0.006060607
        - 0.006060607
        - 0.02424243
        - 0.02424243
        - 0.01818182
        - 0.01818182
        - 0.006060607
        - 0.006060607
        - 0.002424243
        - 0.002424243
        - 0
        - 0
        - 0
        m_ColliderIndex: 
        m_Scale: 0.01127646
        m_ArmTwist: 0.5
        m_ForeArmTwist: 0.5
        m_UpperLegTwist: 0.5
        m_LegTwist: 0.5
        m_ArmStretch: 0.05
        m_LegStretch: 0.05
        m_FeetSpacing: 0
        m_HasLeftHand: 1
        m_HasRightHand: 1
        m_HasTDoF: 1
    m_HumanSkeletonIndexArray: 02000000030000000400000005000000060000000700000008000000090000000a0000000b0000000c0000000d0000000e0000000f0000001000000011000000120000001300000014000000150000001600000017000000190000001a0000001b0000001c0000001d0000001e0000001f00000020000000
    m_HumanSkeletonReverseIndexArray: ffffffffffffffff000000000100000002000000030000000400000005000000060000000700000008000000090000000a0000000b0000000c0000000d0000000e0000000f000000100000001100000012000000130000001400000015000000ffffffff160000001700000018000000190000001a0000001b0000001c0000001d000000
    m_RootMotionBoneIndex: -1
    m_RootMotionBoneX:
      t: {x: 0, y: 0, z: 0}
      q: {x: 0, y: 0, z: 0, w: 1}
      s: {x: 1, y: 1, z: 1}
    m_RootMotionSkeleton:
      data:
        m_Node:
        m_ID: 
        m_AxesArray: []
    m_RootMotionSkeletonPose:
      data:
        m_X:
    m_RootMotionSkeletonIndexArray: 
  m_TOS:
    2215216970: Bip001/Bip001 Pelvis/Bip001 Spine
    3443741976: Bip001/Bip001 Pelvis/Bip001 Spine/Bip001 Spine1/Bip001 Neck/Bip001 R Clavicle/Bip001 R UpperArm/Bip001 R Forearm/Bip001 R Hand/Bip001 R Finger0
    889785288: Bip001/Bip001 Pelvis/Bip001 Spine/Bip001 Spine1/Bip001 Neck/Bip001 Head
    918721797: Bip001/Bip001 Pelvis/Bip001 Spine/Bip001 Spine1/Bip001 Neck/Bip001 R Clavicle/Bip001 R UpperArm/Bip001 R Forearm/Bip001 R Hand/Bip001 R Finger1/Bip001 R Finger11
    4174947231: Bip001/Bip001 Pelvis/Bip001 Spine/Bip001 Spine1/Bip001 Neck/Bip001 L Clavicle/Bip001 L UpperArm/Bip001 L Forearm
    1056531558: Bip001/Bip001 Pelvis/Bip001 Spine/Bip001 Spine1/Bip001 Neck/Bip001 L Clavicle/Bip001 L UpperArm/Bip001 L Forearm/Bip001 L Hand/Bip001 L Finger1/Bip001 L Finger11
    490810258: Bip001/Bip001 Pelvis/Bip001 Spine/Bip001 Spine1/Bip001 Neck/Bip001 R Clavicle/Bip001 R UpperArm
    3019019378: Bip001/Bip001 Pelvis/Bip001 Spine/Bip001 Spine1/Bip001 Neck/Bip001 Head/hair1
    4026586495: Bip001/Bip001 Pelvis/Bip001 Spine/Bip001 Spine1/Bip001 Neck/Bip001 L Clavicle/Bip001 L UpperArm/Bip001 L Forearm/Bip001 L Hand/Bip001 L Finger0/Bip001 L Finger01
    2953557598: Bip001/Bip001 Pelvis/Bip001 Spine/Bip001 L Thigh
    929738175: Bip001/Bip001 Pelvis/Bip001 Spine/Bip001 Spine1/Bip001 Neck/Bip001 L Clavicle/Bip001 L UpperArm
    3132599029: Bip001/Bip001 Pelvis/Bip001 Spine/Bip001 Spine1/Bip001 Neck/Bip001 R Clavicle/Bip001 R UpperArm/Bip001 R Forearm/Bip001 R Hand
    2797366333: Bip001
    2280280525: Bip001/Bip001 Pelvis/Bip001 Spine/Bip001 R Thigh
    1011227896: Bip001/Bip001 Pelvis/Bip001 Spine/Bip001 Spine1/Bip001 Neck/Bip001 L Clavicle
    983439169: Bip001/Bip001 Pelvis/Bip001 Spine/Bip001 R Thigh/Bip001 R Calf/Bip001 R Foot
    2463291635: Bip001/Bip001 Pelvis/Bip001 Spine/Bip001 L Thigh/Bip001 L Calf/Bip001 L Foot/Bip001 L Toe0
    4286739511: Bip001/Bip001 Pelvis/Bip001 Spine/Bip001 R Thigh/Bip001 R Calf/Bip001 R Foot/Bip001 R Toe0
    1822801957: Bip001/Bip001 Pelvis/Bip001 Spine/Bip001 R Thigh/Bip001 R Calf
    0: 
    749309574: Main01
    3004435413: Bip001/Bip001 Pelvis/Bip001 Spine/Bip001 L Thigh/Bip001 L Calf/Bip001 L Foot
    1945902455: Bip001/Bip001 Pelvis/Bip001 Spine/Bip001 Spine1/Bip001 Neck/Bip001 L Clavicle/Bip001 L UpperArm/Bip001 L Forearm/Bip001 L Hand/Bip001 L Finger1
    3125044622: Bip001/Bip001 Pelvis/Bip001 Spine/Bip001 Spine1/Bip001 Neck/Bip001 R Clavicle/Bip001 R UpperArm/Bip001 R Forearm/Bip001 R Hand/Bip001 R Finger1
    916886706: Bip001/Bip001 Pelvis/Bip001 Spine/Bip001 Spine1
    83570145: Bip001/Bip001 Pelvis/Bip001 Spine/Bip001 Spine1/Bip001 Neck/Bip001 L Clavicle/Bip001 L UpperArm/Bip001 L Forearm/Bip001 L Hand/Bip001 L Finger0
    3361596310: Bip001/Bip001 Pelvis/Bip001 Spine/Bip001 Spine1/Bip001 Neck
    1999620647: Bip001/Bip001 Pelvis/Bip001 Spine/Bip001 Spine1/Bip001 Neck/Bip001 L Clavicle/Bip001 L UpperArm/Bip001 L Forearm/Bip001 L Hand
    86093219: Bip001/Bip001 Pelvis/Bip001 Spine/Bip001 Spine1/Bip001 Neck/Bip001 R Clavicle
    3444751762: Bip001/Bip001 Pelvis/Bip001 Spine/Bip001 L Thigh/Bip001 L Calf
    3871937959: Bip001/Bip001 Pelvis/Bip001 Spine/Bip001 Spine1/Bip001 Neck/Bip001 R Clavicle/Bip001 R UpperArm/Bip001 R Forearm
    4260483625: Bip001/Bip001 Pelvis
    4164625436: Bip001/Bip001 Pelvis/Bip001 Spine/Bip001 Spine1/Bip001 Neck/Bip001 R Clavicle/Bip001 R UpperArm/Bip001 R Forearm/Bip001 R Hand/Bip001 R Finger0/Bip001 R Finger01
