%YAML 1.1
%TAG !u! tag:unity3d.com,2011:
--- !u!90 &9000000
Avatar:
  m_ObjectHideFlags: 0
  m_PrefabParentObject: {fileID: 0}
  m_PrefabInternal: {fileID: 0}
  m_Name: "agoi_basemodelxAvatar"
  m_AvatarSize: 6264
  m_Avatar:
    serializedVersion: 3
    m_AvatarSkeleton:
      data:
        m_Node:
        - m_ParentId: -1
          m_AxesId: -1
        - m_ParentId: 0
          m_AxesId: -1
        - m_ParentId: 1
          m_AxesId: -1
        - m_ParentId: 2
          m_AxesId: -1
        - m_ParentId: 3
          m_AxesId: -1
        - m_ParentId: 4
          m_AxesId: -1
        - m_ParentId: 5
          m_AxesId: -1
        - m_ParentId: 2
          m_AxesId: -1
        - m_ParentId: 7
          m_AxesId: -1
        - m_ParentId: 8
          m_AxesId: -1
        - m_ParentId: 9
          m_AxesId: -1
        - m_ParentId: 2
          m_AxesId: -1
        - m_ParentId: 11
          m_AxesId: -1
        - m_ParentId: 12
          m_AxesId: -1
        - m_ParentId: 1
          m_AxesId: -1
        - m_ParentId: 14
          m_AxesId: -1
        - m_ParentId: 15
          m_AxesId: -1
        - m_ParentId: 16
          m_AxesId: -1
        - m_ParentId: 1
          m_AxesId: -1
        - m_ParentId: 18
          m_AxesId: -1
        - m_ParentId: 19
          m_AxesId: -1
        - m_ParentId: 20
          m_AxesId: -1
        - m_ParentId: 0
          m_AxesId: -1
        m_ID: 0000000066128758e142b617049d1f957c08cfed310a9b9a8545bb105f2c78ac518ee4c709bc8a84572523dd557e94513d6787df10019e1e0dcd631fcaf982dc76d6a6beeaf84ca59e2a8228c36db2599623e69c53260640d68d97b1
        m_AxesArray: []
    m_AvatarSkeletonPose:
      data:
        m_X:
        - t: {x: 0, y: 0, z: 0}
          q: {x: 0, y: 0, z: 0, w: 1}
          s: {x: 1, y: 1, z: 1}
        - t: {x: -7.486163E-06, y: 0.006568322, z: -2.871729E-05}
          q: {x: 0.0001800454, y: 4.944354E-05, z: -0.707108, w: 0.7071056}
          s: {x: 1, y: 1, z: 1}
        - t: {x: -0.004052637, y: 1.856824E-10, z: -1.862645E-10}
          q: {x: -1.573572E-05, y: -2.605728E-08, z: -0.002131928, w: 0.9999977}
          s: {x: 1, y: 1, z: 1}
        - t: {x: -0.003997564, y: 4.656613E-12, z: 1.192093E-09}
          q: {x: 1.507995E-07, y: 7.559825E-08, z: -0.7472233, w: 0.664573}
          s: {x: 1, y: 1, z: 1}
        - t: {x: -0.003674794, y: 2.220446E-18, z: 0}
          q: {x: -0.104319, y: -0.007784263, z: 0.04644962, w: 0.9934281}
          s: {x: 1, y: 1, z: 1}
        - t: {x: -0.003020921, y: 3.576279E-09, z: 5.960464E-10}
          q: {x: 0.04114874, y: 0.02648859, z: 0.006805781, w: 0.9987787}
          s: {x: 1, y: 1, z: 1}
        - t: {x: -0.002671409, y: -1.192093E-09, z: 2.980232E-10}
          q: {x: 3.298959E-08, y: -1.605716E-08, z: -0.03474729, w: 0.9993961}
          s: {x: 1, y: 1, z: 1}
        - t: {x: -0.003997564, y: 4.656613E-12, z: 1.192093E-09}
          q: {x: 6.055788E-08, y: 1.114767E-08, z: 0.7505366, w: 0.6608289}
          s: {x: 1, y: 1, z: 1}
        - t: {x: -0.003575448, y: -6.661338E-18, z: 4.336809E-21}
          q: {x: 0.04713148, y: 0.9934042, z: 0.1042358, w: 0.007863085}
          s: {x: -1, y: -1, z: -1}
        - t: {x: -0.003020922, y: 4.172325E-09, z: 5.960464E-10}
          q: {x: 0.1712586, y: 0.02716287, z: 0.003332112, w: 0.984846}
          s: {x: 1, y: 1, z: 1}
        - t: {x: -0.002671409, y: -1.110223E-18, z: 0}
          q: {x: 2.978433E-08, y: -1.03555E-09, z: -0.03474729, w: 0.9993961}
          s: {x: 1, y: 1, z: 1}
        - t: {x: -0.003997567, y: -1.734723E-20, z: 4.423782E-11}
          q: {x: 1.916501E-05, y: -0.0001648008, z: 0.001689649, w: 0.9999986}
          s: {x: 0.999999, y: 1, z: 1}
        - t: {x: -0.0006655382, y: -1.917047E-06, z: -2.655421E-06}
          q: {x: -0.5000004, y: 0.4999996, z: 0.4999995, w: 0.5000005}
          s: {x: 1, y: 1, z: 1}
        - t: {x: -8.232709E-09, y: 0.001196189, z: -1.06226E-06}
          q: {x: 3.050283E-17, y: -2.043349E-16, z: -9.635E-21, w: 1}
          s: {x: 1, y: 1, z: 1}
        - t: {x: -0.0003200066, y: -0.001641263, z: -5.245209E-08}
          q: {x: -0.000164665, y: 1.537535E-05, z: 0.9999999, w: 0.0004423882}
          s: {x: 1, y: 1, z: 1}
        - t: {x: -0.002830852, y: -2.514089E-06, z: -1.350325E-08}
          q: {x: 6.776264E-20, y: -1.865777E-35, z: -2.753401E-16, w: 1}
          s: {x: 1, y: 1, z: 1}
        - t: {x: -0.003264597, y: -2.8993E-06, z: -1.557223E-08}
          q: {x: 2.238933E-35, y: 8.131516E-20, z: -2.753401E-16, w: 1}
          s: {x: 1, y: 1, z: 1}
        - t: {x: -8.442762E-09, y: -2.802564E-07, z: 0.001822139}
          q: {x: 4.065758E-20, y: 1.355253E-19, z: -2.753401E-16, w: 1}
          s: {x: 1, y: 1, z: 1}
        - t: {x: -0.0003170979, y: 0.001645656, z: -1.543784E-07}
          q: {x: -0.0001646648, y: 1.573299E-05, z: 0.9999999, w: 0.0004425075}
          s: {x: 1, y: 1, z: 1}
        - t: {x: -0.002830852, y: -2.514764E-06, z: -1.350143E-08}
          q: {x: 3.049319E-20, y: 8.131516E-20, z: 4.378638E-17, w: 1}
          s: {x: 1, y: 1, z: 1}
        - t: {x: -0.003264597, y: -2.900079E-06, z: -1.557013E-08}
          q: {x: 3.388132E-21, y: 2.710505E-20, z: 4.378638E-17, w: 1}
          s: {x: 1, y: 1, z: 1}
        - t: {x: -8.442682E-09, y: -2.789529E-07, z: 0.001822139}
          q: {x: 1.694066E-20, y: 2.710505E-20, z: 4.378639E-17, w: 1}
          s: {x: 1, y: 1, z: 1}
        - t: {x: 0, y: 0, z: 0.000191879}
          q: {x: 8.146034E-08, y: 0, z: 0, w: 1}
          s: {x: 1, y: 1, z: 1}
    m_DefaultPose:
      data:
        m_X:
        - t: {x: 0, y: 0, z: 0}
          q: {x: 0, y: 0, z: 0, w: 1}
          s: {x: 1, y: 1, z: 1}
        - t: {x: -7.486163E-06, y: 0.006568322, z: -2.871729E-05}
          q: {x: 0.0001800454, y: 4.944354E-05, z: -0.707108, w: 0.7071056}
          s: {x: 1, y: 1, z: 1}
        - t: {x: -0.004052637, y: 1.856824E-10, z: -1.862645E-10}
          q: {x: -1.573572E-05, y: -2.605728E-08, z: -0.002131928, w: 0.9999977}
          s: {x: 1, y: 1, z: 1}
        - t: {x: -0.003997564, y: 4.656613E-12, z: 1.192093E-09}
          q: {x: 1.507995E-07, y: 7.559825E-08, z: -0.7472233, w: 0.664573}
          s: {x: 1, y: 1, z: 1}
        - t: {x: -0.003674794, y: 2.220446E-18, z: 0}
          q: {x: -0.08293016, y: -0.06369982, z: -0.5064632, w: 0.8558971}
          s: {x: 1, y: 1, z: 1}
        - t: {x: -0.003020921, y: 3.576279E-09, z: 5.960464E-10}
          q: {x: 0.03480116, y: 0.3180431, z: -0.0734383, w: 0.9445869}
          s: {x: 1, y: 1, z: 1}
        - t: {x: -0.002671409, y: -1.192093E-09, z: 2.980232E-10}
          q: {x: 3.298959E-08, y: -1.605716E-08, z: -0.03474729, w: 0.9993961}
          s: {x: 1, y: 1, z: 1}
        - t: {x: -0.003997564, y: 4.656613E-12, z: 1.192093E-09}
          q: {x: 6.055788E-08, y: 1.114767E-08, z: 0.7505366, w: 0.6608289}
          s: {x: 1, y: 1, z: 1}
        - t: {x: -0.003575448, y: -6.661338E-18, z: 4.336809E-21}
          q: {x: -0.5050211, y: 0.8567489, z: 0.08287399, w: 0.06377297}
          s: {x: -1, y: -1, z: -1}
        - t: {x: -0.003020922, y: 4.172325E-09, z: 5.960464E-10}
          q: {x: 0.1578749, y: 0.3057148, z: -0.1143077, w: 0.9319591}
          s: {x: 1, y: 1, z: 1}
        - t: {x: -0.002671409, y: -1.110223E-18, z: 0}
          q: {x: 2.978433E-08, y: -1.03555E-09, z: -0.03474729, w: 0.9993961}
          s: {x: 1, y: 1, z: 1}
        - t: {x: -0.003997567, y: -1.734723E-20, z: 4.423782E-11}
          q: {x: 1.916501E-05, y: -0.0001648008, z: 0.001689649, w: 0.9999986}
          s: {x: 0.999999, y: 1, z: 1}
        - t: {x: -0.0006655382, y: -1.917047E-06, z: -2.655421E-06}
          q: {x: -0.5000004, y: 0.4999996, z: 0.4999995, w: 0.5000005}
          s: {x: 1, y: 1, z: 1}
        - t: {x: -8.232709E-09, y: 0.001196189, z: -1.06226E-06}
          q: {x: 3.050283E-17, y: -2.043349E-16, z: -9.635E-21, w: 1}
          s: {x: 1, y: 1, z: 1}
        - t: {x: -0.0003200066, y: -0.001641263, z: -5.245209E-08}
          q: {x: -0.000164665, y: 1.537535E-05, z: 0.9999999, w: 0.0004423882}
          s: {x: 1, y: 1, z: 1}
        - t: {x: -0.002830852, y: -2.514089E-06, z: -1.350325E-08}
          q: {x: 6.776264E-20, y: -1.865777E-35, z: -2.753401E-16, w: 1}
          s: {x: 1, y: 1, z: 1}
        - t: {x: -0.003264597, y: -2.8993E-06, z: -1.557223E-08}
          q: {x: 2.238933E-35, y: 8.131516E-20, z: -2.753401E-16, w: 1}
          s: {x: 1, y: 1, z: 1}
        - t: {x: -8.442762E-09, y: -2.802564E-07, z: 0.001822139}
          q: {x: 4.065758E-20, y: 1.355253E-19, z: -2.753401E-16, w: 1}
          s: {x: 1, y: 1, z: 1}
        - t: {x: -0.0003170979, y: 0.001645656, z: -1.543784E-07}
          q: {x: -0.0001646648, y: 1.573299E-05, z: 0.9999999, w: 0.0004425075}
          s: {x: 1, y: 1, z: 1}
        - t: {x: -0.002830852, y: -2.514764E-06, z: -1.350143E-08}
          q: {x: 3.049319E-20, y: 8.131516E-20, z: 4.378638E-17, w: 1}
          s: {x: 1, y: 1, z: 1}
        - t: {x: -0.003264597, y: -2.900079E-06, z: -1.557013E-08}
          q: {x: 3.388132E-21, y: 2.710505E-20, z: 4.378638E-17, w: 1}
          s: {x: 1, y: 1, z: 1}
        - t: {x: -8.442682E-09, y: -2.789529E-07, z: 0.001822139}
          q: {x: 1.694066E-20, y: 2.710505E-20, z: 4.378639E-17, w: 1}
          s: {x: 1, y: 1, z: 1}
        - t: {x: 0, y: 0, z: 0.000191879}
          q: {x: 8.146034E-08, y: 0, z: 0, w: 1}
          s: {x: 1, y: 1, z: 1}
    m_SkeletonNameIDArray: 00000000661287588ccc354d09834d9e8e84660d50d0f1bdc8faf77f52322aa7d5350134b349f3d923992b4630763e3d91e172ad9cf6f3a7432c30c5b1cfcc6c0b9ec5f59daec282d0cbd1f2a8ecfd0512bdf49c848df3ebd68d97b1
    m_Human:
      data:
        serializedVersion: 2
        m_RootX:
          t: {x: 4.901228E-05, y: 0.009614737, z: -2.463484E-05}
          q: {x: 0.0001698017, y: -7.601161E-05, z: -0.004423515, w: 0.9999902}
          s: {x: 1, y: 1, z: 1}
        m_Skeleton:
          data:
            m_Node:
            - m_ParentId: -1
              m_AxesId: -1
            - m_ParentId: 0
              m_AxesId: 0
            - m_ParentId: 1
              m_AxesId: 1
            - m_ParentId: 2
              m_AxesId: -1
            - m_ParentId: 3
              m_AxesId: 2
            - m_ParentId: 4
              m_AxesId: 3
            - m_ParentId: 5
              m_AxesId: 4
            - m_ParentId: 2
              m_AxesId: -1
            - m_ParentId: 7
              m_AxesId: 5
            - m_ParentId: 8
              m_AxesId: 6
            - m_ParentId: 9
              m_AxesId: 7
            - m_ParentId: 2
              m_AxesId: 8
            - m_ParentId: 11
              m_AxesId: 9
            - m_ParentId: 1
              m_AxesId: 10
            - m_ParentId: 13
              m_AxesId: 11
            - m_ParentId: 14
              m_AxesId: 12
            - m_ParentId: 1
              m_AxesId: 13
            - m_ParentId: 16
              m_AxesId: 14
            - m_ParentId: 17
              m_AxesId: 15
            m_ID: 0000000066128758e142b617049d1f957c08cfed310a9b9a8545bb105f2c78ac518ee4c709bc8a84572523dd557e94513d6787df0dcd631fcaf982dc76d6a6be9e2a8228c36db2599623e69c
            m_AxesArray:
            - m_PreQ: {x: -0.4999197, y: -0.5000803, z: 0.4999181, w: 0.500082}
              m_PostQ: {x: -3.448076E-08, y: -0.7070415, z: 0.7071722, w: 1.018634E-08}
              m_Sgn: {x: 1, y: 1, z: 1}
              m_Limit:
                m_Min: {x: -0.6981317, y: -0.6981317, z: -0.6981317}
                m_Max: {x: 0.6981317, y: 0.6981317, z: 0.6981317}
              m_Length: 0.004052637
              m_Type: 1
            - m_PreQ: {x: -0.001507419, y: -0.7070399, z: 0.7071705, w: 0.001507643}
              m_PostQ: {x: -1.184526E-08, y: -0.7070526, z: 0.707161, w: 5.025504E-08}
              m_Sgn: {x: 1, y: 1, z: 1}
              m_Limit:
                m_Min: {x: -0.6981317, y: -0.6981317, z: -0.6981317}
                m_Max: {x: 0.6981317, y: 0.6981317, z: 0.6981317}
              m_Length: 0.003997568
              m_Type: 1
            - m_PreQ: {x: 0.2409277, y: 0.01873986, z: 0.9265162, w: 0.2883932}
              m_PostQ: {x: 3.690365E-08, y: -0.1047334, z: 0.9945003, w: 5.983165E-07}
              m_Sgn: {x: -1, y: 1, z: 1}
              m_Limit:
                m_Min: {x: -1.570796, y: -1.745329, z: -1.047198}
                m_Max: {x: 1.570796, y: 1.745329, z: 1.745329}
              m_Length: 0.003020921
              m_Type: 1
            - m_PreQ: {x: 0.5165809, y: -0.5712653, z: 0.4835705, w: 0.4158846}
              m_PostQ: {x: 2.272427E-07, y: -0.75032, z: 0.6610747, w: -1.412118E-07}
              m_Sgn: {x: -1, y: 1, z: 1}
              m_Limit:
                m_Min: {x: -1.570796, y: 0, z: -1.396263}
                m_Max: {x: 1.570796, y: 0, z: 1.396263}
              m_Length: 0.00267141
              m_Type: 1
            - m_PreQ: {x: 5.960464E-08, y: -0.06365801, z: 0.9979718, w: -2.600718E-07}
              m_PostQ: {x: 0.002212019, y: -0.06361953, z: 0.9973691, w: -0.03467707}
              m_Sgn: {x: 1, y: 1, z: 1}
              m_Limit:
                m_Min: {x: 0, y: -0.6981317, z: -1.396263}
                m_Max: {x: 0, y: 0.6981317, z: 1.396263}
              m_Length: 0.0006678525
              m_Type: 1
            - m_PreQ: {x: 0.2408967, y: -0.01903588, z: 0.9267165, w: -0.2877552}
              m_PostQ: {x: -0.9945089, y: 7.152556E-07, z: 2.903226E-08, w: 0.1046519}
              m_Sgn: {x: 1, y: 1, z: -1}
              m_Limit:
                m_Min: {x: -1.570796, y: -1.745329, z: -1.047198}
                m_Max: {x: 1.570796, y: 1.745329, z: 1.745329}
              m_Length: 0.003020924
              m_Type: 1
            - m_PreQ: {x: -0.4836311, y: 0.4159023, z: 0.5165787, w: 0.5712029}
              m_PostQ: {x: -0.7534708, y: 5.587934E-09, z: -1.210719E-08, w: 0.6574813}
              m_Sgn: {x: 1, y: 1, z: -1}
              m_Limit:
                m_Min: {x: -1.570796, y: 0, z: -1.396263}
                m_Max: {x: 1.570796, y: 0, z: 1.396263}
              m_Length: 0.00267141
              m_Type: 1
            - m_PreQ: {x: -0.997731, y: 1.303851E-08, z: -5.673199E-09, w: -0.06732655}
              m_PostQ: {x: -0.9971285, y: -0.03466843, z: -0.002339418, w: -0.06728593}
              m_Sgn: {x: 1, y: 1, z: -1}
              m_Limit:
                m_Min: {x: 0, y: -0.6981317, z: -1.396263}
                m_Max: {x: 0, y: 0.6981317, z: 1.396263}
              m_Length: 0.0006678525
              m_Type: 1
            - m_PreQ: {x: 0.001393858, y: -0.7070513, z: 0.7071592, w: -0.001623581}
              m_PostQ: {x: 0.0003157183, y: -0.7070393, z: 0.7071741, w: -0.0003121435}
              m_Sgn: {x: 1, y: 1, z: 1}
              m_Limit:
                m_Min: {x: -0.6981317, y: -0.6981317, z: -0.6981317}
                m_Max: {x: 0.6981317, y: 0.6981317, z: 0.6981317}
              m_Length: 0.000249848
              m_Type: 1
            - m_PreQ: {x: 0.4998269, y: 0.5002684, z: 0.4997291, w: -0.5001755}
              m_PostQ: {x: 9.533764E-05, y: 0.0004440382, z: 1, w: -3.3822E-06}
              m_Sgn: {x: 1, y: 1, z: -1}
              m_Limit:
                m_Min: {x: 0, y: -0.3490658, z: -0.1745329}
                m_Max: {x: 0, y: 0.3490658, z: 0.2617994}
              m_Length: 0.1
              m_Type: 1
            - m_PreQ: {x: -0.6830372, y: -0.183174, z: -0.1831379, w: 0.6829116}
              m_PostQ: {x: -0.0003123522, y: 0.7071611, z: -0.7070524, w: 0.0003156835}
              m_Sgn: {x: 1, y: 1, z: 1}
              m_Limit:
                m_Min: {x: -1.047198, y: -1.047198, z: -1.570796}
                m_Max: {x: 1.047198, y: 1.047198, z: 0.8726646}
              m_Length: 0.002830853
              m_Type: 1
            - m_PreQ: {x: 0.4542835, y: 0.5419442, z: -0.5414572, w: 0.4546947}
              m_PostQ: {x: -0.0003123522, y: 0.7071611, z: -0.7070524, w: 0.0003156835}
              m_Sgn: {x: 1, y: 1, z: -1}
              m_Limit:
                m_Min: {x: -1.570796, y: 0, z: -1.396263}
                m_Max: {x: 1.570796, y: 0, z: 1.396263}
              m_Length: 0.003264599
              m_Type: 1
            - m_PreQ: {x: -0.0003123522, y: 0.7071611, z: -0.7070524, w: 0.0003156835}
              m_PostQ: {x: -0.0003123522, y: 0.7071611, z: -0.7070524, w: 0.0003156835}
              m_Sgn: {x: 1, y: 1, z: 1}
              m_Limit:
                m_Min: {x: 0, y: -0.5235988, z: -0.8726646}
                m_Max: {x: 0, y: 0.5235988, z: 0.8726646}
              m_Length: 0.0007928829
              m_Type: 1
            - m_PreQ: {x: -0.6830371, y: -0.1831739, z: -0.1831379, w: 0.6829116}
              m_PostQ: {x: -0.0003124191, y: 0.7071609, z: -0.7070526, w: 0.0003157502}
              m_Sgn: {x: -1, y: -1, z: 1}
              m_Limit:
                m_Min: {x: -1.047198, y: -1.047198, z: -1.570796}
                m_Max: {x: 1.047198, y: 1.047198, z: 0.8726646}
              m_Length: 0.002830853
              m_Type: 1
            - m_PreQ: {x: 0.4542833, y: 0.5419441, z: -0.5414574, w: 0.4546949}
              m_PostQ: {x: -0.0003124191, y: 0.7071609, z: -0.7070526, w: 0.0003157502}
              m_Sgn: {x: -1, y: 1, z: -1}
              m_Limit:
                m_Min: {x: -1.570796, y: 0, z: -1.396263}
                m_Max: {x: 1.570796, y: 0, z: 1.396263}
              m_Length: 0.003264599
              m_Type: 1
            - m_PreQ: {x: -0.0003124489, y: 0.7071609, z: -0.7070526, w: 0.0003157801}
              m_PostQ: {x: -0.0003124489, y: 0.7071609, z: -0.7070526, w: 0.0003157801}
              m_Sgn: {x: 1, y: -1, z: 1}
              m_Limit:
                m_Min: {x: 0, y: -0.5235988, z: -0.8726646}
                m_Max: {x: 0, y: 0.5235988, z: 0.8726646}
              m_Length: 0.0007899632
              m_Type: 1
        m_SkeletonPose:
          data:
            m_X:
            - t: {x: 0, y: 0, z: 0}
              q: {x: 0, y: 0, z: 0, w: 1}
              s: {x: 1, y: 1, z: 1}
            - t: {x: -7.486163E-06, y: 0.006568322, z: -2.871729E-05}
              q: {x: 0.0001800454, y: 4.944354E-05, z: -0.707108, w: 0.7071056}
              s: {x: 1, y: 1, z: 1}
            - t: {x: -0.004052637, y: 0, z: -1.863327E-10}
              q: {x: -1.573571E-05, y: -2.606976E-08, z: -0.00213198, w: 0.9999977}
              s: {x: 1, y: 1, z: 1}
            - t: {x: -0.003997565, y: 4.656613E-10, z: 1.19212E-09}
              q: {x: 1.508015E-07, y: 7.558651E-08, z: -0.7472233, w: 0.664573}
              s: {x: 1, y: 1, z: 1}
            - t: {x: -0.003674795, y: 5.238689E-10, z: -5.115908E-13}
              q: {x: -0.1043191, y: -0.007784264, z: 0.04644962, w: 0.9934281}
              s: {x: 1, y: 1, z: 1}
            - t: {x: -0.003020921, y: 3.579771E-09, z: 6.002665E-10}
              q: {x: 0.04114874, y: 0.02648859, z: 0.006805781, w: 0.9987788}
              s: {x: 1, y: 1, z: 1}
            - t: {x: -0.002671411, y: -1.40426E-09, z: 2.228262E-10}
              q: {x: 4.109461E-08, y: -1.792796E-08, z: -0.0347473, w: 0.9993963}
              s: {x: 1, y: 1, z: 1}
            - t: {x: -0.003997565, y: 4.656613E-10, z: 1.19212E-09}
              q: {x: 6.055052E-08, y: 1.114677E-08, z: 0.7505366, w: 0.6608289}
              s: {x: 1, y: 1, z: 1}
            - t: {x: -0.003575448, y: 1.414264E-10, z: 3.410605E-13}
              q: {x: 0.04713148, y: 0.9934042, z: 0.1042358, w: 0.007863085}
              s: {x: -1, y: -1, z: -1}
            - t: {x: -0.003020926, y: 4.268259E-09, z: 6.202754E-10}
              q: {x: 0.1712586, y: 0.02716288, z: 0.003332112, w: 0.9848462}
              s: {x: 1, y: 1, z: 1}
            - t: {x: -0.002671412, y: 4.183676E-11, z: 2.910383E-11}
              q: {x: 2.788147E-08, y: -3.72529E-09, z: -0.0347473, w: 0.9993966}
              s: {x: 1, y: 1, z: 1}
            - t: {x: -0.003997568, y: 4.656613E-10, z: 4.342837E-11}
              q: {x: 1.916499E-05, y: -0.0001648008, z: 0.001689684, w: 0.9999986}
              s: {x: 0.999999, y: 1, z: 1}
            - t: {x: -0.0006655382, y: -1.917069E-06, z: -2.655421E-06}
              q: {x: -0.5000004, y: 0.4999996, z: 0.4999996, w: 0.5000005}
              s: {x: 1, y: 1, z: 1}
            - t: {x: -0.0003200066, y: -0.001641263, z: -5.245202E-08}
              q: {x: -0.000164665, y: 1.537535E-05, z: 0.9999999, w: 0.0004424427}
              s: {x: 1, y: 1, z: 1}
            - t: {x: -0.002830852, y: -2.514105E-06, z: -1.350327E-08}
              q: {x: 0, y: 0, z: -2.954201E-09, w: 1}
              s: {x: 1, y: 1, z: 1}
            - t: {x: -0.003264598, y: -2.899207E-06, z: -1.557228E-08}
              q: {x: 0, y: 0, z: -2.954201E-09, w: 1}
              s: {x: 1, y: 1, z: 1}
            - t: {x: -0.0003170976, y: 0.001645656, z: -1.543782E-07}
              q: {x: -0.0001646648, y: 1.573299E-05, z: 0.9999999, w: 0.0004425321}
              s: {x: 1, y: 1, z: 1}
            - t: {x: -0.002830852, y: -2.514804E-06, z: -1.350143E-08}
              q: {x: 0, y: 0, z: -2.92676E-09, w: 1}
              s: {x: 1, y: 1, z: 1}
            - t: {x: -0.003264597, y: -2.900138E-06, z: -1.557011E-08}
              q: {x: 0, y: 0, z: -2.92676E-09, w: 1}
              s: {x: 1, y: 1, z: 1}
        m_LeftHand:
          data:
            m_HandBoneIndex: ffffffffffffffffffffffffffffffffffffffffffffffffffffffffffffffffffffffffffffffffffffffffffffffffffffffffffffffffffffffff
        m_RightHand:
          data:
            m_HandBoneIndex: ffffffffffffffffffffffffffffffffffffffffffffffffffffffffffffffffffffffffffffffffffffffffffffffffffffffffffffffffffffffff
        m_Handles:
        m_ColliderArray: []
        m_HumanBoneIndex: 010000000d000000100000000e000000110000000f0000001200000002000000ffffffffffffffffffffffff0b000000ffffffffffffffff080000000400000009000000050000000a00000006000000ffffffffffffffff0c000000ffffffffffffffff
        m_HumanBoneMass:
        - 0.1454546
        - 0.1212121
        - 0.1212121
        - 0.04848485
        - 0.04848485
        - 0.01212121
        - 0.01212121
        - 0.3454545
        - 0
        - 0
        - 0
        - 0.04848485
        - 0
        - 0
        - 0.02424243
        - 0.02424243
        - 0.01818182
        - 0.01818182
        - 0.006060607
        - 0.006060607
        - 0
        - 0
        - 0
        - 0
        - 0
        m_ColliderIndex: 
        m_Scale: 0.009614737
        m_ArmTwist: 0.5
        m_ForeArmTwist: 0.5
        m_UpperLegTwist: 0.5
        m_LegTwist: 0.5
        m_ArmStretch: 0.05
        m_LegStretch: 0.05
        m_FeetSpacing: 0
        m_HasLeftHand: 0
        m_HasRightHand: 0
        m_HasTDoF: 0
    m_HumanSkeletonIndexArray: 000000000100000002000000030000000400000005000000060000000700000008000000090000000a0000000b0000000c0000000e0000000f00000010000000120000001300000014000000
    m_HumanSkeletonReverseIndexArray: 000000000100000002000000030000000400000005000000060000000700000008000000090000000a0000000b0000000c000000ffffffff0d0000000e0000000f000000ffffffff100000001100000012000000ffffffffffffffff
    m_RootMotionBoneIndex: -1
    m_RootMotionBoneX:
      t: {x: 0, y: 0, z: 0}
      q: {x: 0, y: 0, z: 0, w: 1}
      s: {x: 1, y: 1, z: 1}
    m_RootMotionSkeleton:
      data:
        m_Node:
        m_ID: 
        m_AxesArray: []
    m_RootMotionSkeletonPose:
      data:
        m_X:
    m_RootMotionSkeletonIndexArray: 
  m_TOS:
    3710068055: Bip001 Pelvis/Bip001 Spine/Bip001 L Clavicle/Bip001 L UpperArm/Bip001 L Forearm/Bip001 L Hand
    1368686165: Bip001 Pelvis/Bip001 Spine/Bip001 Head
    3989768316: Bip001 Pelvis/Bip001 Spine/Bip001 R Clavicle/Bip001 R UpperArm
    1074144851: Bip001 Pelvis/Bip001 R Thigh/Bip001 R Thigh1/Bip001 R Thigh2/Bip001 R Thigh3
    2632328086: Bip001 Pelvis/Bip001 R Thigh/Bip001 R Thigh1/Bip001 R Thigh2
    526634253: Bip001 Pelvis/Bip001 L Thigh
    3750192957: Bip001 Pelvis/Bip001 Spine/Bip001 Head/Base_Mouth
    397820641: Bip001 Pelvis/Bip001 Spine
    2979499478: Skin01_body
    280708485: Bip001 Pelvis/Bip001 Spine/Bip001 R Clavicle/Bip001 R UpperArm/Bip001 R Forearm/Bip001 R Hand
    0: 
    2773285098: Bip001 Pelvis/Bip001 L Thigh/Bip001 L Thigh1/Bip001 L Thigh2/Bip001 L Thigh3
    513671440: Bip001 Pelvis/Bip001 Spine/Bip001 Head/Base_Mouth/head
    3699571146: Bip001 Pelvis/Bip001 L Thigh/Bip001 L Thigh1
    1504865731: Bip001 Pelvis/Bip001 R Thigh/Bip001 R Thigh1
    1485247078: Bip001 Pelvis
    2223684617: Bip001 Pelvis/Bip001 Spine/Bip001 L Clavicle/Bip001 L UpperArm/Bip001 L Forearm
    2593851953: Bip001 Pelvis/Bip001 Spine/Bip001 R Clavicle/Bip001 R UpperArm/Bip001 R Forearm
    3198604918: Bip001 Pelvis/Bip001 L Thigh/Bip001 L Thigh1/Bip001 L Thigh2
    679619230: Bip001 Pelvis/Bip001 R Thigh
    2893556831: Bip001 Pelvis/Bip001 Spine/Bip001 L Clavicle
    3353644625: Bip001 Pelvis/Bip001 Spine/Bip001 L Clavicle/Bip001 L UpperArm
    2501876996: Bip001 Pelvis/Bip001 Spine/Bip001 R Clavicle
