%YAML 1.1
%TAG !u! tag:unity3d.com,2011:
--- !u!90 &9000000
Avatar:
  m_ObjectHideFlags: 0
  m_PrefabParentObject: {fileID: 0}
  m_PrefabInternal: {fileID: 0}
  m_Name: "CAvatar"
  m_AvatarSize: 2624
  m_Avatar:
    serializedVersion: 3
    m_AvatarSkeleton:
      data:
        m_Node:
        - m_ParentId: -1
          m_AxesId: -1
        - m_ParentId: 0
          m_AxesId: -1
        - m_ParentId: 0
          m_AxesId: -1
        - m_ParentId: 2
          m_AxesId: -1
        - m_ParentId: 3
          m_AxesId: -1
        - m_ParentId: 4
          m_AxesId: -1
        - m_ParentId: 5
          m_AxesId: -1
        - m_ParentId: 6
          m_AxesId: -1
        - m_ParentId: 2
          m_AxesId: -1
        - m_ParentId: 8
          m_AxesId: -1
        - m_ParentId: 9
          m_AxesId: -1
        - m_ParentId: 8
          m_AxesId: -1
        - m_ParentId: 11
          m_AxesId: -1
        - m_ParentId: 2
          m_AxesId: -1
        - m_ParentId: 13
          m_AxesId: -1
        - m_ParentId: 14
          m_AxesId: -1
        - m_ParentId: 15
          m_AxesId: -1
        - m_ParentId: 16
          m_AxesId: -1
        - m_ParentId: 2
          m_AxesId: -1
        - m_ParentId: 2
          m_AxesId: -1
        m_ID: 00000000a7ffd73de51b53374cc7b0410f1e94099c5c07fa28f5fd6badde142aae63cfc62a10e69fc804191a9041ef0621599acdc333da31c882d1d470524df25e197f18f7015eee0df6ab589bc6ac2f
        m_AxesArray: []
    m_AvatarSkeletonPose:
      data:
        m_X:
        - t: {x: 0, y: 0, z: 0}
          q: {x: 0, y: 0, z: 0, w: 1}
          s: {x: 1, y: 1, z: 1}
        - t: {x: 0, y: 0, z: 0}
          q: {x: -0.7071068, y: 0, z: 0, w: 0.7071068}
          s: {x: 1, y: 1, z: 1}
        - t: {x: 0.006942946, y: 0.007977271, z: 5.960464E-10}
          q: {x: -4.668265E-06, y: 4.657374E-06, z: -0.704738, w: 0.7094677}
          s: {x: 1, y: 1, z: 1}
        - t: {x: -0.004355553, y: 0, z: 6.536538E-11}
          q: {x: 6.272705E-06, y: -2.467237E-06, z: 0.3757287, w: 0.9267297}
          s: {x: 1, y: 1, z: 1}
        - t: {x: -0.002626199, y: 0, z: 1.98952E-14}
          q: {x: 5.054044E-09, y: -4.620681E-08, z: 0.1087303, w: 0.9940713}
          s: {x: 1, y: 1, z: 1}
        - t: {x: -0.004654524, y: 1.192093E-09, z: -1.705303E-15}
          q: {x: -2.62186E-15, y: 9.64189E-15, z: 0.2623958, w: 0.9649603}
          s: {x: 1, y: 1, z: 1}
        - t: {x: -0.004549397, y: -1.192093E-09, z: 4.742958E-11}
          q: {x: -3.246865E-16, y: 7.764776E-15, z: 0.0417788, w: 0.9991269}
          s: {x: 1, y: 1, z: 1}
        - t: {x: -0.00376104, y: -4.172325E-08, z: 4.464226E-11}
          q: {x: -2.155836E-15, y: -1.974292E-14, z: 0.07102917, w: 0.9974743}
          s: {x: 1, y: 1, z: 1}
        - t: {x: -0.0002492702, y: -0.006941434, z: 1.255155E-05}
          q: {x: -0.4968948, y: 0.5030794, z: 0.4997518, w: 0.5002548}
          s: {x: 1, y: 1, z: 1}
        - t: {x: -0.001895864, y: 5.960464E-10, z: -9.094947E-15}
          q: {x: 0.1417729, y: 0.3794692, z: -0.3199788, w: 0.8564562}
          s: {x: 1, y: 1, z: 1}
        - t: {x: -0.01105709, y: 0, z: 5.960464E-10}
          q: {x: -0.1420451, y: -0.3793674, z: 0.3205936, w: 0.8562263}
          s: {x: 1, y: 1, z: 1}
        - t: {x: -0.001895864, y: 5.960464E-10, z: -9.094947E-15}
          q: {x: -0.1365367, y: -0.3654542, z: -0.3222481, w: 0.8625295}
          s: {x: 1, y: 1, z: 1}
        - t: {x: -0.01067886, y: -2.384186E-09, z: 5.960464E-10}
          q: {x: 0.1367991, y: 0.3653561, z: 0.3228672, w: 0.862298}
          s: {x: 1, y: 1, z: 1}
        - t: {x: 3.19016E-05, y: -2.951622E-06, z: 1.818989E-14}
          q: {x: 1.901456E-06, y: -6.499933E-06, z: 0.9611109, w: 0.2761628}
          s: {x: 1, y: 1, z: 1}
        - t: {x: -0.004327703, y: -4.470348E-10, z: -3.200569E-11}
          q: {x: 1.276969E-08, y: -4.036473E-09, z: -0.3014281, w: 0.9534889}
          s: {x: 1, y: 1, z: 1}
        - t: {x: -0.004625686, y: 2.831221E-09, z: 4.52286E-11}
          q: {x: 8.751841E-14, y: 4.401383E-13, z: -0.1638678, w: 0.9864823}
          s: {x: 1, y: 1, z: 1}
        - t: {x: -0.004587306, y: 0, z: 4.244413E-11}
          q: {x: -3.149219E-14, y: 4.552285E-13, z: -0.0871693, w: 0.9961935}
          s: {x: 1, y: 1, z: 1}
        - t: {x: -0.004157013, y: -4.470348E-10, z: 3.559307E-11}
          q: {x: -2.08937E-15, y: 1.624338E-14, z: -0.09061791, w: 0.9958857}
          s: {x: 1, y: 1, z: 1}
        - t: {x: -0.002560449, y: 0.000203324, z: -0.003092385}
          q: {x: 0.5630014, y: -0.5589476, z: -0.4260114, w: -0.4348809}
          s: {x: 1, y: 1, z: 1}
        - t: {x: -0.002560449, y: 0.000203324, z: -0.003092385}
          q: {x: -0.4146896, y: 0.4117039, z: 0.5678753, w: 0.5796983}
          s: {x: 1, y: 1, z: 1}
    m_DefaultPose:
      data:
        m_X:
        - t: {x: 0, y: 0, z: 0}
          q: {x: 0, y: 0, z: 0, w: 1}
          s: {x: 1, y: 1, z: 1}
        - t: {x: 0, y: 0, z: 0}
          q: {x: -0.7071068, y: 0, z: 0, w: 0.7071068}
          s: {x: 1, y: 1, z: 1}
        - t: {x: 0.006942946, y: 0.007977271, z: 5.960464E-10}
          q: {x: -4.668265E-06, y: 4.657374E-06, z: -0.704738, w: 0.7094677}
          s: {x: 1, y: 1, z: 1}
        - t: {x: -0.004355553, y: 0, z: 6.536538E-11}
          q: {x: 6.272705E-06, y: -2.467237E-06, z: 0.3757287, w: 0.9267297}
          s: {x: 1, y: 1, z: 1}
        - t: {x: -0.002626199, y: 0, z: 1.98952E-14}
          q: {x: 5.054044E-09, y: -4.620681E-08, z: 0.1087303, w: 0.9940713}
          s: {x: 1, y: 1, z: 1}
        - t: {x: -0.004654524, y: 1.192093E-09, z: -1.705303E-15}
          q: {x: -2.62186E-15, y: 9.64189E-15, z: 0.2623958, w: 0.9649603}
          s: {x: 1, y: 1, z: 1}
        - t: {x: -0.004549397, y: -1.192093E-09, z: 4.742958E-11}
          q: {x: -3.246865E-16, y: 7.764776E-15, z: 0.0417788, w: 0.9991269}
          s: {x: 1, y: 1, z: 1}
        - t: {x: -0.00376104, y: -4.172325E-08, z: 4.464226E-11}
          q: {x: -2.155836E-15, y: -1.974292E-14, z: 0.07102917, w: 0.9974743}
          s: {x: 1, y: 1, z: 1}
        - t: {x: -0.0002492702, y: -0.006941434, z: 1.255155E-05}
          q: {x: -0.4968948, y: 0.5030794, z: 0.4997518, w: 0.5002548}
          s: {x: 1, y: 1, z: 1}
        - t: {x: -0.001895864, y: 5.960464E-10, z: -9.094947E-15}
          q: {x: 0.1417729, y: 0.3794692, z: -0.3199788, w: 0.8564562}
          s: {x: 1, y: 1, z: 1}
        - t: {x: -0.01105709, y: 0, z: 5.960464E-10}
          q: {x: -0.1420451, y: -0.3793674, z: 0.3205936, w: 0.8562263}
          s: {x: 1, y: 1, z: 1}
        - t: {x: -0.001895864, y: 5.960464E-10, z: -9.094947E-15}
          q: {x: -0.1365367, y: -0.3654542, z: -0.3222481, w: 0.8625295}
          s: {x: 1, y: 1, z: 1}
        - t: {x: -0.01067886, y: -2.384186E-09, z: 5.960464E-10}
          q: {x: 0.1367991, y: 0.3653561, z: 0.3228672, w: 0.862298}
          s: {x: 1, y: 1, z: 1}
        - t: {x: 3.19016E-05, y: -2.951622E-06, z: 1.818989E-14}
          q: {x: 1.901456E-06, y: -6.499933E-06, z: 0.9611109, w: 0.2761628}
          s: {x: 1, y: 1, z: 1}
        - t: {x: -0.004327703, y: -4.470348E-10, z: -3.200569E-11}
          q: {x: 1.276969E-08, y: -4.036473E-09, z: -0.3014281, w: 0.9534889}
          s: {x: 1, y: 1, z: 1}
        - t: {x: -0.004625686, y: 2.831221E-09, z: 4.52286E-11}
          q: {x: 8.751841E-14, y: 4.401383E-13, z: -0.1638678, w: 0.9864823}
          s: {x: 1, y: 1, z: 1}
        - t: {x: -0.004587306, y: 0, z: 4.244413E-11}
          q: {x: -3.149219E-14, y: 4.552285E-13, z: -0.0871693, w: 0.9961935}
          s: {x: 1, y: 1, z: 1}
        - t: {x: -0.004157013, y: -4.470348E-10, z: 3.559307E-11}
          q: {x: -2.08937E-15, y: 1.624338E-14, z: -0.09061791, w: 0.9958857}
          s: {x: 1, y: 1, z: 1}
        - t: {x: -0.002560449, y: 0.000203324, z: -0.003092385}
          q: {x: 0.5630014, y: -0.5589476, z: -0.4260114, w: -0.4348809}
          s: {x: 1, y: 1, z: 1}
        - t: {x: -0.002560449, y: 0.000203324, z: -0.003092385}
          q: {x: -0.4146896, y: 0.4117039, z: 0.5678753, w: 0.5796983}
          s: {x: 1, y: 1, z: 1}
    m_SkeletonNameIDArray: 00000000a7ffd73de51b53375f4a5aaec97a5dd96aef3947fcdf3e30468e37a9bdee2529d2f7401b2bde225e68a6498207bf2cb0d0be30de41a38f4ed7938839321a4f59a42a482e1e7b41b7884b46c0
    m_Human:
      data:
        serializedVersion: 2
        m_RootX:
          t: {x: 0, y: 0, z: 0}
          q: {x: 0, y: 0, z: 0, w: 1}
          s: {x: 1, y: 1, z: 1}
        m_Skeleton:
          data:
            m_Node:
            m_ID: 
            m_AxesArray:
        m_SkeletonPose:
          data:
            m_X:
        m_LeftHand:
          data:
            m_HandBoneIndex: ffffffffffffffffffffffffffffffffffffffffffffffffffffffffffffffffffffffffffffffffffffffffffffffffffffffffffffffffffffffff
        m_RightHand:
          data:
            m_HandBoneIndex: ffffffffffffffffffffffffffffffffffffffffffffffffffffffffffffffffffffffffffffffffffffffffffffffffffffffffffffffffffffffff
        m_Handles:
        m_ColliderArray: []
        m_HumanBoneIndex: ffffffffffffffffffffffffffffffffffffffffffffffffffffffffffffffffffffffffffffffffffffffffffffffffffffffffffffffffffffffffffffffffffffffffffffffffffffffffffffffffffffffffffffffffffffffffffffffffffffffff
        m_HumanBoneMass:
        - 0.1454546
        - 0.1212121
        - 0.1212121
        - 0.04848485
        - 0.04848485
        - 0.009696971
        - 0.009696971
        - 0.03030303
        - 0.1454546
        - 0.1454546
        - 0.01212121
        - 0.04848485
        - 0.006060607
        - 0.006060607
        - 0.02424243
        - 0.02424243
        - 0.01818182
        - 0.01818182
        - 0.006060607
        - 0.006060607
        - 0.002424243
        - 0.002424243
        - 0
        - 0
        - 0
        m_ColliderIndex: 
        m_Scale: 1
        m_ArmTwist: 0.5
        m_ForeArmTwist: 0.5
        m_UpperLegTwist: 0.5
        m_LegTwist: 0.5
        m_ArmStretch: 0.05
        m_LegStretch: 0.05
        m_FeetSpacing: 0
        m_HasLeftHand: 0
        m_HasRightHand: 0
        m_HasTDoF: 0
    m_HumanSkeletonIndexArray: 
    m_HumanSkeletonReverseIndexArray: 
    m_RootMotionBoneIndex: -1
    m_RootMotionBoneX:
      t: {x: 0, y: 0, z: 0}
      q: {x: 0, y: 0, z: 0, w: 1}
      s: {x: 1, y: 1, z: 1}
    m_RootMotionSkeleton:
      data:
        m_Node:
        m_ID: 
        m_AxesArray: []
    m_RootMotionSkeletonPose:
      data:
        m_X:
    m_RootMotionSkeletonIndexArray: 
  m_TOS:
    160701967: Bone001/Bone002/Bone003
    928193509: Bone001
    4194786460: Bone001/Bone002/Bone003/Bone004
    3335480238: Bone001/Bone015
    3570500296: Bone001/Bone007/Bone008
    1037565863: C
    410982750: Bone001/Bone007/Bone008/Bone009/Bone010
    706010797: Bone001/Bone002/Bone003/Bone004/Bone005/Bone006
    836383683: Bone001/Bone007
    1102104396: Bone001/Bone002
    2682654762: Bone001/Bone015/connectBone001
    799852187: Bone001/Bone013
    116343184: Bone001/Bone015/connectBone002
    0: 
    4065153648: Bone001/Bone007/Bone008/Bone009
    1487664653: Bone001/Bone012
    1811805480: Bone001/Bone002/Bone003/Bone004/Bone005
    437847240: Bone001/Bone015/connectBone001/Bone014
    3999138295: Bone001/Bone007/Bone008/Bone009/Bone010/Bone011
    3449444641: Bone001/Bone015/connectBone002/Bone016
