%YAML 1.1
%TAG !u! tag:unity3d.com,2011:
--- !u!90 &9000000
Avatar:
  m_ObjectHideFlags: 0
  m_PrefabParentObject: {fileID: 0}
  m_PrefabInternal: {fileID: 0}
  m_Name: "agoi_redAvatar"
  m_AvatarSize: 6528
  m_Avatar:
    serializedVersion: 3
    m_AvatarSkeleton:
      data:
        m_Node:
        - m_ParentId: -1
          m_AxesId: -1
        - m_ParentId: 0
          m_AxesId: -1
        - m_ParentId: 0
          m_AxesId: -1
        - m_ParentId: 2
          m_AxesId: -1
        - m_ParentId: 3
          m_AxesId: -1
        - m_ParentId: 4
          m_AxesId: -1
        - m_ParentId: 4
          m_AxesId: -1
        - m_ParentId: 4
          m_AxesId: -1
        - m_ParentId: 3
          m_AxesId: -1
        - m_ParentId: 8
          m_AxesId: -1
        - m_ParentId: 9
          m_AxesId: -1
        - m_ParentId: 10
          m_AxesId: -1
        - m_ParentId: 11
          m_AxesId: -1
        - m_ParentId: 3
          m_AxesId: -1
        - m_ParentId: 13
          m_AxesId: -1
        - m_ParentId: 14
          m_AxesId: -1
        - m_ParentId: 15
          m_AxesId: -1
        - m_ParentId: 16
          m_AxesId: -1
        - m_ParentId: 2
          m_AxesId: -1
        - m_ParentId: 18
          m_AxesId: -1
        - m_ParentId: 19
          m_AxesId: -1
        - m_ParentId: 2
          m_AxesId: -1
        - m_ParentId: 21
          m_AxesId: -1
        - m_ParentId: 22
          m_AxesId: -1
        m_ID: 000000002afd766666128758e142b617557e9451861b263d102b214aceb73c83049d1f957c08cfed310a9b9a8545bb101dff55eb5f2c78ac518ee4c709bc8a84572523ddc4be06c39e2a82283cb929260bc1319e0dcd631f8bc4de879fddbb17
        m_AxesArray: []
    m_AvatarSkeletonPose:
      data:
        m_X:
        - t: {x: 0, y: 0, z: 0}
          q: {x: 0, y: 0, z: 0, w: 1}
          s: {x: 1, y: 1, z: 1}
        - t: {x: 0, y: 0, z: 0}
          q: {x: 5.760116E-08, y: -0.7071068, z: 5.760116E-08, w: 0.7071068}
          s: {x: 0.35, y: 0.35, z: 0.35}
        - t: {x: 1.95261E-05, y: 0.008182259, z: 3.28291E-10}
          q: {x: -2.644714E-06, y: 2.644713E-06, z: -0.7071066, w: 0.7071069}
          s: {x: 1, y: 1, z: 1}
        - t: {x: -0.00298976, y: -1.614618E-10, z: -6.220602E-10}
          q: {x: 3.792882E-06, y: -2.801963E-13, z: 7.59655E-08, w: 1}
          s: {x: 1, y: 1, z: 1}
        - t: {x: -0.00363371, y: 5.927528E-10, z: -8.989361E-10}
          q: {x: 1, y: -5.8355E-09, z: 5.589453E-13, w: 1.712642E-06}
          s: {x: 1, y: 1, z: 1}
        - t: {x: -0.004195451, y: 0.001909527, z: -0.001598325}
          q: {x: -0.2711059, y: 0.2085153, z: 0.7919555, w: 0.5057958}
          s: {x: -0.9999997, y: -0.9999996, z: -1}
        - t: {x: -0.004195449, y: -0.001865593, z: -0.001598337}
          q: {x: 0.7919546, y: 0.5057952, z: 0.2711075, w: -0.208518}
          s: {x: 0.9999997, y: 0.9999996, z: 1}
        - t: {x: 0.0001631612, y: -0.0002420235, z: -0.0004375257}
          q: {x: 0.7071069, y: -0.7071066, z: -1.173762E-06, w: -1.173762E-06}
          s: {x: 1, y: 1, z: 1}
        - t: {x: -0.003633707, y: -4.161884E-10, z: 5.71295E-10}
          q: {x: -0.02529624, y: -0.02058896, z: -0.7751656, w: 0.6309156}
          s: {x: 1, y: 1, z: 1}
        - t: {x: -0.0042269, y: 2.077113E-09, z: -4.027817E-09}
          q: {x: -0.04025185, y: 0.02766412, z: 0.09585696, w: 0.9941961}
          s: {x: 0.9999998, y: 0.9999996, z: 1}
        - t: {x: -0.002912288, y: 1.576222E-09, z: -2.411333E-11}
          q: {x: 0.01646378, y: 0.03327755, z: 0.02731413, w: 0.9989372}
          s: {x: 1, y: 1, z: 1}
        - t: {x: -0.00268623, y: 1.826692E-09, z: 1.445947E-09}
          q: {x: -4.590737E-08, y: 3.492984E-08, z: -0.03393831, w: 0.9994239}
          s: {x: 1, y: 0.9999994, z: 1}
        - t: {x: -0.001045596, y: -4.951457E-09, z: -2.491753E-10}
          q: {x: 5.007053E-07, y: 2.705854E-08, z: -0.1601096, w: 0.9870993}
          s: {x: 0.9999995, y: 1, z: 1}
        - t: {x: -0.003633707, y: -3.346977E-10, z: 5.712947E-10}
          q: {x: 0.02421027, y: -0.01987161, z: 0.7725884, w: 0.6341343}
          s: {x: 1, y: 1, z: 1}
        - t: {x: -0.004401451, y: -1.707927E-09, z: -2.647704E-09}
          q: {x: 0.09170459, y: 0.9946066, z: 0.04052404, w: -0.0265671}
          s: {x: -1.000001, y: -1, z: -1}
        - t: {x: -0.002912285, y: 1.204551E-09, z: 4.281401E-10}
          q: {x: 0.01646433, y: 0.03327795, z: 0.02731382, w: 0.9989371}
          s: {x: 0.9999993, y: 0.9999996, z: 1}
        - t: {x: -0.002686231, y: -7.9724E-10, z: 6.431453E-10}
          q: {x: -1.721541E-08, y: -1.41639E-08, z: -0.03393782, w: 0.9994239}
          s: {x: 1, y: 1, z: 1}
        - t: {x: -0.001045594, y: 4.891594E-09, z: -4.574983E-10}
          q: {x: -2.358042E-07, y: -4.383337E-08, z: -0.1601094, w: 0.9870993}
          s: {x: 1, y: 0.9999994, z: 1}
        - t: {x: 0.0005005905, y: 0.001540914, z: 1.024391E-08}
          q: {x: 2.10795E-12, y: -4.72466E-06, z: 1, w: 7.64963E-07}
          s: {x: 1, y: 1, z: 1}
        - t: {x: -0.00382919, y: -4.656334E-09, z: 6.90203E-10}
          q: {x: 9.536751E-07, y: -5.774066E-12, z: 5.1145E-08, w: 1}
          s: {x: 1, y: 1, z: 1}
        - t: {x: -0.00256075, y: 7.148042E-09, z: 3.57109E-10}
          q: {x: -8.419334E-21, y: -5.822933E-12, z: 1.485E-09, w: 1}
          s: {x: 1, y: 1, z: 1}
        - t: {x: 0.0005005895, y: -0.001552536, z: -1.180979E-08}
          q: {x: 1.631843E-12, y: -4.76837E-06, z: 1, w: 6.01737E-07}
          s: {x: 1, y: 1, z: 1}
        - t: {x: -0.00382919, y: -3.406294E-09, z: 3.520362E-09}
          q: {x: 9.53674E-07, y: -4.537665E-12, z: 3.31165E-08, w: 1}
          s: {x: 1, y: 1, z: 1}
        - t: {x: -0.00255398, y: -2.102756E-09, z: 1.946176E-09}
          q: {x: 3.675705E-08, y: -4.571075E-12, z: 1.62855E-08, w: 1}
          s: {x: 1, y: 1, z: 1}
    m_DefaultPose:
      data:
        m_X:
        - t: {x: 0, y: 0, z: 0}
          q: {x: 0, y: 0, z: 0, w: 1}
          s: {x: 1, y: 1, z: 1}
        - t: {x: 0, y: 0, z: 0}
          q: {x: 5.760116E-08, y: -0.7071068, z: 5.760116E-08, w: 0.7071068}
          s: {x: 0.35, y: 0.35, z: 0.35}
        - t: {x: 1.95261E-05, y: 0.008182259, z: 3.28291E-10}
          q: {x: -2.644714E-06, y: 2.644713E-06, z: -0.7071066, w: 0.7071069}
          s: {x: 1, y: 1, z: 1}
        - t: {x: -0.00298976, y: -1.614618E-10, z: -6.220602E-10}
          q: {x: 3.792882E-06, y: -2.801963E-13, z: 7.59655E-08, w: 1}
          s: {x: 1, y: 1, z: 1}
        - t: {x: -0.00363371, y: 5.927528E-10, z: -8.989361E-10}
          q: {x: 1, y: -5.8355E-09, z: 5.589453E-13, w: 1.712642E-06}
          s: {x: 1, y: 1, z: 1}
        - t: {x: -0.004195451, y: 0.001909527, z: -0.001598325}
          q: {x: -0.2711059, y: 0.2085153, z: 0.7919555, w: 0.5057958}
          s: {x: -0.9999997, y: -0.9999996, z: -1}
        - t: {x: -0.004195449, y: -0.001865593, z: -0.001598337}
          q: {x: 0.7919546, y: 0.5057952, z: 0.2711075, w: -0.208518}
          s: {x: 0.9999997, y: 0.9999996, z: 1}
        - t: {x: 0.0001631612, y: -0.0002420235, z: -0.0004375257}
          q: {x: 0.7071069, y: -0.7071066, z: -1.173762E-06, w: -1.173762E-06}
          s: {x: 1, y: 1, z: 1}
        - t: {x: -0.003633707, y: -4.161884E-10, z: 5.71295E-10}
          q: {x: -0.02529624, y: -0.02058896, z: -0.7751656, w: 0.6309156}
          s: {x: 1, y: 1, z: 1}
        - t: {x: -0.0042269, y: 2.077113E-09, z: -4.027817E-09}
          q: {x: -0.04853093, y: -0.005501322, z: -0.5794363, w: 0.8135527}
          s: {x: 0.9999998, y: 0.9999996, z: 1}
        - t: {x: -0.002912288, y: 1.576222E-09, z: -2.411333E-11}
          q: {x: 0.01599962, y: 0.08567446, z: 0.05859777, w: 0.9944698}
          s: {x: 1, y: 1, z: 1}
        - t: {x: -0.00268623, y: 1.826692E-09, z: 1.445947E-09}
          q: {x: -4.590737E-08, y: 3.492984E-08, z: -0.03393831, w: 0.9994239}
          s: {x: 1, y: 0.9999994, z: 1}
        - t: {x: -0.001045596, y: -4.951457E-09, z: -2.491753E-10}
          q: {x: 5.007053E-07, y: 2.705854E-08, z: -0.1601096, w: 0.9870993}
          s: {x: 0.9999995, y: 1, z: 1}
        - t: {x: -0.003633707, y: -3.346977E-10, z: 5.712947E-10}
          q: {x: 0.02421027, y: -0.01987161, z: 0.7725884, w: 0.6341343}
          s: {x: 1, y: 1, z: 1}
        - t: {x: -0.004401451, y: -1.707927E-09, z: -2.647704E-09}
          q: {x: -0.5828412, y: 0.8111401, z: 0.0480174, w: 0.006507648}
          s: {x: -1.000001, y: -1, z: -1}
        - t: {x: -0.002912285, y: 1.204551E-09, z: 4.281401E-10}
          q: {x: 0.01600016, y: 0.08567458, z: 0.0585974, w: 0.9944698}
          s: {x: 0.9999993, y: 0.9999996, z: 1}
        - t: {x: -0.002686231, y: -7.9724E-10, z: 6.431453E-10}
          q: {x: -1.721541E-08, y: -1.41639E-08, z: -0.03393782, w: 0.9994239}
          s: {x: 1, y: 1, z: 1}
        - t: {x: -0.001045594, y: 4.891594E-09, z: -4.574983E-10}
          q: {x: -2.358042E-07, y: -4.383337E-08, z: -0.1601094, w: 0.9870993}
          s: {x: 1, y: 0.9999994, z: 1}
        - t: {x: 0.0005005905, y: 0.001540914, z: 1.024391E-08}
          q: {x: 2.10795E-12, y: -4.72466E-06, z: 1, w: 7.64963E-07}
          s: {x: 1, y: 1, z: 1}
        - t: {x: -0.00382919, y: -4.656334E-09, z: 6.90203E-10}
          q: {x: 9.536751E-07, y: -5.774066E-12, z: 5.1145E-08, w: 1}
          s: {x: 1, y: 1, z: 1}
        - t: {x: -0.00256075, y: 7.148042E-09, z: 3.57109E-10}
          q: {x: -8.419334E-21, y: -5.822933E-12, z: 1.485E-09, w: 1}
          s: {x: 1, y: 1, z: 1}
        - t: {x: 0.0005005895, y: -0.001552536, z: -1.180979E-08}
          q: {x: 1.631843E-12, y: -4.76837E-06, z: 1, w: 6.01737E-07}
          s: {x: 1, y: 1, z: 1}
        - t: {x: -0.00382919, y: -3.406294E-09, z: 3.520362E-09}
          q: {x: 9.53674E-07, y: -4.537665E-12, z: 3.31165E-08, w: 1}
          s: {x: 1, y: 1, z: 1}
        - t: {x: -0.00255398, y: -2.102756E-09, z: 1.946176E-09}
          q: {x: 3.675705E-08, y: -4.571075E-12, z: 1.62855E-08, w: 1}
          s: {x: 1, y: 1, z: 1}
    m_SkeletonNameIDArray: 000000002afd7666661287588ccc354d30763e3d918f2bc707bf2cb06231c9f109834d9e8e84660d50d0f1bdc8faf77fa42a482e52322aa7d5350134b349f3d923992b46bdee2529d0cbd1f2677ece74d4811a91432c30c58c1d124d3fe2c6a8
    m_Human:
      data:
        serializedVersion: 2
        m_RootX:
          t: {x: 6.921652E-06, y: 0.009759106, z: -0.0001070405}
          q: {x: -0.02196836, y: 0.0001461469, z: 0.006647152, w: 0.9997366}
          s: {x: 1, y: 1, z: 1}
        m_Skeleton:
          data:
            m_Node:
            - m_ParentId: -1
              m_AxesId: -1
            - m_ParentId: 0
              m_AxesId: 0
            - m_ParentId: 1
              m_AxesId: 1
            - m_ParentId: 2
              m_AxesId: 2
            - m_ParentId: 3
              m_AxesId: 3
            - m_ParentId: 3
              m_AxesId: 4
            - m_ParentId: 2
              m_AxesId: -1
            - m_ParentId: 6
              m_AxesId: 5
            - m_ParentId: 7
              m_AxesId: 6
            - m_ParentId: 8
              m_AxesId: 7
            - m_ParentId: 2
              m_AxesId: -1
            - m_ParentId: 10
              m_AxesId: 8
            - m_ParentId: 11
              m_AxesId: 9
            - m_ParentId: 12
              m_AxesId: 10
            - m_ParentId: 1
              m_AxesId: 11
            - m_ParentId: 14
              m_AxesId: 12
            - m_ParentId: 15
              m_AxesId: 13
            - m_ParentId: 1
              m_AxesId: 14
            - m_ParentId: 17
              m_AxesId: 15
            - m_ParentId: 18
              m_AxesId: 16
            m_ID: 0000000066128758e142b617557e9451861b263d102b214a049d1f957c08cfed310a9b9a8545bb105f2c78ac518ee4c709bc8a84572523dd9e2a82283cb929260bc1319e0dcd631f8bc4de879fddbb17
            m_AxesArray:
            - m_PreQ: {x: -0.4999999, y: -0.5000001, z: 0.5000002, w: 0.4999998}
              m_PostQ: {x: -4.855019E-08, y: -0.7071094, z: 0.7071041, w: -1.302639E-07}
              m_Sgn: {x: 1, y: 1, z: 1}
              m_Limit:
                m_Min: {x: -0.6981317, y: -0.6981317, z: -0.6981317}
                m_Max: {x: 0.6981317, y: 0.6981317, z: 0.6981317}
              m_Length: 0.00298976
              m_Type: 1
            - m_PreQ: {x: -7.83524E-08, y: -0.7071095, z: 0.7071042, w: -1.004615E-07}
              m_PostQ: {x: -1.378387E-07, y: -0.7071068, z: 0.7071068, w: -4.097524E-08}
              m_Sgn: {x: 1, y: 1, z: 1}
              m_Limit:
                m_Min: {x: -0.6981317, y: -0.6981317, z: -0.6981317}
                m_Max: {x: 0.6981317, y: 0.6981317, z: 0.6981317}
              m_Length: 0.00363371
              m_Type: 1
            - m_PreQ: {x: -1.67641E-07, y: -0.7071067, z: 0.7071068, w: 1.67641E-07}
              m_PostQ: {x: -1.788139E-07, y: 0.7071056, z: 0.707108, w: -1.788139E-07}
              m_Sgn: {x: 1, y: 1, z: 1}
              m_Limit:
                m_Min: {x: -0.6981317, y: -0.6981317, z: -0.6981317}
                m_Max: {x: 0.6981317, y: 0.6981317, z: 0.6981317}
              m_Length: 0.0002271069
              m_Type: 1
            - m_PreQ: {x: 0.5000007, y: 0.500001, z: -0.4999991, w: 0.4999993}
              m_PostQ: {x: 0.888687, y: -0.1117847, z: -0.4090637, w: -0.1743747}
              m_Sgn: {x: 1, y: 1, z: -1}
              m_Limit:
                m_Min: {x: 0, y: -0.3490658, z: -0.1745329}
                m_Max: {x: 0, y: 0.3490658, z: 0.2617994}
              m_Length: 0.1
              m_Type: 1
            - m_PreQ: {x: 0.5000007, y: 0.500001, z: -0.4999991, w: 0.4999993}
              m_PostQ: {x: -0.1117847, y: -0.888687, z: -0.1743749, w: 0.4090637}
              m_Sgn: {x: 1, y: -1, z: -1}
              m_Limit:
                m_Min: {x: 0, y: -0.3490658, z: -0.1745329}
                m_Max: {x: 0, y: 0.3490658, z: 0.2617994}
              m_Length: 0.1
              m_Type: 1
            - m_PreQ: {x: 0.272615, y: 0.03484162, z: 0.9302882, w: 0.2429632}
              m_PostQ: {x: -1.818989E-08, y: -0.04361437, z: 0.9990485, w: 2.408469E-07}
              m_Sgn: {x: -1, y: 1, z: 1}
              m_Limit:
                m_Min: {x: -1.570796, y: -1.745329, z: -1.047198}
                m_Max: {x: 1.570796, y: 1.745329, z: 1.745329}
              m_Length: 0.002912287
              m_Type: 1
            - m_PreQ: {x: -0.5059073, y: 0.5521421, z: -0.4969179, w: -0.4384858}
              m_PostQ: {x: 7.823109E-08, y: 0.7262878, z: -0.6873907, w: -4.502944E-07}
              m_Sgn: {x: -1, y: 1, z: 1}
              m_Limit:
                m_Min: {x: -1.570796, y: 0, z: -1.396263}
                m_Max: {x: 1.570796, y: 0, z: 1.396263}
              m_Length: 0.002686231
              m_Type: 1
            - m_PreQ: {x: 2.644956E-07, y: -0.02630157, z: 0.9996541, w: 3.735185E-07}
              m_PostQ: {x: 0.0008928627, y: -0.02628646, z: 0.9990783, w: -0.0339262}
              m_Sgn: {x: 1, y: 1, z: 1}
              m_Limit:
                m_Min: {x: 0, y: -0.6981317, z: -1.396263}
                m_Max: {x: 0, y: 0.6981317, z: 1.396263}
              m_Length: 0.0006715577
              m_Type: 1
            - m_PreQ: {x: 0.2714871, y: -0.03364946, z: 0.9296235, w: -0.2469069}
              m_PostQ: {x: -0.9990485, y: 1.974404E-07, z: 6.394809E-08, w: 0.0436146}
              m_Sgn: {x: 1, y: 1, z: -1}
              m_Limit:
                m_Min: {x: -1.570796, y: -1.745329, z: -1.047198}
                m_Max: {x: 1.570796, y: 1.745329, z: 1.745329}
              m_Length: 0.002912287
              m_Type: 1
            - m_PreQ: {x: -0.4969173, y: 0.4384857, z: 0.5059077, w: 0.5521424}
              m_PostQ: {x: -0.687391, y: -5.308539E-08, z: 2.235174E-07, w: 0.7262875}
              m_Sgn: {x: 1, y: 1, z: -1}
              m_Limit:
                m_Min: {x: -1.570796, y: 0, z: -1.396263}
                m_Max: {x: 1.570796, y: 0, z: 1.396263}
              m_Length: 0.00268623
              m_Type: 1
            - m_PreQ: {x: -0.9996541, y: -1.974404E-07, z: 1.2485E-07, w: 0.02630121}
              m_PostQ: {x: -0.9990783, y: -0.03392628, z: 0.0008927487, w: 0.02628607}
              m_Sgn: {x: 1, y: 1, z: -1}
              m_Limit:
                m_Min: {x: 0, y: -0.6981317, z: -1.396263}
                m_Max: {x: 0, y: 0.6981317, z: 1.396263}
              m_Length: 0.0006715574
              m_Type: 1
            - m_PreQ: {x: 0.6830016, y: 0.1830444, z: 0.183046, w: -0.6830065}
              m_PostQ: {x: 4.864022E-07, y: -0.7071075, z: 0.7071061, w: -3.671933E-07}
              m_Sgn: {x: -1, y: -1, z: 1}
              m_Limit:
                m_Min: {x: -1.047198, y: -1.047198, z: -1.570796}
                m_Max: {x: 1.047198, y: 1.047198, z: 0.8726646}
              m_Length: 0.00382919
              m_Type: 1
            - m_PreQ: {x: -0.454489, y: -0.5417036, z: 0.5417002, w: -0.4544867}
              m_PostQ: {x: -9.645599E-07, y: -0.7071068, z: 0.7071068, w: 1.053971E-06}
              m_Sgn: {x: -1, y: 1, z: -1}
              m_Limit:
                m_Min: {x: -1.570796, y: 0, z: -1.396263}
                m_Max: {x: 1.570796, y: 0, z: 1.396263}
              m_Length: 0.00256075
              m_Type: 1
            - m_PreQ: {x: -3.467423E-07, y: 0.7071068, z: -0.7071068, w: 3.467383E-07}
              m_PostQ: {x: -3.467443E-07, y: 0.7071068, z: -0.7071068, w: 3.467362E-07}
              m_Sgn: {x: 1, y: -1, z: 1}
              m_Limit:
                m_Min: {x: 0, y: -0.5235988, z: -0.8726646}
                m_Max: {x: 0, y: 0.5235988, z: 0.8726646}
              m_Length: 0.00129173
              m_Type: 1
            - m_PreQ: {x: 0.6830015, y: 0.1830447, z: 0.1830462, w: -0.6830065}
              m_PostQ: {x: 6.497624E-07, y: -0.7071075, z: 0.7071061, w: 6.5493E-08}
              m_Sgn: {x: 1, y: 1, z: 1}
              m_Limit:
                m_Min: {x: -1.047198, y: -1.047198, z: -1.570796}
                m_Max: {x: 1.047198, y: 1.047198, z: 0.8726646}
              m_Length: 0.00382919
              m_Type: 1
            - m_PreQ: {x: -0.4544879, y: -0.5417028, z: 0.5417013, w: -0.4544874}
              m_PostQ: {x: 5.101015E-07, y: -0.7071068, z: 0.7071068, w: -3.458872E-09}
              m_Sgn: {x: 1, y: 1, z: -1}
              m_Limit:
                m_Min: {x: -1.570796, y: 0, z: -1.396263}
                m_Max: {x: 1.570796, y: 0, z: 1.396263}
              m_Length: 0.00255398
              m_Type: 1
            - m_PreQ: {x: -3.014852E-07, y: 0.7071068, z: -0.7071067, w: 3.014821E-07}
              m_PostQ: {x: -2.846801E-07, y: 0.7071068, z: -0.7071068, w: 2.846737E-07}
              m_Sgn: {x: 1, y: 1, z: 1}
              m_Limit:
                m_Min: {x: 0, y: -0.5235988, z: -0.8726646}
                m_Max: {x: 0, y: 0.5235988, z: 0.8726646}
              m_Length: 0.0012985
              m_Type: 1
        m_SkeletonPose:
          data:
            m_X:
            - t: {x: 0, y: 0, z: 0}
              q: {x: 0, y: 0, z: 0, w: 1}
              s: {x: 1, y: 1, z: 1}
            - t: {x: 1.95261E-05, y: 0.008182259, z: 3.28291E-10}
              q: {x: -2.644714E-06, y: 2.644713E-06, z: -0.7071066, w: 0.7071069}
              s: {x: 1, y: 1, z: 1}
            - t: {x: -0.002989759, y: -2.328306E-10, z: -6.220614E-10}
              q: {x: 3.792882E-06, y: -4.547474E-13, z: 5.960455E-08, w: 0.9999999}
              s: {x: 1, y: 1, z: 1}
            - t: {x: -0.003633709, y: 6.984919E-10, z: -8.989361E-10}
              q: {x: 1, y: 4.3733E-14, z: 5.062617E-13, w: 1.712642E-06}
              s: {x: 1, y: 1, z: 1}
            - t: {x: -0.00419545, y: 0.001909527, z: -0.001598325}
              q: {x: -0.2711058, y: 0.2085153, z: 0.7919555, w: 0.5057958}
              s: {x: -0.9999997, y: -0.9999996, z: -1}
            - t: {x: -0.004195448, y: -0.001865592, z: -0.001598337}
              q: {x: 0.7919545, y: 0.5057952, z: 0.2711075, w: -0.2085179}
              s: {x: 0.9999997, y: 0.9999996, z: 1}
            - t: {x: -0.003633707, y: -4.656613E-10, z: 5.71295E-10}
              q: {x: -0.02529624, y: -0.02058896, z: -0.7751656, w: 0.6309156}
              s: {x: 1, y: 1, z: 1}
            - t: {x: -0.004226901, y: 2.328306E-09, z: -3.969944E-09}
              q: {x: -0.04025185, y: 0.02766412, z: 0.09585697, w: 0.9941962}
              s: {x: 0.9999998, y: 0.9999996, z: 1}
            - t: {x: -0.002912288, y: 1.40426E-09, z: -4.456522E-11}
              q: {x: 0.01646378, y: 0.03327755, z: 0.02731413, w: 0.9989372}
              s: {x: 1, y: 1, z: 1}
            - t: {x: -0.00268623, y: 1.949957E-09, z: 1.477928E-09}
              q: {x: -4.668254E-08, y: 3.466266E-08, z: -0.03393831, w: 0.999424}
              s: {x: 1, y: 0.9999994, z: 1}
            - t: {x: -0.003633707, y: -2.328306E-10, z: 5.712947E-10}
              q: {x: 0.02421027, y: -0.01987161, z: 0.7725884, w: 0.6341342}
              s: {x: 1, y: 1, z: 1}
            - t: {x: -0.004401451, y: -1.766239E-09, z: -2.663E-09}
              q: {x: 0.09170458, y: 0.9946066, z: 0.04052404, w: -0.02656709}
              s: {x: -1.000001, y: -1, z: -1}
            - t: {x: -0.002912285, y: 1.12972E-09, z: 4.222328E-10}
              q: {x: 0.01646433, y: 0.03327795, z: 0.02731382, w: 0.998937}
              s: {x: 0.9999993, y: 0.9999997, z: 1}
            - t: {x: -0.002686229, y: -1.09776E-09, z: 6.402841E-10}
              q: {x: -1.728768E-08, y: -1.862645E-08, z: -0.03393781, w: 0.9994238}
              s: {x: 1, y: 1, z: 1}
            - t: {x: 0.0005005901, y: 0.001540913, z: 1.02439E-08}
              q: {x: 2.046363E-12, y: -4.72466E-06, z: 0.9999999, w: 7.450562E-07}
              s: {x: 1, y: 1, z: 1}
            - t: {x: -0.00382919, y: -4.656613E-09, z: 6.902034E-10}
              q: {x: 9.536751E-07, y: -5.854872E-12, z: 5.960463E-08, w: 1}
              s: {x: 1, y: 1, z: 1}
            - t: {x: -0.002560749, y: 6.984919E-09, z: 3.57109E-10}
              q: {x: 0, y: -5.822898E-12, z: -4.742505E-16, w: 0.9999999}
              s: {x: 1, y: 1, z: 1}
            - t: {x: 0.0005005894, y: -0.001552536, z: -1.180978E-08}
              q: {x: 1.477929E-12, y: -4.76837E-06, z: 1, w: 5.960445E-07}
              s: {x: 1, y: 1, z: 1}
            - t: {x: -0.00382919, y: -3.49246E-09, z: 3.520362E-09}
              q: {x: 9.53674E-07, y: -4.49063E-12, z: -3.830515E-14, w: 1}
              s: {x: 1, y: 1, z: 1}
            - t: {x: -0.00255398, y: -2.095476E-09, z: 1.946176E-09}
              q: {x: 3.675705E-08, y: -4.56879E-12, z: -1.406521E-15, w: 1}
              s: {x: 1, y: 1, z: 1}
        m_LeftHand:
          data:
            m_HandBoneIndex: ffffffffffffffffffffffffffffffffffffffffffffffffffffffffffffffffffffffffffffffffffffffffffffffffffffffffffffffffffffffff
        m_RightHand:
          data:
            m_HandBoneIndex: ffffffffffffffffffffffffffffffffffffffffffffffffffffffffffffffffffffffffffffffffffffffffffffffffffffffffffffffffffffffff
        m_Handles:
        m_ColliderArray: []
        m_HumanBoneIndex: 01000000110000000e000000120000000f000000130000001000000002000000ffffffffffffffffffffffff03000000ffffffffffffffff0b000000070000000c000000080000000d00000009000000ffffffffffffffff0400000005000000ffffffff
        m_HumanBoneMass:
        - 0.1454546
        - 0.1212121
        - 0.1212121
        - 0.04848485
        - 0.04848485
        - 0.01212121
        - 0.01212121
        - 0.3454545
        - 0
        - 0
        - 0
        - 0.04848485
        - 0
        - 0
        - 0.02424243
        - 0.02424243
        - 0.01818182
        - 0.01818182
        - 0.006060607
        - 0.006060607
        - 0
        - 0
        - 0
        - 0
        - 0
        m_ColliderIndex: 
        m_Scale: 0.009759106
        m_ArmTwist: 0.5
        m_ForeArmTwist: 0.5
        m_UpperLegTwist: 0.5
        m_LegTwist: 0.5
        m_ArmStretch: 0.05
        m_LegStretch: 0.05
        m_FeetSpacing: 0
        m_HasLeftHand: 0
        m_HasRightHand: 0
        m_HasTDoF: 0
    m_HumanSkeletonIndexArray: 00000000020000000300000004000000050000000600000008000000090000000a0000000b0000000d0000000e0000000f00000010000000120000001300000014000000150000001600000017000000
    m_HumanSkeletonReverseIndexArray: 00000000ffffffff0100000002000000030000000400000005000000ffffffff06000000070000000800000009000000ffffffff0a0000000b0000000c0000000d000000ffffffff0e0000000f00000010000000110000001200000013000000
    m_RootMotionBoneIndex: -1
    m_RootMotionBoneX:
      t: {x: 0, y: 0, z: 0}
      q: {x: 0, y: 0, z: 0, w: 1}
      s: {x: 1, y: 1, z: 1}
    m_RootMotionSkeleton:
      data:
        m_Node:
        m_ID: 
        m_AxesArray: []
    m_RootMotionSkeletonPose:
      data:
        m_X:
    m_RootMotionSkeletonIndexArray: 
  m_TOS:
    3271999172: Bip001 Pelvis/Bip001 Spine/Bip001 L Clavicle/Bip001 L UpperArm/Bip001 L Forearm/Bip001 L Hand/Bone015
    1719074090: Red_mod
    3710068055: Bip001 Pelvis/Bip001 Spine/Bip001 L Clavicle/Bip001 L UpperArm/Bip001 L Forearm/Bip001 L Hand
    1368686165: Bip001 Pelvis/Bip001 Spine/Bip001 Head
    398187935: Bip001 Pelvis/Bip001 L Thigh/Bip001 L Calf/Bip001 L Foot
    3989768316: Bip001 Pelvis/Bip001 Spine/Bip001 R Clavicle/Bip001 R UpperArm
    526634253: Bip001 Pelvis/Bip001 L Thigh
    397820641: Bip001 Pelvis/Bip001 Spine
    2279523467: Bip001 Pelvis/Bip001 L Thigh/Bip001 L Calf
    2201794510: Bip001 Pelvis/Bip001 Spine/Bip001 Head/head_mouth
    280708485: Bip001 Pelvis/Bip001 Spine/Bip001 R Clavicle/Bip001 R UpperArm/Bip001 R Forearm/Bip001 R Hand
    1025907590: Bip001 Pelvis/Bip001 Spine/Bip001 Head/Bone017
    3948281629: Bip001 Pelvis/Bip001 Spine/Bip001 R Clavicle/Bip001 R UpperArm/Bip001 R Forearm/Bip001 R Hand/Bone011
    1243687696: Bip001 Pelvis/Bip001 Spine/Bip001 Head/Bone016
    0: 
    1485247078: Bip001 Pelvis
    2223684617: Bip001 Pelvis/Bip001 Spine/Bip001 L Clavicle/Bip001 L UpperArm/Bip001 L Forearm
    2593851953: Bip001 Pelvis/Bip001 Spine/Bip001 R Clavicle/Bip001 R UpperArm/Bip001 R Forearm
    679619230: Bip001 Pelvis/Bip001 R Thigh
    640268604: Bip001 Pelvis/Bip001 R Thigh/Bip001 R Calf
    2893556831: Bip001 Pelvis/Bip001 Spine/Bip001 L Clavicle
    3353644625: Bip001 Pelvis/Bip001 Spine/Bip001 L Clavicle/Bip001 L UpperArm
    2654060811: Bip001 Pelvis/Bip001 R Thigh/Bip001 R Calf/Bip001 R Foot
    2501876996: Bip001 Pelvis/Bip001 Spine/Bip001 R Clavicle
