%YAML 1.1
%TAG !u! tag:unity3d.com,2011:
--- !u!1001 &6620981556356640008
PrefabInstance:
  m_ObjectHideFlags: 0
  serializedVersion: 2
  m_Modification:
    serializedVersion: 3
    m_TransformParent: {fileID: 0}
    m_Modifications:
    - target: {fileID: 656312566569797389, guid: 253bc33a05d7dd54faacdb924baab163,
        type: 3}
      propertyPath: m_Materials.Array.data[0]
      value: 
      objectReference: {fileID: 2100000, guid: 164608afbdf957443ae3d6bf75a88cbb, type: 2}
    - target: {fileID: 1073443385401587993, guid: 253bc33a05d7dd54faacdb924baab163,
        type: 3}
      propertyPath: m_Materials.Array.data[0]
      value: 
      objectReference: {fileID: 2100000, guid: 164608afbdf957443ae3d6bf75a88cbb, type: 2}
    - target: {fileID: 2082628950769236660, guid: 253bc33a05d7dd54faacdb924baab163,
        type: 3}
      propertyPath: m_Materials.Array.data[0]
      value: 
      objectReference: {fileID: 2100000, guid: 164608afbdf957443ae3d6bf75a88cbb, type: 2}
    - target: {fileID: 3377716047300780632, guid: 253bc33a05d7dd54faacdb924baab163,
        type: 3}
      propertyPath: m_LocalPosition.x
      value: 4.47
      objectReference: {fileID: 0}
    - target: {fileID: 3377716047300780632, guid: 253bc33a05d7dd54faacdb924baab163,
        type: 3}
      propertyPath: m_LocalPosition.y
      value: 0
      objectReference: {fileID: 0}
    - target: {fileID: 3377716047300780632, guid: 253bc33a05d7dd54faacdb924baab163,
        type: 3}
      propertyPath: m_LocalPosition.z
      value: 12.18
      objectReference: {fileID: 0}
    - target: {fileID: 3377716047300780632, guid: 253bc33a05d7dd54faacdb924baab163,
        type: 3}
      propertyPath: m_LocalRotation.w
      value: 1
      objectReference: {fileID: 0}
    - target: {fileID: 3377716047300780632, guid: 253bc33a05d7dd54faacdb924baab163,
        type: 3}
      propertyPath: m_LocalRotation.x
      value: 0
      objectReference: {fileID: 0}
    - target: {fileID: 3377716047300780632, guid: 253bc33a05d7dd54faacdb924baab163,
        type: 3}
      propertyPath: m_LocalRotation.y
      value: 0
      objectReference: {fileID: 0}
    - target: {fileID: 3377716047300780632, guid: 253bc33a05d7dd54faacdb924baab163,
        type: 3}
      propertyPath: m_LocalRotation.z
      value: 0
      objectReference: {fileID: 0}
    - target: {fileID: 3377716047300780632, guid: 253bc33a05d7dd54faacdb924baab163,
        type: 3}
      propertyPath: m_LocalEulerAnglesHint.x
      value: 0
      objectReference: {fileID: 0}
    - target: {fileID: 3377716047300780632, guid: 253bc33a05d7dd54faacdb924baab163,
        type: 3}
      propertyPath: m_LocalEulerAnglesHint.y
      value: 0
      objectReference: {fileID: 0}
    - target: {fileID: 3377716047300780632, guid: 253bc33a05d7dd54faacdb924baab163,
        type: 3}
      propertyPath: m_LocalEulerAnglesHint.z
      value: 0
      objectReference: {fileID: 0}
    - target: {fileID: 4229316112962562236, guid: 253bc33a05d7dd54faacdb924baab163,
        type: 3}
      propertyPath: m_Materials.Array.data[0]
      value: 
      objectReference: {fileID: 2100000, guid: 164608afbdf957443ae3d6bf75a88cbb, type: 2}
    - target: {fileID: 4443960004037133408, guid: 253bc33a05d7dd54faacdb924baab163,
        type: 3}
      propertyPath: m_Materials.Array.data[0]
      value: 
      objectReference: {fileID: 2100000, guid: 164608afbdf957443ae3d6bf75a88cbb, type: 2}
    - target: {fileID: 5570065293143224891, guid: 253bc33a05d7dd54faacdb924baab163,
        type: 3}
      propertyPath: m_Materials.Array.data[0]
      value: 
      objectReference: {fileID: 2100000, guid: 164608afbdf957443ae3d6bf75a88cbb, type: 2}
    - target: {fileID: 8054653000327847638, guid: 253bc33a05d7dd54faacdb924baab163,
        type: 3}
      propertyPath: m_Name
      value: Vario
      objectReference: {fileID: 0}
    m_RemovedComponents:
    - {fileID: 3555156923876279652, guid: 253bc33a05d7dd54faacdb924baab163, type: 3}
    m_RemovedGameObjects: []
    m_AddedGameObjects: []
    m_AddedComponents: []
  m_SourcePrefab: {fileID: 100100000, guid: 253bc33a05d7dd54faacdb924baab163, type: 3}
