%YAML 1.1
%TAG !u! tag:unity3d.com,2011:
--- !u!1001 &6280566649876839067
PrefabInstance:
  m_ObjectHideFlags: 0
  serializedVersion: 2
  m_Modification:
    serializedVersion: 3
    m_TransformParent: {fileID: 0}
    m_Modifications:
    - target: {fileID: 708832229934296154, guid: b9b482242e046574a9cf8b95ce16f312,
        type: 3}
      propertyPath: m_Name
      value: Vario biru
      objectReference: {fileID: 0}
    - target: {fileID: 3124794236160901303, guid: b9b482242e046574a9cf8b95ce16f312,
        type: 3}
      propertyPath: m_Materials.Array.data[0]
      value: 
      objectReference: {fileID: 2100000, guid: dd33dd14f3e2cf24ab1ff6af3f8e3854, type: 2}
    - target: {fileID: 5256168931348467924, guid: b9b482242e046574a9cf8b95ce16f312,
        type: 3}
      propertyPath: m_LocalPosition.x
      value: 0
      objectReference: {fileID: 0}
    - target: {fileID: 5256168931348467924, guid: b9b482242e046574a9cf8b95ce16f312,
        type: 3}
      propertyPath: m_LocalPosition.y
      value: 0
      objectReference: {fileID: 0}
    - target: {fileID: 5256168931348467924, guid: b9b482242e046574a9cf8b95ce16f312,
        type: 3}
      propertyPath: m_LocalPosition.z
      value: 0
      objectReference: {fileID: 0}
    - target: {fileID: 5256168931348467924, guid: b9b482242e046574a9cf8b95ce16f312,
        type: 3}
      propertyPath: m_LocalRotation.w
      value: 0
      objectReference: {fileID: 0}
    - target: {fileID: 5256168931348467924, guid: b9b482242e046574a9cf8b95ce16f312,
        type: 3}
      propertyPath: m_LocalRotation.x
      value: 0
      objectReference: {fileID: 0}
    - target: {fileID: 5256168931348467924, guid: b9b482242e046574a9cf8b95ce16f312,
        type: 3}
      propertyPath: m_LocalRotation.y
      value: 1
      objectReference: {fileID: 0}
    - target: {fileID: 5256168931348467924, guid: b9b482242e046574a9cf8b95ce16f312,
        type: 3}
      propertyPath: m_LocalRotation.z
      value: 0
      objectReference: {fileID: 0}
    - target: {fileID: 5256168931348467924, guid: b9b482242e046574a9cf8b95ce16f312,
        type: 3}
      propertyPath: m_LocalEulerAnglesHint.x
      value: 0
      objectReference: {fileID: 0}
    - target: {fileID: 5256168931348467924, guid: b9b482242e046574a9cf8b95ce16f312,
        type: 3}
      propertyPath: m_LocalEulerAnglesHint.y
      value: 180
      objectReference: {fileID: 0}
    - target: {fileID: 5256168931348467924, guid: b9b482242e046574a9cf8b95ce16f312,
        type: 3}
      propertyPath: m_LocalEulerAnglesHint.z
      value: 0
      objectReference: {fileID: 0}
    - target: {fileID: 6610643264337540844, guid: b9b482242e046574a9cf8b95ce16f312,
        type: 3}
      propertyPath: m_Materials.Array.data[0]
      value: 
      objectReference: {fileID: 2100000, guid: dd33dd14f3e2cf24ab1ff6af3f8e3854, type: 2}
    - target: {fileID: 6674382523310512688, guid: b9b482242e046574a9cf8b95ce16f312,
        type: 3}
      propertyPath: m_Materials.Array.data[0]
      value: 
      objectReference: {fileID: 2100000, guid: dd33dd14f3e2cf24ab1ff6af3f8e3854, type: 2}
    - target: {fileID: 7562674074294225813, guid: b9b482242e046574a9cf8b95ce16f312,
        type: 3}
      propertyPath: m_Materials.Array.data[0]
      value: 
      objectReference: {fileID: 2100000, guid: dd33dd14f3e2cf24ab1ff6af3f8e3854, type: 2}
    - target: {fileID: 8001233936653170049, guid: b9b482242e046574a9cf8b95ce16f312,
        type: 3}
      propertyPath: m_Materials.Array.data[0]
      value: 
      objectReference: {fileID: 2100000, guid: dd33dd14f3e2cf24ab1ff6af3f8e3854, type: 2}
    - target: {fileID: 8860652965766940728, guid: b9b482242e046574a9cf8b95ce16f312,
        type: 3}
      propertyPath: m_Materials.Array.data[0]
      value: 
      objectReference: {fileID: 2100000, guid: dd33dd14f3e2cf24ab1ff6af3f8e3854, type: 2}
    m_RemovedComponents:
    - {fileID: 6289227886116026344, guid: b9b482242e046574a9cf8b95ce16f312, type: 3}
    m_RemovedGameObjects: []
    m_AddedGameObjects: []
    m_AddedComponents: []
  m_SourcePrefab: {fileID: 100100000, guid: b9b482242e046574a9cf8b95ce16f312, type: 3}
