%YAML 1.1
%TAG !u! tag:unity3d.com,2011:
--- !u!1001 &1865750187165782780
PrefabInstance:
  m_ObjectHideFlags: 0
  serializedVersion: 2
  m_Modification:
    serializedVersion: 3
    m_TransformParent: {fileID: 0}
    m_Modifications:
    - target: {fileID: 1167064250736606886, guid: d9b5b4c1f1eca784990579aad2c173e9,
        type: 3}
      propertyPath: m_Name
      value: Vario hitam
      objectReference: {fileID: 0}
    - target: {fileID: 3654959331577533003, guid: d9b5b4c1f1eca784990579aad2c173e9,
        type: 3}
      propertyPath: m_Materials.Array.data[0]
      value: 
      objectReference: {fileID: 2100000, guid: 874fa6f3c2a4c6c4292a349477373981, type: 2}
    - target: {fileID: 4781064611254789136, guid: d9b5b4c1f1eca784990579aad2c173e9,
        type: 3}
      propertyPath: m_Materials.Array.data[0]
      value: 
      objectReference: {fileID: 2100000, guid: 874fa6f3c2a4c6c4292a349477373981, type: 2}
    - target: {fileID: 4991204868386261196, guid: d9b5b4c1f1eca784990579aad2c173e9,
        type: 3}
      propertyPath: m_Materials.Array.data[0]
      value: 
      objectReference: {fileID: 2100000, guid: 874fa6f3c2a4c6c4292a349477373981, type: 2}
    - target: {fileID: 5842804942638334504, guid: d9b5b4c1f1eca784990579aad2c173e9,
        type: 3}
      propertyPath: m_LocalPosition.x
      value: 0
      objectReference: {fileID: 0}
    - target: {fileID: 5842804942638334504, guid: d9b5b4c1f1eca784990579aad2c173e9,
        type: 3}
      propertyPath: m_LocalPosition.y
      value: 0
      objectReference: {fileID: 0}
    - target: {fileID: 5842804942638334504, guid: d9b5b4c1f1eca784990579aad2c173e9,
        type: 3}
      propertyPath: m_LocalPosition.z
      value: 0
      objectReference: {fileID: 0}
    - target: {fileID: 5842804942638334504, guid: d9b5b4c1f1eca784990579aad2c173e9,
        type: 3}
      propertyPath: m_LocalRotation.w
      value: 0
      objectReference: {fileID: 0}
    - target: {fileID: 5842804942638334504, guid: d9b5b4c1f1eca784990579aad2c173e9,
        type: 3}
      propertyPath: m_LocalRotation.x
      value: 0
      objectReference: {fileID: 0}
    - target: {fileID: 5842804942638334504, guid: d9b5b4c1f1eca784990579aad2c173e9,
        type: 3}
      propertyPath: m_LocalRotation.y
      value: 1
      objectReference: {fileID: 0}
    - target: {fileID: 5842804942638334504, guid: d9b5b4c1f1eca784990579aad2c173e9,
        type: 3}
      propertyPath: m_LocalRotation.z
      value: 0
      objectReference: {fileID: 0}
    - target: {fileID: 5842804942638334504, guid: d9b5b4c1f1eca784990579aad2c173e9,
        type: 3}
      propertyPath: m_LocalEulerAnglesHint.x
      value: 0
      objectReference: {fileID: 0}
    - target: {fileID: 5842804942638334504, guid: d9b5b4c1f1eca784990579aad2c173e9,
        type: 3}
      propertyPath: m_LocalEulerAnglesHint.y
      value: 180
      objectReference: {fileID: 0}
    - target: {fileID: 5842804942638334504, guid: d9b5b4c1f1eca784990579aad2c173e9,
        type: 3}
      propertyPath: m_LocalEulerAnglesHint.z
      value: 0
      objectReference: {fileID: 0}
    - target: {fileID: 7139090541193353924, guid: d9b5b4c1f1eca784990579aad2c173e9,
        type: 3}
      propertyPath: m_Materials.Array.data[0]
      value: 
      objectReference: {fileID: 2100000, guid: 874fa6f3c2a4c6c4292a349477373981, type: 2}
    - target: {fileID: 8147150163715004777, guid: d9b5b4c1f1eca784990579aad2c173e9,
        type: 3}
      propertyPath: m_Materials.Array.data[0]
      value: 
      objectReference: {fileID: 2100000, guid: 874fa6f3c2a4c6c4292a349477373981, type: 2}
    - target: {fileID: 8569908325693630333, guid: d9b5b4c1f1eca784990579aad2c173e9,
        type: 3}
      propertyPath: m_Materials.Array.data[0]
      value: 
      objectReference: {fileID: 2100000, guid: 874fa6f3c2a4c6c4292a349477373981, type: 2}
    m_RemovedComponents:
    - {fileID: 5666560326893544724, guid: d9b5b4c1f1eca784990579aad2c173e9, type: 3}
    m_RemovedGameObjects: []
    m_AddedGameObjects: []
    m_AddedComponents: []
  m_SourcePrefab: {fileID: 100100000, guid: d9b5b4c1f1eca784990579aad2c173e9, type: 3}
