{
    "$schema": "https://raw.githubusercontent.com/jetify-com/devbox/0.10.7/.schema/devbox.schema.json",
    "packages": [
      "awscli2@latest",
      "checkov@latest",
      "direnv@latest",
      "fzf@latest",
      "git@latest",
      "git-lfs@latest",
      "gitleaks@latest",
      "go-task@latest",
      "helm-docs@latest",
      "infracost@latest",
      "k9s@latest",
      "kubectl@1.29.3",
      "krew@latest",
      "kubectx@latest",
      "kubernetes-helm@3.14.3",
      "kustomize@latest",
      "pre-commit@latest",
      "yamllint@latest"
    ],
    "shell": {
      "init_hook": [
        "echo 'Welcome to devbox!' > /dev/null"
      ],
      "scripts": {
        "test": [
          "echo \"Error: no test specified\" && exit 1"
        ]
      }
    }
}
  