# WaveFront *.obj file (generated by Autodesk ATF)

mtllib 09e8bd33-458b-4249-9931-539f14350445.mtl

g Body1

v 125.047575 -65.000000 5.000000
v 124.877204 -66.294095 5.000000
v 124.377702 -67.500000 5.000000
v 123.583109 -68.535534 5.000000
v 122.547575 -69.330127 5.000000
v 121.341670 -69.829629 5.000000
v 120.047575 -70.000000 5.000000
v 120.047575 -69.829629 3.705905
v 120.047575 -69.330127 2.500000
v 120.047575 -68.535534 1.464466
v 120.047575 -67.500000 0.669873
v 120.047575 -66.294095 0.170371
v 120.047575 -65.000000 0.000000
v 121.341670 -65.000000 0.170371
v 122.547575 -65.000000 0.669873
v 123.583109 -65.000000 1.464466
v 124.377702 -65.000000 2.500000
v 124.877204 -65.000000 3.705905
v 124.635087 -66.943219 4.577350
v 124.899920 -65.769564 4.071281
v 122.818879 -69.143339 4.609346
v 123.636578 -68.332839 3.994393
v 124.209692 -67.295210 3.447972
v 124.499164 -66.101167 3.007318
v 121.288115 -69.811868 4.445936
v 122.199754 -69.309150 3.658600
v 122.964725 -68.512770 2.962678
v 123.530898 -67.477001 2.405597
v 123.859687 -66.272428 2.025319
v 120.601639 -69.811868 3.759459
v 121.388975 -69.309150 2.847821
v 122.084897 -68.512770 2.082850
v 122.641978 -67.477001 1.516677
v 123.022256 -66.272428 1.187888
v 120.438229 -69.143339 2.228696
v 121.053182 -68.332839 1.410997
v 121.599603 -67.295210 0.837883
v 122.040257 -66.101167 0.548411
v 120.470225 -66.943219 0.412488
v 120.976294 -65.769564 0.147655
v 125.047575 25.000000 5.000000
v 120.047575 30.000000 0.000000
v 120.537661 29.975924 0.024076
v 121.023027 29.903926 0.096074
v 121.960992 29.619398 0.380602
v 122.825426 29.157348 0.842652
v 123.583109 28.535534 1.464466
v 124.204923 27.777851 2.222149
v 124.666973 26.913417 3.086583
v 124.951501 25.975452 4.024548
v 120.047575 25.000000 20.000000
v 121.341670 25.000000 19.829629
v 122.547575 25.000000 19.330127
v 123.583109 25.000000 18.535534
v 124.377702 25.000000 17.500000
v 124.877204 25.000000 16.294095
v 125.047575 25.000000 15.000000
v 124.877204 26.294095 15.000000
v 124.377702 27.500000 15.000000
v 123.583109 28.535534 15.000000
v 122.547575 29.330127 15.000000
v 121.341670 29.829629 15.000000
v 120.047575 30.000000 15.000000
v 120.047575 29.829629 16.294095
v 120.047575 29.330127 17.500000
v 120.047575 28.535534 18.535534
v 120.047575 27.500000 19.330127
v 120.047575 26.294095 19.829629
v 120.976294 25.769564 19.852345
v 120.470225 26.943219 19.587512
v 122.040257 26.101167 19.451589
v 121.599603 27.295210 19.162117
v 121.053182 28.332839 18.589003
v 120.438229 29.143339 17.771304
v 123.022256 26.272428 18.812112
v 122.641978 27.477001 18.483323
v 122.084897 28.512770 17.917150
v 121.388975 29.309150 17.152179
v 120.601639 29.811868 16.240541
v 123.859687 26.272428 17.974681
v 123.530898 27.477001 17.594403
v 122.964725 28.512770 17.037322
v 122.199754 29.309150 16.341400
v 121.288115 29.811868 15.554064
v 124.499164 26.101167 16.992682
v 124.209692 27.295210 16.552028
v 123.636578 28.332839 16.005607
v 122.818879 29.143339 15.390654
v 124.899920 25.769564 15.928719
v 124.635087 26.943219 15.422650
v -50.000000 -65.000000 5.000000
v -49.829629 -65.000000 3.705905
v -49.330127 -65.000000 2.500000
v -48.535534 -65.000000 1.464466
v -47.500000 -65.000000 0.669873
v -46.294095 -65.000000 0.170371
v -45.000000 -65.000000 0.000000
v -45.000000 -66.294095 0.170371
v -45.000000 -67.500000 0.669873
v -45.000000 -68.535534 1.464466
v -45.000000 -69.330127 2.500000
v -45.000000 -69.829629 3.705905
v -45.000000 -70.000000 5.000000
v -46.294095 -69.829629 5.000000
v -47.500000 -69.330127 5.000000
v -48.535534 -68.535534 5.000000
v -49.330127 -67.500000 5.000000
v -49.829629 -66.294095 5.000000
v -49.852345 -65.769564 4.071281
v -49.587512 -66.943219 4.577350
v -49.451589 -66.101167 3.007318
v -49.162117 -67.295210 3.447972
v -48.589003 -68.332839 3.994393
v -47.771304 -69.143339 4.609346
v -48.812112 -66.272428 2.025319
v -48.483323 -67.477001 2.405597
v -47.917150 -68.512770 2.962678
v -47.152179 -69.309150 3.658600
v -46.240541 -69.811868 4.445936
v -47.974681 -66.272428 1.187888
v -47.594403 -67.477001 1.516677
v -47.037322 -68.512770 2.082850
v -46.341400 -69.309150 2.847821
v -45.554064 -69.811868 3.759459
v -46.992682 -66.101167 0.548411
v -46.552028 -67.295210 0.837883
v -46.005607 -68.332839 1.410997
v -45.390654 -69.143339 2.228696
v -45.928719 -65.769564 0.147655
v -45.422650 -66.943219 0.412488
v -45.000000 30.000000 0.000000
v -50.000000 25.000000 5.000000
v -49.903926 25.975452 4.024548
v -49.619398 26.913417 3.086583
v -49.157348 27.777851 2.222149
v -48.535534 28.535534 1.464466
v -47.777851 29.157348 0.842652
v -46.913417 29.619398 0.380602
v -45.975452 29.903926 0.096074
v -45.490086 29.975924 0.024076
v -45.000000 25.000000 20.000000
v -45.000000 26.294095 19.829629
v -45.000000 27.500000 19.330127
v -45.000000 28.535534 18.535534
v -45.000000 29.330127 17.500000
v -45.000000 29.829629 16.294095
v -45.000000 30.000000 15.000000
v -46.294095 29.829629 15.000000
v -47.500000 29.330127 15.000000
v -48.535534 28.535534 15.000000
v -49.330127 27.500000 15.000000
v -49.829629 26.294095 15.000000
v -50.000000 25.000000 15.000000
v -49.829629 25.000000 16.294095
v -49.330127 25.000000 17.500000
v -48.535534 25.000000 18.535534
v -47.500000 25.000000 19.330127
v -46.294095 25.000000 19.829629
v -49.852345 25.769564 15.928719
v -45.422650 26.943219 19.587512
v -45.928719 25.769564 19.852345
v -45.390654 29.143339 17.771304
v -46.005607 28.332839 18.589003
v -46.552028 27.295210 19.162117
v -46.992682 26.101167 19.451589
v -45.554064 29.811868 16.240541
v -46.341400 29.309150 17.152179
v -47.037322 28.512770 17.917150
v -47.594403 27.477001 18.483323
v -47.974681 26.272428 18.812112
v -46.240541 29.811868 15.554064
v -47.152179 29.309150 16.341400
v -47.917150 28.512770 17.037322
v -48.483323 27.477001 17.594403
v -48.812112 26.272428 17.974681
v -47.771304 29.143339 15.390654
v -48.589003 28.332839 16.005607
v -49.162117 27.295210 16.552028
v -49.451589 26.101167 16.992682
v -49.587512 26.943219 15.422650
v 120.047575 -65.000000 20.000000
v 120.047575 -66.294095 19.829629
v 120.047575 -67.500000 19.330127
v 120.047575 -68.535534 18.535534
v 120.047575 -69.330127 17.500000
v 120.047575 -69.829629 16.294095
v 120.047575 -70.000000 15.000000
v 121.341670 -69.829629 15.000000
v 122.547575 -69.330127 15.000000
v 123.583109 -68.535534 15.000000
v 124.377702 -67.500000 15.000000
v 124.877204 -66.294095 15.000000
v 125.047575 -65.000000 15.000000
v 124.877204 -65.000000 16.294095
v 124.377702 -65.000000 17.500000
v 123.583109 -65.000000 18.535534
v 122.547575 -65.000000 19.330127
v 121.341670 -65.000000 19.829629
v 120.470225 -66.943219 19.587512
v 120.976294 -65.769564 19.852345
v 120.438229 -69.143339 17.771304
v 121.053182 -68.332839 18.589003
v 121.599603 -67.295210 19.162117
v 122.040257 -66.101167 19.451589
v 120.601639 -69.811868 16.240541
v 121.388975 -69.309150 17.152179
v 122.084897 -68.512770 17.917150
v 122.641978 -67.477001 18.483323
v 123.022256 -66.272428 18.812112
v 121.288115 -69.811868 15.554064
v 122.199754 -69.309150 16.341400
v 122.964725 -68.512770 17.037322
v 123.530898 -67.477001 17.594403
v 123.859687 -66.272428 17.974681
v 122.818879 -69.143339 15.390654
v 123.636578 -68.332839 16.005607
v 124.209692 -67.295210 16.552028
v 124.499164 -66.101167 16.992682
v 124.635087 -66.943219 15.422650
v 124.899920 -65.769564 15.928719
v -45.000000 -65.000000 20.000000
v -46.294095 -65.000000 19.829629
v -47.500000 -65.000000 19.330127
v -48.535534 -65.000000 18.535534
v -49.330127 -65.000000 17.500000
v -49.829629 -65.000000 16.294095
v -50.000000 -65.000000 15.000000
v -49.829629 -66.294095 15.000000
v -49.330127 -67.500000 15.000000
v -48.535534 -68.535534 15.000000
v -47.500000 -69.330127 15.000000
v -46.294095 -69.829629 15.000000
v -45.000000 -70.000000 15.000000
v -45.000000 -69.829629 16.294095
v -45.000000 -69.330127 17.500000
v -45.000000 -68.535534 18.535534
v -45.000000 -67.500000 19.330127
v -45.000000 -66.294095 19.829629
v -45.928719 -65.769564 19.852345
v -45.422650 -66.943219 19.587512
v -46.992682 -66.101167 19.451589
v -46.552028 -67.295210 19.162117
v -46.005607 -68.332839 18.589003
v -45.390654 -69.143339 17.771304
v -47.974681 -66.272428 18.812112
v -47.594403 -67.477001 18.483323
v -47.037322 -68.512770 17.917150
v -46.341400 -69.309150 17.152179
v -45.554064 -69.811868 16.240541
v -48.812112 -66.272428 17.974681
v -48.483323 -67.477001 17.594403
v -47.917150 -68.512770 17.037322
v -47.152179 -69.309150 16.341400
v -46.240541 -69.811868 15.554064
v -49.451589 -66.101167 16.992682
v -49.162117 -67.295210 16.552028
v -48.589003 -68.332839 16.005607
v -47.771304 -69.143339 15.390654
v -49.852345 -65.769564 15.928719
v -49.587512 -66.943219 15.422650
v 105.000000 15.000000 20.000000
v 105.000000 -55.000000 20.000000
v -35.000000 -55.000000 20.000000
v -35.000000 15.000000 20.000000
v 104.024548 14.024548 19.903926
v 103.086583 13.086583 19.619398
v 102.222149 12.222149 19.157348
v 101.464466 11.464466 18.535534
v 100.842652 10.842652 17.777851
v 100.380602 10.380602 16.913417
v 100.096074 10.096074 15.975452
v 100.024076 10.024076 15.490086
v 100.000000 10.000000 15.000000
v 100.000000 -50.000000 15.000000
v 100.024076 -50.024076 15.490086
v 100.096074 -50.096074 15.975452
v 100.380602 -50.380602 16.913417
v 100.842652 -50.842652 17.777851
v 101.464466 -51.464466 18.535534
v 102.222149 -52.222149 19.157348
v 103.086583 -53.086583 19.619398
v 104.024548 -54.024548 19.903926
v -34.024548 14.024548 19.903926
v -33.086583 13.086583 19.619398
v -32.222149 12.222149 19.157348
v -31.464466 11.464466 18.535534
v -30.842652 10.842652 17.777851
v -30.380602 10.380602 16.913417
v -30.096074 10.096074 15.975452
v -30.024076 10.024076 15.490086
v -30.000000 10.000000 15.000000
v -30.000000 -50.000000 15.000000
v -34.024548 -54.024548 19.903926
v -33.086583 -53.086583 19.619398
v -32.222149 -52.222149 19.157348
v -31.464466 -51.464466 18.535534
v -30.842652 -50.842652 17.777851
v -30.380602 -50.380602 16.913417
v -30.096074 -50.096074 15.975452
v -30.024076 -50.024076 15.490086
v 100.000000 -50.000000 10.000000
v -30.000000 -50.000000 10.000000
v 100.000000 10.000000 10.000000
v -30.000000 10.000000 10.000000
vt 0.261799 0.303308 0.000000
vt 0.210267 0.436658 0.000000
vt 0.176840 0.311899 0.000000
vt 0.092025 0.378503 0.000000
vt 0.045940 0.311899 0.000000
vt -0.027361 0.325356 0.000000
vt 0.045940 0.187139 0.000000
vt -0.084959 0.187139 0.000000
vt 0.045940 0.062380 0.000000
vt -0.084959 0.062380 0.000000
vt 0.045940 -0.062380 0.000000
vt -0.084959 -0.062380 0.000000
vt 0.045940 -0.187139 0.000000
vt -0.084959 -0.187139 0.000000
vt -0.027361 -0.325356 0.000000
vt -0.146421 -0.270777 0.000000
vt -0.215859 -0.187139 0.000000
vt -0.263523 -0.207680 0.000000
vt -0.215859 -0.062380 0.000000
vt -0.346759 -0.062380 0.000000
vt -0.346759 0.062380 0.000000
vt -0.477658 0.000000 0.000000
vt -0.375940 0.124807 0.000000
vt -0.263523 0.207680 0.000000
vt -0.215859 0.062380 0.000000
vt -0.215859 0.187139 0.000000
vt -0.146421 0.270777 0.000000
vt -0.375940 -0.124807 0.000000
vt 0.045940 -0.311899 0.000000
vt 0.092025 -0.378503 0.000000
vt 0.176840 -0.311899 0.000000
vt 0.210267 -0.436658 0.000000
vt 0.261799 -0.303308 0.000000
vt 0.176840 -0.187139 0.000000
vt 0.295793 -0.156265 0.000000
vt 0.176840 -0.062380 0.000000
vt 0.307740 -0.000000 0.000000
vt 0.176840 0.062380 0.000000
vt 0.295793 0.156265 0.000000
vt 0.176840 0.187139 0.000000
vt 7.000000 0.392699 0.000000
vt -2.000000 0.392699 0.000000
vt 7.097545 0.294524 0.000000
vt -2.000000 0.261799 0.000000
vt 7.191342 0.196350 0.000000
vt -2.000000 0.130900 0.000000
vt 7.277785 0.098175 0.000000
vt -2.000000 -0.000000 0.000000
vt 7.353553 -0.000000 0.000000
vt 7.415735 -0.098175 0.000000
vt -2.000000 -0.130900 0.000000
vt 7.461940 -0.196350 0.000000
vt -2.000000 -0.261799 0.000000
vt 7.490393 -0.294524 0.000000
vt 7.497592 -0.343612 0.000000
vt -2.000000 -0.392699 0.000000
vt 7.500000 -0.392699 0.000000
vt -0.092025 0.378503 0.000000
vt -0.210267 0.436658 0.000000
vt -0.176840 0.311899 0.000000
vt -0.261799 0.303308 0.000000
vt -0.176840 0.187139 0.000000
vt -0.295793 0.156265 0.000000
vt -0.176840 0.062380 0.000000
vt -0.307740 0.000000 0.000000
vt -0.176840 -0.062380 0.000000
vt -0.295793 -0.156265 0.000000
vt -0.176840 -0.187139 0.000000
vt -0.261799 -0.303308 0.000000
vt -0.176840 -0.311899 0.000000
vt -0.210267 -0.436658 0.000000
vt -0.092025 -0.378503 0.000000
vt -0.045940 -0.311899 0.000000
vt 0.027361 -0.325356 0.000000
vt -0.045940 -0.187139 0.000000
vt 0.084959 -0.187139 0.000000
vt -0.045940 -0.062380 0.000000
vt 0.084959 -0.062380 0.000000
vt -0.045940 0.062380 0.000000
vt 0.084959 0.062380 0.000000
vt -0.045940 0.187139 0.000000
vt 0.084959 0.187139 0.000000
vt 0.027361 0.325356 0.000000
vt 0.146421 0.270777 0.000000
vt 0.215859 0.187139 0.000000
vt 0.263523 0.207680 0.000000
vt 0.215859 0.062380 0.000000
vt 0.346759 0.062380 0.000000
vt 0.346759 -0.062380 0.000000
vt 0.477658 0.000000 0.000000
vt 0.375940 -0.124807 0.000000
vt 0.263523 -0.207680 0.000000
vt 0.215859 -0.062380 0.000000
vt 0.215859 -0.187139 0.000000
vt 0.146421 -0.270777 0.000000
vt 0.375940 0.124807 0.000000
vt -0.045940 0.311899 0.000000
vt -0.000000 0.392699 0.000000
vt -1.500000 0.392699 0.000000
vt -0.002408 0.343612 0.000000
vt -1.500000 0.261799 0.000000
vt -0.009607 0.294524 0.000000
vt -0.038060 0.196350 0.000000
vt -1.500000 0.130900 0.000000
vt -0.084265 0.098175 0.000000
vt -1.500000 0.000000 0.000000
vt -0.146447 0.000000 0.000000
vt -0.222215 -0.098175 0.000000
vt -1.500000 -0.130900 0.000000
vt -0.308658 -0.196350 0.000000
vt -1.500000 -0.261799 0.000000
vt -0.402455 -0.294524 0.000000
vt -1.500000 -0.392699 0.000000
vt -0.500000 -0.392699 0.000000
vt 0.092025 -0.378503 0.000000
vt 0.210267 -0.436658 0.000000
vt 0.176840 -0.311899 0.000000
vt 0.261799 -0.303308 0.000000
vt 0.176840 -0.187139 0.000000
vt 0.295793 -0.156265 0.000000
vt 0.176840 -0.062380 0.000000
vt 0.307740 -0.000000 0.000000
vt 0.176840 0.062380 0.000000
vt 0.295793 0.156265 0.000000
vt 0.176840 0.187139 0.000000
vt 0.261799 0.303308 0.000000
vt 0.176840 0.311899 0.000000
vt 0.210267 0.436658 0.000000
vt 0.092025 0.378503 0.000000
vt 0.045940 0.311899 0.000000
vt -0.027361 0.325356 0.000000
vt 0.045940 0.187139 0.000000
vt -0.084959 0.187139 0.000000
vt 0.045940 0.062380 0.000000
vt -0.084959 0.062380 0.000000
vt 0.045940 -0.062380 0.000000
vt -0.084959 -0.062380 0.000000
vt 0.045940 -0.187139 0.000000
vt -0.084959 -0.187139 0.000000
vt -0.027361 -0.325356 0.000000
vt -0.146421 -0.270777 0.000000
vt -0.215859 -0.187139 0.000000
vt -0.263523 -0.207680 0.000000
vt -0.215859 -0.062380 0.000000
vt -0.346759 -0.062380 0.000000
vt -0.346759 0.062380 0.000000
vt -0.477658 0.000000 0.000000
vt -0.375940 0.124807 0.000000
vt -0.263523 0.207680 0.000000
vt -0.215859 0.062380 0.000000
vt -0.215859 0.187139 0.000000
vt -0.146421 0.270777 0.000000
vt -0.375940 -0.124807 0.000000
vt 0.045940 -0.311899 0.000000
vt 12.628568 0.392699 0.000000
vt -3.876189 0.392699 0.000000
vt 12.628568 0.261799 0.000000
vt -3.876189 0.261799 0.000000
vt 12.628568 0.130900 0.000000
vt -3.876189 0.130900 0.000000
vt 12.628568 0.000000 0.000000
vt -3.876189 0.000000 0.000000
vt 12.628568 -0.130900 0.000000
vt -3.876189 -0.130900 0.000000
vt 12.628568 -0.261799 0.000000
vt -3.876189 -0.261799 0.000000
vt 12.628568 -0.392699 0.000000
vt -3.876189 -0.392699 0.000000
vt -2.500000 -0.392699 0.000000
vt 7.000000 -0.392699 0.000000
vt -2.497592 -0.343612 0.000000
vt 7.000000 -0.261799 0.000000
vt -2.490393 -0.294524 0.000000
vt -2.461940 -0.196350 0.000000
vt 7.000000 -0.130900 0.000000
vt -2.415735 -0.098175 0.000000
vt 7.000000 0.000000 0.000000
vt -2.353553 0.000000 0.000000
vt -2.277785 0.098175 0.000000
vt 7.000000 0.130900 0.000000
vt -2.191342 0.196350 0.000000
vt 7.000000 0.261799 0.000000
vt -2.097545 0.294524 0.000000
vt 7.000000 0.392699 0.000000
vt -2.000000 0.392699 0.000000
vt -0.261799 -0.303308 0.000000
vt -0.210267 -0.436658 0.000000
vt -0.176840 -0.311899 0.000000
vt -0.092025 -0.378503 0.000000
vt -0.045940 -0.311899 0.000000
vt 0.027361 -0.325356 0.000000
vt -0.045940 -0.187139 0.000000
vt 0.084959 -0.187139 0.000000
vt -0.045940 -0.062380 0.000000
vt 0.084959 -0.062380 0.000000
vt -0.045940 0.062380 0.000000
vt 0.084959 0.062380 0.000000
vt -0.045940 0.187139 0.000000
vt 0.084959 0.187139 0.000000
vt 0.027361 0.325356 0.000000
vt 0.146421 0.270777 0.000000
vt 0.215859 0.187139 0.000000
vt 0.263523 0.207680 0.000000
vt 0.215859 0.062380 0.000000
vt 0.346759 0.062380 0.000000
vt 0.346759 -0.062380 0.000000
vt 0.477658 0.000000 0.000000
vt 0.375940 -0.124807 0.000000
vt 0.263523 -0.207680 0.000000
vt 0.215859 -0.062380 0.000000
vt 0.215859 -0.187139 0.000000
vt 0.146421 -0.270777 0.000000
vt 0.375940 0.124807 0.000000
vt -0.045940 0.311899 0.000000
vt -0.092025 0.378503 0.000000
vt -0.176840 0.311899 0.000000
vt -0.210267 0.436658 0.000000
vt -0.261799 0.303308 0.000000
vt -0.176840 0.187139 0.000000
vt -0.295793 0.156265 0.000000
vt -0.176840 0.062380 0.000000
vt -0.307740 0.000000 0.000000
vt -0.176840 -0.062380 0.000000
vt -0.295793 -0.156265 0.000000
vt -0.176840 -0.187139 0.000000
vt -0.500000 0.392699 0.000000
vt -1.500000 0.392699 0.000000
vt -0.402455 0.294524 0.000000
vt -1.500000 0.261799 0.000000
vt -0.308658 0.196350 0.000000
vt -1.500000 0.130900 0.000000
vt -0.222215 0.098175 0.000000
vt -1.500000 0.000000 0.000000
vt -0.146447 0.000000 0.000000
vt -0.084265 -0.098175 0.000000
vt -1.500000 -0.130900 0.000000
vt -0.038060 -0.196350 0.000000
vt -1.500000 -0.261799 0.000000
vt -0.009607 -0.294524 0.000000
vt -0.002408 -0.343612 0.000000
vt -1.500000 -0.392699 0.000000
vt -0.000000 -0.392699 0.000000
vt 0.261799 0.303308 0.000000
vt 0.210267 0.436658 0.000000
vt 0.176840 0.311899 0.000000
vt 0.092025 0.378503 0.000000
vt 0.045940 0.311899 0.000000
vt -0.027361 0.325356 0.000000
vt 0.045940 0.187139 0.000000
vt -0.084959 0.187139 0.000000
vt 0.045940 0.062380 0.000000
vt -0.084959 0.062380 0.000000
vt 0.045940 -0.062380 0.000000
vt -0.084959 -0.062380 0.000000
vt 0.045940 -0.187139 0.000000
vt -0.084959 -0.187139 0.000000
vt -0.027361 -0.325356 0.000000
vt -0.146421 -0.270777 0.000000
vt -0.215859 -0.187139 0.000000
vt -0.263523 -0.207680 0.000000
vt -0.215859 -0.062380 0.000000
vt -0.346759 -0.062380 0.000000
vt -0.346759 0.062380 0.000000
vt -0.477658 0.000000 0.000000
vt -0.375940 0.124807 0.000000
vt -0.263523 0.207680 0.000000
vt -0.215859 0.062380 0.000000
vt -0.215859 0.187139 0.000000
vt -0.146421 0.270777 0.000000
vt -0.375940 -0.124807 0.000000
vt 0.045940 -0.311899 0.000000
vt 0.092025 -0.378503 0.000000
vt 0.176840 -0.311899 0.000000
vt 0.210267 -0.436658 0.000000
vt 0.261799 -0.303308 0.000000
vt 0.176840 -0.187139 0.000000
vt 0.295793 -0.156265 0.000000
vt 0.176840 -0.062380 0.000000
vt 0.307740 0.000000 0.000000
vt 0.176840 0.062380 0.000000
vt 0.295793 0.156265 0.000000
vt 0.176840 0.187139 0.000000
vt -0.500000 0.392699 0.000000
vt -1.500000 0.392699 0.000000
vt -0.500000 0.261799 0.000000
vt -1.500000 0.261799 0.000000
vt -0.500000 0.130900 0.000000
vt -1.500000 0.130900 0.000000
vt -0.500000 -0.000000 0.000000
vt -1.500000 -0.000000 0.000000
vt -0.500000 -0.130900 0.000000
vt -1.500000 -0.130900 0.000000
vt -0.500000 -0.261799 0.000000
vt -1.500000 -0.261799 0.000000
vt -0.500000 -0.392699 0.000000
vt -1.500000 -0.392699 0.000000
vt 2.000000 0.392699 0.000000
vt -7.000000 0.392699 0.000000
vt 2.000000 0.261799 0.000000
vt -7.000000 0.261799 0.000000
vt 2.000000 0.130900 0.000000
vt -7.000000 0.130900 0.000000
vt 2.000000 -0.000000 0.000000
vt -7.000000 -0.000000 0.000000
vt 2.000000 -0.130900 0.000000
vt -7.000000 -0.130900 0.000000
vt 2.000000 -0.261799 0.000000
vt -7.000000 -0.261799 0.000000
vt 2.000000 -0.392699 0.000000
vt -7.000000 -0.392699 0.000000
vt 0.092025 -0.378503 0.000000
vt 0.210267 -0.436658 0.000000
vt 0.176840 -0.311899 0.000000
vt 0.261799 -0.303308 0.000000
vt 0.176840 -0.187139 0.000000
vt 0.295793 -0.156265 0.000000
vt 0.176840 -0.062380 0.000000
vt 0.307740 0.000000 0.000000
vt 0.176840 0.062380 0.000000
vt 0.295793 0.156265 0.000000
vt 0.176840 0.187139 0.000000
vt 0.261799 0.303308 0.000000
vt 0.176840 0.311899 0.000000
vt 0.210267 0.436658 0.000000
vt 0.092025 0.378503 0.000000
vt 0.045940 0.311899 0.000000
vt -0.027361 0.325356 0.000000
vt 0.045940 0.187139 0.000000
vt -0.084959 0.187139 0.000000
vt 0.045940 0.062380 0.000000
vt -0.084959 0.062380 0.000000
vt 0.045940 -0.062380 0.000000
vt -0.084959 -0.062380 0.000000
vt 0.045940 -0.187139 0.000000
vt -0.084959 -0.187139 0.000000
vt -0.027361 -0.325356 0.000000
vt -0.146421 -0.270777 0.000000
vt -0.215859 -0.187139 0.000000
vt -0.263523 -0.207680 0.000000
vt -0.215859 -0.062380 0.000000
vt -0.346759 -0.062380 0.000000
vt -0.346759 0.062380 0.000000
vt -0.477658 0.000000 0.000000
vt -0.375940 0.124807 0.000000
vt -0.263523 0.207680 0.000000
vt -0.215859 0.062380 0.000000
vt -0.215859 0.187139 0.000000
vt -0.146421 0.270777 0.000000
vt -0.375940 -0.124807 0.000000
vt 0.045940 -0.311899 0.000000
vt -0.500000 0.392699 0.000000
vt -1.500000 0.392699 0.000000
vt -0.500000 0.261799 0.000000
vt -1.500000 0.261799 0.000000
vt -0.500000 0.130900 0.000000
vt -1.500000 0.130900 0.000000
vt -0.500000 0.000000 0.000000
vt -1.500000 0.000000 0.000000
vt -0.500000 -0.130900 0.000000
vt -1.500000 -0.130900 0.000000
vt -0.500000 -0.261799 0.000000
vt -1.500000 -0.261799 0.000000
vt -0.500000 -0.392699 0.000000
vt -1.500000 -0.392699 0.000000
vt 3.876189 0.392699 0.000000
vt -12.628568 0.392699 0.000000
vt 3.876189 0.261799 0.000000
vt -12.628568 0.261799 0.000000
vt 3.876189 0.130900 0.000000
vt -12.628568 0.130900 0.000000
vt 3.876189 0.000000 0.000000
vt -12.628568 0.000000 0.000000
vt 3.876189 -0.130900 0.000000
vt -12.628568 -0.130900 0.000000
vt 3.876189 -0.261799 0.000000
vt -12.628568 -0.261799 0.000000
vt 3.876189 -0.392699 0.000000
vt -12.628568 -0.392699 0.000000
vt 2.000000 0.392699 0.000000
vt -7.000000 0.392699 0.000000
vt 2.000000 0.261799 0.000000
vt -7.000000 0.261799 0.000000
vt 2.000000 0.130900 0.000000
vt -7.000000 0.130900 0.000000
vt 2.000000 0.000000 0.000000
vt -7.000000 0.000000 0.000000
vt 2.000000 -0.130900 0.000000
vt -7.000000 -0.130900 0.000000
vt 2.000000 -0.261799 0.000000
vt -7.000000 -0.261799 0.000000
vt 2.000000 -0.392699 0.000000
vt -7.000000 -0.392699 0.000000
vt 3.876189 0.392699 0.000000
vt -12.628568 0.392699 0.000000
vt 3.876189 0.261799 0.000000
vt -12.628568 0.261799 0.000000
vt 3.876189 0.130900 0.000000
vt -12.628568 0.130900 0.000000
vt 3.876189 0.000000 0.000000
vt -12.628568 0.000000 0.000000
vt 3.876189 -0.130900 0.000000
vt -12.628568 -0.130900 0.000000
vt 3.876189 -0.261799 0.000000
vt -12.628568 -0.261799 0.000000
vt 3.876189 -0.392699 0.000000
vt -12.628568 -0.392699 0.000000
vt 17.004757 1.500000 0.000000
vt 0.500000 1.500000 0.000000
vt 17.004757 0.000000 0.000000
vt 0.500000 0.000000 0.000000
vt 0.500000 0.500000 0.000000
vt 9.500000 0.500000 0.000000
vt 0.500000 1.500000 0.000000
vt 9.500000 1.500000 0.000000
vt 0.500000 0.500000 0.000000
vt 17.004757 0.500000 0.000000
vt 0.500000 1.500000 0.000000
vt 17.004757 1.500000 0.000000
vt 0.500000 0.500000 0.000000
vt 9.500000 0.500000 0.000000
vt 0.500000 1.500000 0.000000
vt 9.500000 1.500000 0.000000
vt 6.747621 -3.500000 0.000000
vt 8.252379 -4.500000 0.000000
vt 6.747621 3.500000 0.000000
vt 8.252379 4.500000 0.000000
vt -8.252379 4.500000 0.000000
vt -8.252379 -4.500000 0.000000
vt -7.252379 -3.500000 0.000000
vt -7.252379 3.500000 0.000000
vt -5.000000 -0.392699 0.000000
vt 2.000000 -0.392699 0.000000
vt -4.902455 -0.294524 0.000000
vt 1.902455 -0.294524 0.000000
vt 1.808658 -0.196350 0.000000
vt -4.808658 -0.196350 0.000000
vt 1.722215 -0.098175 0.000000
vt -4.722215 -0.098175 0.000000
vt -4.646447 -0.000000 0.000000
vt 1.646447 -0.000000 0.000000
vt -4.584265 0.098175 0.000000
vt 1.584265 0.098175 0.000000
vt 1.538060 0.196350 0.000000
vt -4.538060 0.196350 0.000000
vt 1.509607 0.294524 0.000000
vt -4.509607 0.294524 0.000000
vt -4.502408 0.343612 0.000000
vt 1.502408 0.343612 0.000000
vt -4.500000 0.392699 0.000000
vt 1.500000 0.392699 0.000000
vt -10.123811 -0.392699 0.000000
vt 3.876189 -0.392699 0.000000
vt -10.026265 -0.294524 0.000000
vt 3.778644 -0.294524 0.000000
vt 3.684848 -0.196350 0.000000
vt -9.932469 -0.196350 0.000000
vt 3.598404 -0.098175 0.000000
vt -9.846026 -0.098175 0.000000
vt -9.770257 -0.000000 0.000000
vt 3.522636 0.000000 0.000000
vt -9.708076 0.098175 0.000000
vt 3.460455 0.098175 0.000000
vt 3.414250 0.196350 0.000000
vt -9.661871 0.196350 0.000000
vt 3.385797 0.294524 0.000000
vt -9.633418 0.294524 0.000000
vt -9.626218 0.343612 0.000000
vt 3.378597 0.343612 0.000000
vt -9.623811 0.392699 0.000000
vt 3.376189 0.392699 0.000000
vt 1.500000 0.392699 0.000000
vt -4.500000 0.392699 0.000000
vt 1.502408 0.343612 0.000000
vt -4.502408 0.343612 0.000000
vt 1.509607 0.294524 0.000000
vt -4.509607 0.294524 0.000000
vt -4.538060 0.196350 0.000000
vt 1.538060 0.196350 0.000000
vt -4.584265 0.098175 0.000000
vt 1.584265 0.098175 0.000000
vt 1.646447 0.000000 0.000000
vt -4.646447 0.000000 0.000000
vt 1.722215 -0.098175 0.000000
vt -4.722215 -0.098175 0.000000
vt -4.808658 -0.196350 0.000000
vt 1.808658 -0.196350 0.000000
vt -4.902455 -0.294524 0.000000
vt 1.902455 -0.294524 0.000000
vt 2.000000 -0.392699 0.000000
vt -5.000000 -0.392699 0.000000
vt -10.376189 -0.392699 0.000000
vt 3.623811 -0.392699 0.000000
vt -10.278644 -0.294524 0.000000
vt 3.526265 -0.294524 0.000000
vt 3.432469 -0.196350 0.000000
vt -10.184848 -0.196350 0.000000
vt 3.346026 -0.098175 0.000000
vt -10.098404 -0.098175 0.000000
vt -10.022636 -0.000000 0.000000
vt 3.270257 0.000000 0.000000
vt -9.960455 0.098175 0.000000
vt 3.208076 0.098175 0.000000
vt 3.161871 0.196350 0.000000
vt -9.914250 0.196350 0.000000
vt 3.133418 0.294524 0.000000
vt -9.885797 0.294524 0.000000
vt -9.878597 0.343612 0.000000
vt 3.126218 0.343612 0.000000
vt -9.876189 0.392699 0.000000
vt 3.123811 0.392699 0.000000
vt -13.000000 0.500000 0.000000
vt -0.000000 0.500000 0.000000
vt -13.000000 1.000000 0.000000
vt -0.000000 1.000000 0.000000
vt -6.000000 0.500000 0.000000
vt -0.000000 0.500000 0.000000
vt -6.000000 1.000000 0.000000
vt -0.000000 1.000000 0.000000
vt -13.000000 0.500000 0.000000
vt -0.000000 0.500000 0.000000
vt -13.000000 1.000000 0.000000
vt -0.000000 1.000000 0.000000
vt -6.000000 0.500000 0.000000
vt -0.000000 0.500000 0.000000
vt -6.000000 1.000000 0.000000
vt -0.000000 1.000000 0.000000
vt -6.500000 -3.000000 0.000000
vt 6.500000 -3.000000 0.000000
vt -6.500000 3.000000 0.000000
vt 6.500000 3.000000 0.000000
vt 8.252379 5.000000 0.000000
vt -8.252379 5.000000 0.000000
vt 8.252379 -4.500000 0.000000
vt -8.252379 -4.500000 0.000000
vn 0.096593 0.000000 -0.025882
vn 0.100000 0.000000 0.000000
vn 0.097047 -0.015391 -0.018574
vn 0.096593 -0.025882 0.000000
vn 0.091750 -0.038864 -0.008453
vn 0.086603 -0.050000 0.000000
vn 0.083242 -0.045904 -0.031041
vn 0.071780 -0.066657 -0.020112
vn 0.069666 -0.049540 -0.051888
vn 0.058343 -0.070255 -0.040746
vn 0.051888 -0.049540 -0.069666
vn 0.040746 -0.070255 -0.058343
vn 0.031041 -0.045904 -0.083242
vn 0.020112 -0.066657 -0.071780
vn 0.000000 -0.050000 -0.086603
vn 0.000000 -0.070711 -0.070711
vn 0.007813 -0.082867 -0.055426
vn 0.000000 -0.086603 -0.050000
vn 0.026828 -0.086183 -0.043044
vn 0.011081 -0.096237 -0.024811
vn 0.024811 -0.096237 -0.011081
vn 0.000000 -0.100000 0.000000
vn 0.025882 -0.096593 0.000000
vn 0.050000 -0.086603 0.000000
vn 0.043044 -0.086183 -0.026828
vn 0.055426 -0.082867 -0.007813
vn 0.070711 -0.070711 0.000000
vn 0.000000 -0.096593 -0.025882
vn 0.008453 -0.038864 -0.091750
vn 0.000000 -0.025882 -0.096593
vn 0.018574 -0.015391 -0.097047
vn 0.000000 0.000000 -0.100000
vn 0.025882 0.000000 -0.096593
vn 0.039854 -0.022023 -0.089032
vn 0.050000 0.000000 -0.086603
vn 0.059494 -0.025449 -0.076242
vn 0.070711 0.000000 -0.070711
vn 0.076242 -0.025449 -0.059494
vn 0.086603 0.000000 -0.050000
vn 0.089032 -0.022023 -0.039854
vn 0.100000 0.000000 0.000000
vn 0.098079 0.000000 -0.019509
vn 0.092388 0.000000 -0.038268
vn 0.083147 0.000000 -0.055557
vn 0.070711 0.000000 -0.070711
vn 0.055557 0.000000 -0.083147
vn 0.038268 0.000000 -0.092388
vn 0.019509 0.000000 -0.098079
vn 0.009802 0.000000 -0.099518
vn -0.000000 0.000000 -0.100000
vn 0.000000 0.025882 0.096593
vn 0.000000 0.000000 0.100000
vn 0.018574 0.015391 0.097047
vn 0.025882 0.000000 0.096593
vn 0.039854 0.022023 0.089032
vn 0.050000 0.000000 0.086603
vn 0.059494 0.025449 0.076242
vn 0.070711 0.000000 0.070711
vn 0.076242 0.025449 0.059494
vn 0.086603 0.000000 0.050000
vn 0.089032 0.022023 0.039854
vn 0.096593 0.000000 0.025882
vn 0.097047 0.015391 0.018574
vn 0.100000 0.000000 0.000000
vn 0.096593 0.025882 0.000000
vn 0.091750 0.038864 0.008453
vn 0.086603 0.050000 0.000000
vn 0.083242 0.045904 0.031041
vn 0.071780 0.066657 0.020112
vn 0.069666 0.049540 0.051888
vn 0.058343 0.070255 0.040746
vn 0.051888 0.049540 0.069666
vn 0.040746 0.070255 0.058343
vn 0.031041 0.045904 0.083242
vn 0.020112 0.066657 0.071780
vn 0.000000 0.050000 0.086603
vn 0.000000 0.070711 0.070711
vn 0.007813 0.082867 0.055426
vn 0.000000 0.086603 0.050000
vn 0.026828 0.086183 0.043044
vn 0.011081 0.096237 0.024811
vn 0.024811 0.096237 0.011081
vn 0.000000 0.100000 0.000000
vn 0.025882 0.096593 0.000000
vn 0.050000 0.086603 0.000000
vn 0.043044 0.086183 0.026828
vn 0.055426 0.082867 0.007813
vn 0.070711 0.070711 0.000000
vn 0.000000 0.096593 0.025882
vn 0.008453 0.038864 0.091750
vn -0.000000 0.100000 -0.000000
vn 0.009802 0.099518 0.000000
vn 0.019509 0.098079 0.000000
vn 0.038268 0.092388 0.000000
vn 0.055557 0.083147 0.000000
vn 0.070711 0.070711 0.000000
vn 0.083147 0.055557 0.000000
vn 0.092388 0.038268 0.000000
vn 0.098079 0.019509 0.000000
vn -0.096593 -0.025882 0.000000
vn -0.100000 0.000000 0.000000
vn -0.097047 -0.015391 -0.018574
vn -0.096593 0.000000 -0.025882
vn -0.089032 -0.022023 -0.039854
vn -0.086603 0.000000 -0.050000
vn -0.076242 -0.025449 -0.059494
vn -0.070711 0.000000 -0.070711
vn -0.059494 -0.025449 -0.076242
vn -0.050000 0.000000 -0.086603
vn -0.039854 -0.022023 -0.089032
vn -0.025882 0.000000 -0.096593
vn -0.018574 -0.015391 -0.097047
vn 0.000000 0.000000 -0.100000
vn 0.000000 -0.025882 -0.096593
vn -0.008453 -0.038864 -0.091750
vn 0.000000 -0.050000 -0.086603
vn -0.031041 -0.045904 -0.083242
vn -0.020112 -0.066657 -0.071780
vn -0.051888 -0.049540 -0.069666
vn -0.040746 -0.070255 -0.058343
vn -0.069666 -0.049540 -0.051888
vn -0.058343 -0.070255 -0.040746
vn -0.083242 -0.045904 -0.031041
vn -0.071780 -0.066657 -0.020112
vn -0.086603 -0.050000 0.000000
vn -0.070711 -0.070711 0.000000
vn -0.055426 -0.082867 -0.007813
vn -0.050000 -0.086603 0.000000
vn -0.043044 -0.086183 -0.026828
vn -0.024811 -0.096237 -0.011081
vn -0.011081 -0.096237 -0.024811
vn 0.000000 -0.100000 0.000000
vn 0.000000 -0.096593 -0.025882
vn 0.000000 -0.086603 -0.050000
vn -0.026828 -0.086183 -0.043044
vn -0.007813 -0.082867 -0.055426
vn 0.000000 -0.070711 -0.070711
vn -0.025882 -0.096593 0.000000
vn -0.091750 -0.038864 -0.008453
vn -0.000000 0.000000 -0.100000
vn -0.009802 0.000000 -0.099518
vn -0.019509 0.000000 -0.098079
vn -0.038268 0.000000 -0.092388
vn -0.055557 0.000000 -0.083147
vn -0.070711 0.000000 -0.070711
vn -0.083147 0.000000 -0.055557
vn -0.092388 0.000000 -0.038268
vn -0.098079 0.000000 -0.019509
vn -0.100000 0.000000 0.000000
vn -0.025882 0.000000 0.096593
vn 0.000000 0.000000 0.100000
vn -0.018574 0.015391 0.097047
vn 0.000000 0.025882 0.096593
vn -0.008453 0.038864 0.091750
vn 0.000000 0.050000 0.086603
vn -0.031041 0.045904 0.083242
vn -0.020112 0.066657 0.071780
vn -0.051888 0.049540 0.069666
vn -0.040746 0.070255 0.058343
vn -0.069666 0.049540 0.051888
vn -0.058343 0.070255 0.040746
vn -0.083242 0.045904 0.031041
vn -0.071780 0.066657 0.020112
vn -0.086603 0.050000 0.000000
vn -0.070711 0.070711 0.000000
vn -0.055426 0.082867 0.007813
vn -0.050000 0.086603 0.000000
vn -0.043044 0.086183 0.026828
vn -0.024811 0.096237 0.011081
vn -0.011081 0.096237 0.024811
vn 0.000000 0.100000 0.000000
vn 0.000000 0.096593 0.025882
vn 0.000000 0.086603 0.050000
vn -0.026828 0.086183 0.043044
vn -0.007813 0.082867 0.055426
vn 0.000000 0.070711 0.070711
vn -0.025882 0.096593 0.000000
vn -0.091750 0.038864 0.008453
vn -0.096593 0.025882 0.000000
vn -0.097047 0.015391 0.018574
vn -0.100000 0.000000 0.000000
vn -0.096593 0.000000 0.025882
vn -0.089032 0.022023 0.039854
vn -0.086603 0.000000 0.050000
vn -0.076242 0.025449 0.059494
vn -0.070711 0.000000 0.070711
vn -0.059494 0.025449 0.076242
vn -0.050000 0.000000 0.086603
vn -0.039854 0.022023 0.089032
vn -0.098079 0.019509 -0.000000
vn -0.092388 0.038268 -0.000000
vn -0.083147 0.055557 -0.000000
vn -0.070711 0.070711 -0.000000
vn -0.055557 0.083147 -0.000000
vn -0.038268 0.092388 -0.000000
vn -0.019509 0.098079 -0.000000
vn -0.009802 0.099518 -0.000000
vn -0.000000 0.100000 -0.000000
vn 0.025882 0.000000 0.096593
vn 0.000000 0.000000 0.100000
vn 0.018574 -0.015391 0.097047
vn 0.000000 -0.025882 0.096593
vn 0.008453 -0.038864 0.091750
vn 0.000000 -0.050000 0.086603
vn 0.031041 -0.045904 0.083242
vn 0.020112 -0.066657 0.071780
vn 0.051888 -0.049540 0.069666
vn 0.040746 -0.070255 0.058343
vn 0.069666 -0.049540 0.051888
vn 0.058343 -0.070255 0.040746
vn 0.083242 -0.045904 0.031041
vn 0.071780 -0.066657 0.020112
vn 0.086603 -0.050000 0.000000
vn 0.070711 -0.070711 0.000000
vn 0.055426 -0.082867 0.007813
vn 0.050000 -0.086603 0.000000
vn 0.043044 -0.086183 0.026828
vn 0.024811 -0.096237 0.011081
vn 0.011081 -0.096237 0.024811
vn 0.000000 -0.100000 0.000000
vn 0.000000 -0.096593 0.025882
vn 0.000000 -0.086603 0.050000
vn 0.026828 -0.086183 0.043044
vn 0.007813 -0.082867 0.055426
vn 0.000000 -0.070711 0.070711
vn 0.025882 -0.096593 0.000000
vn 0.091750 -0.038864 0.008453
vn 0.096593 -0.025882 0.000000
vn 0.097047 -0.015391 0.018574
vn 0.100000 0.000000 0.000000
vn 0.096593 0.000000 0.025882
vn 0.089032 -0.022023 0.039854
vn 0.086603 0.000000 0.050000
vn 0.076242 -0.025449 0.059494
vn 0.070711 0.000000 0.070711
vn 0.059494 -0.025449 0.076242
vn 0.050000 0.000000 0.086603
vn 0.039854 -0.022023 0.089032
vn 0.000000 -0.025882 0.096593
vn 0.000000 0.000000 0.100000
vn -0.018574 -0.015391 0.097047
vn -0.025882 0.000000 0.096593
vn -0.039854 -0.022023 0.089032
vn -0.050000 0.000000 0.086603
vn -0.059494 -0.025449 0.076242
vn -0.070711 0.000000 0.070711
vn -0.076242 -0.025449 0.059494
vn -0.086603 0.000000 0.050000
vn -0.089032 -0.022023 0.039854
vn -0.096593 0.000000 0.025882
vn -0.097047 -0.015391 0.018574
vn -0.100000 0.000000 0.000000
vn -0.096593 -0.025882 0.000000
vn -0.091750 -0.038864 0.008453
vn -0.086603 -0.050000 0.000000
vn -0.083242 -0.045904 0.031041
vn -0.071780 -0.066657 0.020112
vn -0.069666 -0.049540 0.051888
vn -0.058343 -0.070255 0.040746
vn -0.051888 -0.049540 0.069666
vn -0.040746 -0.070255 0.058343
vn -0.031041 -0.045904 0.083242
vn -0.020112 -0.066657 0.071780
vn 0.000000 -0.050000 0.086603
vn 0.000000 -0.070711 0.070711
vn -0.007813 -0.082867 0.055426
vn 0.000000 -0.086603 0.050000
vn -0.026828 -0.086183 0.043044
vn -0.011081 -0.096237 0.024811
vn -0.024811 -0.096237 0.011081
vn 0.000000 -0.100000 0.000000
vn -0.025882 -0.096593 0.000000
vn -0.050000 -0.086603 0.000000
vn -0.043044 -0.086183 0.026828
vn -0.055426 -0.082867 0.007813
vn -0.070711 -0.070711 0.000000
vn 0.000000 -0.096593 0.025882
vn -0.008453 -0.038864 0.091750
vn 0.000000 0.000000 0.100000
vn 0.000000 0.000000 0.100000
vn 0.000000 0.000000 0.100000
vn 0.000000 0.000000 0.100000
vn -0.019509 0.000000 0.098079
vn -0.019509 0.000000 0.098079
vn -0.038268 0.000000 0.092388
vn -0.038268 0.000000 0.092388
vn -0.055557 0.000000 0.083147
vn -0.055557 0.000000 0.083147
vn -0.070711 0.000000 0.070711
vn -0.070711 0.000000 0.070711
vn -0.083147 0.000000 0.055557
vn -0.083147 0.000000 0.055557
vn -0.092388 0.000000 0.038268
vn -0.092388 0.000000 0.038268
vn -0.098079 0.000000 0.019509
vn -0.098079 0.000000 0.019509
vn -0.099518 0.000000 0.009802
vn -0.099518 0.000000 0.009802
vn -0.100000 0.000000 0.000000
vn -0.100000 0.000000 0.000000
vn 0.000000 -0.019509 0.098079
vn 0.000000 -0.019509 0.098079
vn 0.000000 -0.038268 0.092388
vn 0.000000 -0.038268 0.092388
vn 0.000000 -0.055557 0.083147
vn 0.000000 -0.055557 0.083147
vn 0.000000 -0.070711 0.070711
vn 0.000000 -0.070711 0.070711
vn 0.000000 -0.083147 0.055557
vn 0.000000 -0.083147 0.055557
vn 0.000000 -0.092388 0.038268
vn 0.000000 -0.092388 0.038268
vn 0.000000 -0.098079 0.019509
vn 0.000000 -0.098079 0.019509
vn 0.000000 -0.099518 0.009802
vn 0.000000 -0.099518 0.009802
vn 0.000000 -0.100000 0.000000
vn 0.000000 -0.100000 0.000000
vn 0.100000 -0.000000 0.000000
vn 0.100000 -0.000000 0.000000
vn 0.099518 -0.000000 0.009802
vn 0.099518 -0.000000 0.009802
vn 0.098079 -0.000000 0.019509
vn 0.098079 -0.000000 0.019509
vn 0.092388 -0.000000 0.038268
vn 0.092388 -0.000000 0.038268
vn 0.083147 -0.000000 0.055557
vn 0.083147 -0.000000 0.055557
vn 0.070711 -0.000000 0.070711
vn 0.070711 -0.000000 0.070711
vn 0.055557 -0.000000 0.083147
vn 0.055557 -0.000000 0.083147
vn 0.038268 -0.000000 0.092388
vn 0.038268 -0.000000 0.092388
vn 0.019509 -0.000000 0.098079
vn 0.019509 -0.000000 0.098079
vn 0.000000 0.019509 0.098079
vn 0.000000 0.019509 0.098079
vn 0.000000 0.038268 0.092388
vn 0.000000 0.038268 0.092388
vn 0.000000 0.055557 0.083147
vn 0.000000 0.055557 0.083147
vn 0.000000 0.070711 0.070711
vn 0.000000 0.070711 0.070711
vn 0.000000 0.083147 0.055557
vn 0.000000 0.083147 0.055557
vn 0.000000 0.092388 0.038268
vn 0.000000 0.092388 0.038268
vn 0.000000 0.098079 0.019509
vn 0.000000 0.098079 0.019509
vn 0.000000 0.099518 0.009802
vn 0.000000 0.099518 0.009802
vn 0.000000 0.100000 0.000000
vn 0.000000 0.100000 0.000000
vn 0.000000 0.100000 0.000000
vn 0.000000 0.100000 0.000000
vn -0.100000 0.000000 0.000000
vn -0.100000 0.000000 0.000000
vn 0.000000 -0.100000 0.000000
vn 0.000000 -0.100000 0.000000
vn 0.100000 0.000000 0.000000
vn 0.100000 0.000000 0.000000
vn 0.000000 0.000000 0.100000
vn 0.000000 0.000000 0.100000
vn 0.000000 0.000000 0.100000
vn 0.000000 0.000000 0.100000
usemtl ABS_(White)
f 18/1/1 1/2/2 20/3/3
f 20/3/3 1/2/2 2/4/4
f 20/3/3 2/4/4 19/5/5
f 19/5/5 2/4/4 3/6/6
f 19/5/5 3/6/6 23/7/7
f 23/7/7 3/6/6 22/8/8
f 23/7/7 22/8/8 28/9/9
f 28/9/9 22/8/8 27/10/10
f 28/9/9 27/10/10 33/11/11
f 33/11/11 27/10/10 32/12/12
f 33/11/11 32/12/12 37/13/13
f 37/13/13 32/12/12 36/14/14
f 37/13/13 36/14/14 11/15/15
f 11/15/15 36/14/14 10/16/16
f 10/16/16 36/14/14 35/17/17
f 10/16/16 35/17/17 9/18/18
f 9/18/18 35/17/17 31/19/19
f 9/18/18 31/19/19 30/20/20
f 30/20/20 31/19/19 25/21/21
f 30/20/20 25/21/21 7/22/22
f 7/22/22 25/21/21 6/23/23
f 6/23/23 25/21/21 5/24/24
f 5/24/24 25/21/21 26/25/25
f 5/24/24 26/25/25 21/26/26
f 21/26/26 26/25/25 27/10/10
f 21/26/26 27/10/10 22/8/8
f 3/6/6 4/27/27 22/8/8
f 22/8/8 4/27/27 21/26/26
f 4/27/27 5/24/24 21/26/26
f 7/22/22 8/28/28 30/20/20
f 30/20/20 8/28/28 9/18/18
f 37/13/13 11/15/15 39/29/29
f 39/29/29 11/15/15 12/30/30
f 39/29/29 12/30/30 40/31/31
f 40/31/31 12/30/30 13/32/32
f 40/31/31 13/32/32 14/33/33
f 40/31/31 14/33/33 38/34/34
f 38/34/34 14/33/33 15/35/35
f 38/34/34 15/35/35 34/36/36
f 34/36/36 15/35/35 16/37/37
f 34/36/36 16/37/37 29/38/38
f 29/38/38 16/37/37 17/39/39
f 29/38/38 17/39/39 24/40/40
f 24/40/40 17/39/39 18/1/1
f 24/40/40 18/1/1 20/3/3
f 24/40/40 20/3/3 19/5/5
f 29/38/38 24/40/40 23/7/7
f 23/7/7 24/40/40 19/5/5
f 29/38/38 23/7/7 28/9/9
f 32/12/12 27/10/10 26/25/25
f 32/12/12 26/25/25 31/19/19
f 31/19/19 26/25/25 25/21/21
f 34/36/36 29/38/38 28/9/9
f 34/36/36 28/9/9 33/11/11
f 36/14/14 32/12/12 31/19/19
f 35/17/17 36/14/14 31/19/19
f 38/34/34 34/36/36 33/11/11
f 38/34/34 33/11/11 37/13/13
f 40/31/31 38/34/34 37/13/13
f 39/29/29 40/31/31 37/13/13
f 41/41/41 1/42/2 50/43/42
f 50/43/42 1/42/2 18/44/1
f 50/43/42 18/44/1 49/45/43
f 49/45/43 18/44/1 17/46/39
f 49/45/43 17/46/39 48/47/44
f 48/47/44 17/46/39 16/48/37
f 48/47/44 16/48/37 47/49/45
f 47/49/45 16/48/37 46/50/46
f 46/50/46 16/48/37 15/51/35
f 46/50/46 15/51/35 45/52/47
f 45/52/47 15/51/35 14/53/33
f 45/52/47 14/53/33 44/54/48
f 44/54/48 14/53/33 43/55/49
f 43/55/49 14/53/33 13/56/32
f 43/55/49 13/56/32 42/57/50
f 68/58/51 51/59/52 69/60/53
f 69/60/53 51/59/52 52/61/54
f 69/60/53 52/61/54 71/62/55
f 71/62/55 52/61/54 53/63/56
f 71/62/55 53/63/56 75/64/57
f 75/64/57 53/63/56 54/65/58
f 75/64/57 54/65/58 80/66/59
f 80/66/59 54/65/58 55/67/60
f 80/66/59 55/67/60 85/68/61
f 85/68/61 55/67/60 56/69/62
f 85/68/61 56/69/62 89/70/63
f 89/70/63 56/69/62 57/71/64
f 89/70/63 57/71/64 58/72/65
f 89/70/63 58/72/65 90/73/66
f 90/73/66 58/72/65 59/74/67
f 90/73/66 59/74/67 86/75/68
f 86/75/68 59/74/67 87/76/69
f 86/75/68 87/76/69 81/77/70
f 81/77/70 87/76/69 82/78/71
f 81/77/70 82/78/71 76/79/72
f 76/79/72 82/78/71 77/80/73
f 76/79/72 77/80/73 72/81/74
f 72/81/74 77/80/73 73/82/75
f 72/81/74 73/82/75 67/83/76
f 67/83/76 73/82/75 66/84/77
f 66/84/77 73/82/75 74/85/78
f 66/84/77 74/85/78 65/86/79
f 65/86/79 74/85/78 78/87/80
f 65/86/79 78/87/80 79/88/81
f 79/88/81 78/87/80 84/89/82
f 79/88/81 84/89/82 63/90/83
f 63/90/83 84/89/82 62/91/84
f 62/91/84 84/89/82 61/92/85
f 61/92/85 84/89/82 83/93/86
f 61/92/85 83/93/86 88/94/87
f 88/94/87 83/93/86 82/78/71
f 88/94/87 82/78/71 87/76/69
f 59/74/67 60/95/88 87/76/69
f 87/76/69 60/95/88 88/94/87
f 60/95/88 61/92/85 88/94/87
f 63/90/83 64/96/89 79/88/81
f 79/88/81 64/96/89 65/86/79
f 72/81/74 67/83/76 70/97/90
f 70/97/90 67/83/76 68/58/51
f 70/97/90 68/58/51 69/60/53
f 72/81/74 70/97/90 69/60/53
f 76/79/72 72/81/74 71/62/55
f 71/62/55 72/81/74 69/60/53
f 78/87/80 74/85/78 73/82/75
f 78/87/80 73/82/75 77/80/73
f 81/77/70 76/79/72 75/64/57
f 75/64/57 76/79/72 71/62/55
f 82/78/71 83/93/86 77/80/73
f 77/80/73 83/93/86 78/87/80
f 83/93/86 84/89/82 78/87/80
f 86/75/68 81/77/70 80/66/59
f 80/66/59 81/77/70 75/64/57
f 90/73/66 86/75/68 85/68/61
f 85/68/61 86/75/68 80/66/59
f 89/70/63 90/73/66 85/68/61
f 42/98/91 63/99/83 43/100/92
f 43/100/92 63/99/83 62/101/84
f 43/100/92 62/101/84 44/102/93
f 44/102/93 62/101/84 45/103/94
f 45/103/94 62/101/84 61/104/85
f 45/103/94 61/104/85 46/105/95
f 46/105/95 61/104/85 60/106/88
f 46/105/95 60/106/88 47/107/96
f 47/107/96 60/106/88 48/108/97
f 48/108/97 60/106/88 59/109/67
f 48/108/97 59/109/67 49/110/98
f 49/110/98 59/109/67 58/111/65
f 49/110/98 58/111/65 50/112/99
f 50/112/99 58/111/65 57/113/64
f 50/112/99 57/113/64 41/114/41
f 108/115/100 91/116/101 109/117/102
f 109/117/102 91/116/101 92/118/103
f 109/117/102 92/118/103 111/119/104
f 111/119/104 92/118/103 93/120/105
f 111/119/104 93/120/105 115/121/106
f 115/121/106 93/120/105 94/122/107
f 115/121/106 94/122/107 120/123/108
f 120/123/108 94/122/107 95/124/109
f 120/123/108 95/124/109 125/125/110
f 125/125/110 95/124/109 96/126/111
f 125/125/110 96/126/111 129/127/112
f 129/127/112 96/126/111 97/128/113
f 129/127/112 97/128/113 98/129/114
f 129/127/112 98/129/114 130/130/115
f 130/130/115 98/129/114 99/131/116
f 130/130/115 99/131/116 126/132/117
f 126/132/117 99/131/116 127/133/118
f 126/132/117 127/133/118 121/134/119
f 121/134/119 127/133/118 122/135/120
f 121/134/119 122/135/120 116/136/121
f 116/136/121 122/135/120 117/137/122
f 116/136/121 117/137/122 112/138/123
f 112/138/123 117/137/122 113/139/124
f 112/138/123 113/139/124 107/140/125
f 107/140/125 113/139/124 106/141/126
f 106/141/126 113/139/124 114/142/127
f 106/141/126 114/142/127 105/143/128
f 105/143/128 114/142/127 118/144/129
f 105/143/128 118/144/129 119/145/130
f 119/145/130 118/144/129 124/146/131
f 119/145/130 124/146/131 103/147/132
f 103/147/132 124/146/131 102/148/133
f 102/148/133 124/146/131 101/149/134
f 101/149/134 124/146/131 123/150/135
f 101/149/134 123/150/135 128/151/136
f 128/151/136 123/150/135 122/135/120
f 128/151/136 122/135/120 127/133/118
f 99/131/116 100/152/137 127/133/118
f 127/133/118 100/152/137 128/151/136
f 100/152/137 101/149/134 128/151/136
f 103/147/132 104/153/138 119/145/130
f 119/145/130 104/153/138 105/143/128
f 112/138/123 107/140/125 110/154/139
f 110/154/139 107/140/125 108/115/100
f 110/154/139 108/115/100 109/117/102
f 112/138/123 110/154/139 109/117/102
f 116/136/121 112/138/123 111/119/104
f 111/119/104 112/138/123 109/117/102
f 118/144/129 114/142/127 113/139/124
f 118/144/129 113/139/124 117/137/122
f 121/134/119 116/136/121 115/121/106
f 115/121/106 116/136/121 111/119/104
f 122/135/120 123/150/135 117/137/122
f 117/137/122 123/150/135 118/144/129
f 123/150/135 124/146/131 118/144/129
f 126/132/117 121/134/119 120/123/108
f 120/123/108 121/134/119 115/121/106
f 130/130/115 126/132/117 125/125/110
f 125/125/110 126/132/117 120/123/108
f 129/127/112 130/130/115 125/125/110
f 7/155/22 103/156/132 8/157/28
f 8/157/28 103/156/132 102/158/133
f 8/157/28 102/158/133 9/159/18
f 9/159/18 102/158/133 101/160/134
f 9/159/18 101/160/134 10/161/16
f 10/161/16 101/160/134 100/162/137
f 10/161/16 100/162/137 11/163/15
f 11/163/15 100/162/137 99/164/116
f 11/163/15 99/164/116 12/165/30
f 12/165/30 99/164/116 98/166/114
f 12/165/30 98/166/114 13/167/32
f 13/167/32 98/166/114 97/168/113
f 131/169/140 97/170/113 140/171/141
f 140/171/141 97/170/113 96/172/111
f 140/171/141 96/172/111 139/173/142
f 139/173/142 96/172/111 138/174/143
f 138/174/143 96/172/111 95/175/109
f 138/174/143 95/175/109 137/176/144
f 137/176/144 95/175/109 94/177/107
f 137/176/144 94/177/107 136/178/145
f 136/178/145 94/177/107 135/179/146
f 135/179/146 94/177/107 93/180/105
f 135/179/146 93/180/105 134/181/147
f 134/181/147 93/180/105 92/182/103
f 134/181/147 92/182/103 133/183/148
f 133/183/148 92/182/103 91/184/101
f 133/183/148 91/184/101 132/185/149
f 158/186/150 141/187/151 161/188/152
f 161/188/152 141/187/151 142/189/153
f 161/188/152 142/189/153 160/190/154
f 160/190/154 142/189/153 143/191/155
f 160/190/154 143/191/155 164/192/156
f 164/192/156 143/191/155 163/193/157
f 164/192/156 163/193/157 169/194/158
f 169/194/158 163/193/157 168/195/159
f 169/194/158 168/195/159 174/196/160
f 174/196/160 168/195/159 173/197/161
f 174/196/160 173/197/161 178/198/162
f 178/198/162 173/197/161 177/199/163
f 178/198/162 177/199/163 151/200/164
f 151/200/164 177/199/163 150/201/165
f 150/201/165 177/199/163 176/202/166
f 150/201/165 176/202/166 149/203/167
f 149/203/167 176/202/166 172/204/168
f 149/203/167 172/204/168 171/205/169
f 171/205/169 172/204/168 166/206/170
f 171/205/169 166/206/170 147/207/171
f 147/207/171 166/206/170 146/208/172
f 146/208/172 166/206/170 145/209/173
f 145/209/173 166/206/170 167/210/174
f 145/209/173 167/210/174 162/211/175
f 162/211/175 167/210/174 168/195/159
f 162/211/175 168/195/159 163/193/157
f 143/191/155 144/212/176 163/193/157
f 163/193/157 144/212/176 162/211/175
f 144/212/176 145/209/173 162/211/175
f 147/207/171 148/213/177 171/205/169
f 171/205/169 148/213/177 149/203/167
f 178/198/162 151/200/164 180/214/178
f 180/214/178 151/200/164 152/215/179
f 180/214/178 152/215/179 159/216/180
f 159/216/180 152/215/179 153/217/181
f 159/216/180 153/217/181 154/218/182
f 159/216/180 154/218/182 179/219/183
f 179/219/183 154/218/182 155/220/184
f 179/219/183 155/220/184 175/221/185
f 175/221/185 155/220/184 156/222/186
f 175/221/185 156/222/186 170/223/187
f 170/223/187 156/222/186 157/224/188
f 170/223/187 157/224/188 165/225/189
f 165/225/189 157/224/188 158/186/150
f 165/225/189 158/186/150 161/188/152
f 165/225/189 161/188/152 160/190/154
f 170/223/187 165/225/189 164/192/156
f 164/192/156 165/225/189 160/190/154
f 170/223/187 164/192/156 169/194/158
f 173/197/161 168/195/159 167/210/174
f 173/197/161 167/210/174 172/204/168
f 172/204/168 167/210/174 166/206/170
f 175/221/185 170/223/187 169/194/158
f 175/221/185 169/194/158 174/196/160
f 177/199/163 173/197/161 172/204/168
f 176/202/166 177/199/163 172/204/168
f 179/219/183 175/221/185 174/196/160
f 179/219/183 174/196/160 178/198/162
f 159/216/180 179/219/183 178/198/162
f 180/214/178 159/216/180 178/198/162
f 132/226/149 153/227/181 133/228/190
f 133/228/190 153/227/181 152/229/179
f 133/228/190 152/229/179 134/230/191
f 134/230/191 152/229/179 151/231/164
f 134/230/191 151/231/164 135/232/192
f 135/232/192 151/231/164 150/233/165
f 135/232/192 150/233/165 136/234/193
f 136/234/193 150/233/165 137/235/194
f 137/235/194 150/233/165 149/236/167
f 137/235/194 149/236/167 138/237/195
f 138/237/195 149/236/167 148/238/177
f 138/237/195 148/238/177 139/239/196
f 139/239/196 148/238/177 140/240/197
f 140/240/197 148/238/177 147/241/171
f 140/240/197 147/241/171 131/242/198
f 198/243/199 181/244/200 200/245/201
f 200/245/201 181/244/200 182/246/202
f 200/245/201 182/246/202 199/247/203
f 199/247/203 182/246/202 183/248/204
f 199/247/203 183/248/204 203/249/205
f 203/249/205 183/248/204 202/250/206
f 203/249/205 202/250/206 208/251/207
f 208/251/207 202/250/206 207/252/208
f 208/251/207 207/252/208 213/253/209
f 213/253/209 207/252/208 212/254/210
f 213/253/209 212/254/210 217/255/211
f 217/255/211 212/254/210 216/256/212
f 217/255/211 216/256/212 191/257/213
f 191/257/213 216/256/212 190/258/214
f 190/258/214 216/256/212 215/259/215
f 190/258/214 215/259/215 189/260/216
f 189/260/216 215/259/215 211/261/217
f 189/260/216 211/261/217 210/262/218
f 210/262/218 211/261/217 205/263/219
f 210/262/218 205/263/219 187/264/220
f 187/264/220 205/263/219 186/265/221
f 186/265/221 205/263/219 185/266/222
f 185/266/222 205/263/219 206/267/223
f 185/266/222 206/267/223 201/268/224
f 201/268/224 206/267/223 207/252/208
f 201/268/224 207/252/208 202/250/206
f 183/248/204 184/269/225 202/250/206
f 202/250/206 184/269/225 201/268/224
f 184/269/225 185/266/222 201/268/224
f 187/264/220 188/270/226 210/262/218
f 210/262/218 188/270/226 189/260/216
f 217/255/211 191/257/213 219/271/227
f 219/271/227 191/257/213 192/272/228
f 219/271/227 192/272/228 220/273/229
f 220/273/229 192/272/228 193/274/230
f 220/273/229 193/274/230 194/275/231
f 220/273/229 194/275/231 218/276/232
f 218/276/232 194/275/231 195/277/233
f 218/276/232 195/277/233 214/278/234
f 214/278/234 195/277/233 196/279/235
f 214/278/234 196/279/235 209/280/236
f 209/280/236 196/279/235 197/281/237
f 209/280/236 197/281/237 204/282/238
f 204/282/238 197/281/237 198/243/199
f 204/282/238 198/243/199 200/245/201
f 204/282/238 200/245/201 199/247/203
f 209/280/236 204/282/238 203/249/205
f 203/249/205 204/282/238 199/247/203
f 209/280/236 203/249/205 208/251/207
f 212/254/210 207/252/208 206/267/223
f 212/254/210 206/267/223 211/261/217
f 211/261/217 206/267/223 205/263/219
f 214/278/234 209/280/236 208/251/207
f 214/278/234 208/251/207 213/253/209
f 216/256/212 212/254/210 211/261/217
f 215/259/215 216/256/212 211/261/217
f 218/276/232 214/278/234 213/253/209
f 218/276/232 213/253/209 217/255/211
f 220/273/229 218/276/232 217/255/211
f 219/271/227 220/273/229 217/255/211
f 1/283/2 193/284/230 2/285/4
f 2/285/4 193/284/230 192/286/228
f 2/285/4 192/286/228 3/287/6
f 3/287/6 192/286/228 191/288/213
f 3/287/6 191/288/213 4/289/27
f 4/289/27 191/288/213 190/290/214
f 4/289/27 190/290/214 5/291/24
f 5/291/24 190/290/214 189/292/216
f 5/291/24 189/292/216 6/293/23
f 6/293/23 189/292/216 188/294/226
f 6/293/23 188/294/226 7/295/22
f 7/295/22 188/294/226 187/296/220
f 193/297/230 57/298/64 194/299/231
f 194/299/231 57/298/64 56/300/62
f 194/299/231 56/300/62 195/301/233
f 195/301/233 56/300/62 55/302/60
f 195/301/233 55/302/60 196/303/235
f 196/303/235 55/302/60 54/304/58
f 196/303/235 54/304/58 197/305/237
f 197/305/237 54/304/58 53/306/56
f 197/305/237 53/306/56 198/307/199
f 198/307/199 53/306/56 52/308/54
f 198/307/199 52/308/54 181/309/200
f 181/309/200 52/308/54 51/310/52
f 238/311/239 221/312/240 239/313/241
f 239/313/241 221/312/240 222/314/242
f 239/313/241 222/314/242 241/315/243
f 241/315/243 222/314/242 223/316/244
f 241/315/243 223/316/244 245/317/245
f 245/317/245 223/316/244 224/318/246
f 245/317/245 224/318/246 250/319/247
f 250/319/247 224/318/246 225/320/248
f 250/319/247 225/320/248 255/321/249
f 255/321/249 225/320/248 226/322/250
f 255/321/249 226/322/250 259/323/251
f 259/323/251 226/322/250 227/324/252
f 259/323/251 227/324/252 228/325/253
f 259/323/251 228/325/253 260/326/254
f 260/326/254 228/325/253 229/327/255
f 260/326/254 229/327/255 256/328/256
f 256/328/256 229/327/255 257/329/257
f 256/328/256 257/329/257 251/330/258
f 251/330/258 257/329/257 252/331/259
f 251/330/258 252/331/259 246/332/260
f 246/332/260 252/331/259 247/333/261
f 246/332/260 247/333/261 242/334/262
f 242/334/262 247/333/261 243/335/263
f 242/334/262 243/335/263 237/336/264
f 237/336/264 243/335/263 236/337/265
f 236/337/265 243/335/263 244/338/266
f 236/337/265 244/338/266 235/339/267
f 235/339/267 244/338/266 248/340/268
f 235/339/267 248/340/268 249/341/269
f 249/341/269 248/340/268 254/342/270
f 249/341/269 254/342/270 233/343/271
f 233/343/271 254/342/270 232/344/272
f 232/344/272 254/342/270 231/345/273
f 231/345/273 254/342/270 253/346/274
f 231/345/273 253/346/274 258/347/275
f 258/347/275 253/346/274 252/331/259
f 258/347/275 252/331/259 257/329/257
f 229/327/255 230/348/276 257/329/257
f 257/329/257 230/348/276 258/347/275
f 230/348/276 231/345/273 258/347/275
f 233/343/271 234/349/277 249/341/269
f 249/341/269 234/349/277 235/339/267
f 242/334/262 237/336/264 240/350/278
f 240/350/278 237/336/264 238/311/239
f 240/350/278 238/311/239 239/313/241
f 242/334/262 240/350/278 239/313/241
f 246/332/260 242/334/262 241/315/243
f 241/315/243 242/334/262 239/313/241
f 248/340/268 244/338/266 243/335/263
f 248/340/268 243/335/263 247/333/261
f 251/330/258 246/332/260 245/317/245
f 245/317/245 246/332/260 241/315/243
f 252/331/259 253/346/274 247/333/261
f 247/333/261 253/346/274 248/340/268
f 253/346/274 254/342/270 248/340/268
f 256/328/256 251/330/258 250/319/247
f 250/319/247 251/330/258 245/317/245
f 260/326/254 256/328/256 255/321/249
f 255/321/249 256/328/256 250/319/247
f 259/323/251 260/326/254 255/321/249
f 103/351/132 233/352/271 104/353/138
f 104/353/138 233/352/271 232/354/272
f 104/353/138 232/354/272 105/355/128
f 105/355/128 232/354/272 231/356/273
f 105/355/128 231/356/273 106/357/126
f 106/357/126 231/356/273 230/358/276
f 106/357/126 230/358/276 107/359/125
f 107/359/125 230/358/276 229/360/255
f 107/359/125 229/360/255 108/361/100
f 108/361/100 229/360/255 228/362/253
f 108/361/100 228/362/253 91/363/101
f 91/363/101 228/362/253 227/364/252
f 233/365/271 187/366/220 234/367/277
f 234/367/277 187/366/220 186/368/221
f 234/367/277 186/368/221 235/369/267
f 235/369/267 186/368/221 185/370/222
f 235/369/267 185/370/222 236/371/265
f 236/371/265 185/370/222 184/372/225
f 236/371/265 184/372/225 237/373/264
f 237/373/264 184/372/225 183/374/204
f 237/373/264 183/374/204 238/375/239
f 238/375/239 183/374/204 182/376/202
f 238/375/239 182/376/202 221/377/240
f 221/377/240 182/376/202 181/378/200
f 153/379/181 227/380/252 154/381/182
f 154/381/182 227/380/252 226/382/250
f 154/381/182 226/382/250 155/383/184
f 155/383/184 226/382/250 225/384/248
f 155/383/184 225/384/248 156/385/186
f 156/385/186 225/384/248 224/386/246
f 156/385/186 224/386/246 157/387/188
f 157/387/188 224/386/246 223/388/244
f 157/387/188 223/388/244 158/389/150
f 158/389/150 223/388/244 222/390/242
f 158/389/150 222/390/242 141/391/151
f 141/391/151 222/390/242 221/392/240
f 63/393/83 147/394/171 64/395/89
f 64/395/89 147/394/171 146/396/172
f 64/395/89 146/396/172 65/397/79
f 65/397/79 146/396/172 145/398/173
f 65/397/79 145/398/173 66/399/77
f 66/399/77 145/398/173 144/400/176
f 66/399/77 144/400/176 67/401/76
f 67/401/76 144/400/176 143/402/155
f 67/401/76 143/402/155 68/403/51
f 68/403/51 143/402/155 142/404/153
f 68/403/51 142/404/153 51/405/52
f 51/405/52 142/404/153 141/406/151
f 147/407/171 63/408/83 131/409/198
f 131/409/198 63/408/83 42/410/91
f 1/411/2 41/412/41 193/413/230
f 193/413/230 41/412/41 57/414/64
f 103/415/132 7/416/22 233/417/271
f 233/417/271 7/416/22 187/418/220
f 132/419/149 91/420/101 153/421/181
f 153/421/181 91/420/101 227/422/252
f 262/423/279 181/424/200 261/425/280
f 261/425/280 181/424/200 51/426/52
f 261/425/280 51/426/52 141/427/151
f 181/424/200 262/423/279 221/428/240
f 221/428/240 262/423/279 263/429/281
f 221/428/240 263/429/281 264/430/282
f 221/428/240 264/430/282 141/427/151
f 141/427/151 264/430/282 261/425/280
f 262/431/279 261/432/280 282/433/283
f 282/433/283 261/432/280 265/434/284
f 282/433/283 265/434/284 266/435/285
f 282/433/283 266/435/285 281/436/286
f 281/436/286 266/435/285 267/437/287
f 281/436/286 267/437/287 280/438/288
f 280/438/288 267/437/287 279/439/289
f 279/439/289 267/437/287 268/440/290
f 279/439/289 268/440/290 278/441/291
f 278/441/291 268/440/290 269/442/292
f 278/441/291 269/442/292 270/443/293
f 278/441/291 270/443/293 277/444/294
f 277/444/294 270/443/293 271/445/295
f 277/444/294 271/445/295 276/446/296
f 276/446/296 271/445/295 275/447/297
f 275/447/297 271/445/295 272/448/298
f 275/447/297 272/448/298 274/449/299
f 274/449/299 272/448/298 273/450/300
f 261/451/280 264/452/282 265/453/301
f 265/453/301 264/452/282 283/454/302
f 265/453/301 283/454/302 284/455/303
f 265/453/301 284/455/303 266/456/304
f 266/456/304 284/455/303 285/457/305
f 266/456/304 285/457/305 267/458/306
f 267/458/306 285/457/305 268/459/307
f 268/459/307 285/457/305 286/460/308
f 268/459/307 286/460/308 269/461/309
f 269/461/309 286/460/308 287/462/310
f 269/461/309 287/462/310 288/463/311
f 269/461/309 288/463/311 270/464/312
f 270/464/312 288/463/311 289/465/313
f 270/464/312 289/465/313 271/466/314
f 271/466/314 289/465/313 272/467/315
f 272/467/315 289/465/313 290/468/316
f 272/467/315 290/468/316 273/469/317
f 273/469/317 290/468/316 291/470/318
f 292/471/319 291/472/320 300/473/321
f 300/473/321 291/472/320 290/474/322
f 300/473/321 290/474/322 299/475/323
f 299/475/323 290/474/322 289/476/324
f 299/475/323 289/476/324 288/477/325
f 299/475/323 288/477/325 298/478/326
f 298/478/326 288/477/325 287/479/327
f 298/478/326 287/479/327 297/480/328
f 297/480/328 287/479/327 296/481/329
f 296/481/329 287/479/327 286/482/330
f 296/481/329 286/482/330 295/483/331
f 295/483/331 286/482/330 285/484/332
f 295/483/331 285/484/332 284/485/333
f 295/483/331 284/485/333 294/486/334
f 294/486/334 284/485/333 283/487/335
f 294/486/334 283/487/335 293/488/336
f 293/488/336 283/487/335 263/489/281
f 263/489/281 283/487/335 264/490/282
f 263/491/281 262/492/279 293/493/337
f 293/493/337 262/492/279 282/494/338
f 293/493/337 282/494/338 281/495/339
f 293/493/337 281/495/339 294/496/340
f 294/496/340 281/495/339 280/497/341
f 294/496/340 280/497/341 295/498/342
f 295/498/342 280/497/341 296/499/343
f 296/499/343 280/497/341 279/500/344
f 296/499/343 279/500/344 297/501/345
f 297/501/345 279/500/344 278/502/346
f 297/501/345 278/502/346 277/503/347
f 297/501/345 277/503/347 298/504/348
f 298/504/348 277/503/347 276/505/349
f 298/504/348 276/505/349 299/506/350
f 299/506/350 276/505/349 300/507/351
f 300/507/351 276/505/349 275/508/352
f 300/507/351 275/508/352 292/509/353
f 292/509/353 275/508/352 274/510/354
f 292/511/353 274/512/354 302/513/355
f 302/513/355 274/512/354 301/514/356
f 274/515/299 273/516/300 301/517/357
f 301/517/357 273/516/300 303/518/358
f 273/519/317 291/520/318 303/521/359
f 303/521/359 291/520/318 304/522/360
f 291/523/320 292/524/319 304/525/361
f 304/525/361 292/524/319 302/526/362
f 302/527/363 301/528/364 304/529/365
f 304/529/365 301/528/364 303/530/366
f 131/531/140 42/532/50 97/533/113
f 97/533/113 42/532/50 13/534/32
g Body6

v 0.000000 10.000000 15.863050
v -0.224011 10.000000 17.801608
v -0.884237 10.000000 19.637987
v -1.945878 10.000000 21.275396
v -3.352978 10.000000 22.627527
v -5.031369 10.000000 23.623114
v -6.892586 10.000000 24.209679
v -8.838528 10.000000 24.356306
v -10.766626 10.000000 24.055266
v -12.575254 10.000000 23.322426
v -14.169082 10.000000 22.196415
v -15.464100 10.000000 20.736581
v -16.392052 10.000000 19.019870
v -16.392052 -50.000000 19.019870
v -15.464100 -50.000000 20.736581
v -14.169082 -50.000000 22.196415
v -12.575254 -50.000000 23.322426
v -10.766626 -50.000000 24.055266
v -8.838528 -50.000000 24.356306
v -6.892586 -50.000000 24.209679
v -5.031369 -50.000000 23.623114
v -3.352978 -50.000000 22.627527
v -1.945878 -50.000000 21.275396
v -0.884237 -50.000000 19.637987
v -0.224011 -50.000000 17.801608
v 0.000000 -50.000000 15.863050
v -20.000000 -50.000000 10.000000
v 0.000000 -50.000000 10.000000
v -20.000000 10.000000 10.000000
v 0.000000 10.000000 10.000000
vt -0.000000 1.173462 0.000000
vt -6.000000 1.173462 0.000000
vt -0.000000 0.977885 0.000000
vt -6.000000 0.977885 0.000000
vt -0.000000 0.782308 0.000000
vt -6.000000 0.782308 0.000000
vt -0.000000 0.586731 0.000000
vt -6.000000 0.586731 0.000000
vt -0.000000 0.391154 0.000000
vt -6.000000 0.391154 0.000000
vt -0.000000 0.195577 0.000000
vt -6.000000 0.195577 0.000000
vt -0.000000 0.000000 0.000000
vt -6.000000 0.000000 0.000000
vt -0.000000 -0.195577 0.000000
vt -6.000000 -0.195577 0.000000
vt -0.000000 -0.391154 0.000000
vt -6.000000 -0.391154 0.000000
vt -0.000000 -0.586731 0.000000
vt -6.000000 -0.586731 0.000000
vt -0.000000 -0.782308 0.000000
vt -6.000000 -0.782308 0.000000
vt -0.000000 -0.977885 0.000000
vt -6.000000 -0.977885 0.000000
vt -0.000000 -1.173462 0.000000
vt -6.000000 -1.173462 0.000000
vt 1.977599 0.780161 0.000000
vt 0.360795 0.901987 0.000000
vt 2.000000 0.586305 0.000000
vt 0.000000 0.000000 0.000000
vt 2.000000 0.000000 0.000000
vt 1.911576 0.963799 0.000000
vt 0.453590 1.073658 0.000000
vt 1.805412 1.127540 0.000000
vt 0.583092 1.219641 0.000000
vt 1.664702 1.262753 0.000000
vt 0.742475 1.332243 0.000000
vt 1.496863 1.362311 0.000000
vt 0.923337 1.405527 0.000000
vt 1.310741 1.420968 0.000000
vt 1.116147 1.435631 0.000000
vt -0.971470 -6.000000 0.000000
vt -0.000000 -6.000000 0.000000
vt -0.971470 0.000000 0.000000
vt -0.000000 0.000000 0.000000
vt 1.546410 1.073658 0.000000
vt 0.088424 0.963799 0.000000
vt 1.639205 0.901987 0.000000
vt 0.022401 0.780161 0.000000
vt -0.000000 0.586305 0.000000
vt 0.194588 1.127540 0.000000
vt 1.416908 1.219641 0.000000
vt 0.335298 1.262753 0.000000
vt 1.257525 1.332243 0.000000
vt 0.503137 1.362311 0.000000
vt 1.076663 1.405527 0.000000
vt 0.689259 1.420968 0.000000
vt 0.883853 1.435631 0.000000
vt -0.000000 0.000000 0.000000
vt 2.000000 0.000000 0.000000
vt 6.000000 0.586305 0.000000
vt 0.000000 0.586305 0.000000
vt 6.000000 0.000000 0.000000
vt 0.000000 0.000000 0.000000
vt 1.000000 3.000000 0.000000
vt -1.000000 3.000000 0.000000
vt 1.000000 -3.000000 0.000000
vt -1.000000 -3.000000 0.000000
vn 0.100000 0.000000 -0.000000
vn 0.100000 0.000000 -0.000000
vn 0.097365 -0.000000 0.022807
vn 0.097365 -0.000000 0.022807
vn 0.089597 -0.000000 0.044411
vn 0.089597 -0.000000 0.044411
vn 0.077107 -0.000000 0.063675
vn 0.077107 -0.000000 0.063675
vn 0.060553 -0.000000 0.079582
vn 0.060553 -0.000000 0.079582
vn 0.040807 -0.000000 0.091295
vn 0.040807 -0.000000 0.091295
vn 0.018911 -0.000000 0.098196
vn 0.018911 -0.000000 0.098196
vn -0.003983 0.000000 0.099921
vn -0.003983 0.000000 0.099921
vn -0.026666 0.000000 0.096379
vn -0.026666 0.000000 0.096379
vn -0.047944 0.000000 0.087757
vn -0.047944 0.000000 0.087757
vn -0.066695 0.000000 0.074510
vn -0.066695 0.000000 0.074510
vn -0.081931 0.000000 0.057336
vn -0.081931 0.000000 0.057336
vn -0.092848 0.000000 0.037139
vn -0.092848 0.000000 0.037139
vn 0.000000 -0.100000 0.000000
vn 0.000000 -0.100000 0.000000
vn 0.000000 -0.100000 0.000000
vn 0.000000 -0.100000 0.000000
vn 0.000000 -0.100000 0.000000
vn 0.000000 -0.100000 0.000000
vn 0.000000 -0.100000 0.000000
vn 0.000000 -0.100000 0.000000
vn 0.000000 -0.100000 0.000000
vn 0.000000 -0.100000 0.000000
vn 0.000000 -0.100000 0.000000
vn 0.000000 -0.100000 0.000000
vn 0.000000 -0.100000 0.000000
vn 0.000000 -0.100000 0.000000
vn 0.000000 -0.100000 0.000000
vn -0.092848 0.000000 0.037139
vn -0.092848 0.000000 0.037139
vn 0.000000 0.100000 0.000000
vn 0.000000 0.100000 0.000000
vn 0.000000 0.100000 0.000000
vn 0.000000 0.100000 0.000000
vn 0.000000 0.100000 0.000000
vn 0.000000 0.100000 0.000000
vn 0.000000 0.100000 0.000000
vn 0.000000 0.100000 0.000000
vn 0.000000 0.100000 0.000000
vn 0.000000 0.100000 0.000000
vn 0.000000 0.100000 0.000000
vn 0.000000 0.100000 0.000000
vn 0.000000 0.100000 0.000000
vn 0.000000 0.100000 0.000000
vn 0.000000 0.100000 0.000000
vn 0.100000 0.000000 0.000000
vn 0.100000 0.000000 0.000000
vn 0.000000 0.000000 -0.100000
vn 0.000000 0.000000 -0.100000
vn 0.000000 0.000000 -0.100000
vn 0.000000 0.000000 -0.100000
usemtl ABS_(White)_1
f 330/535/367 305/536/368 329/537/369
f 329/537/369 305/536/368 306/538/370
f 329/537/369 306/538/370 328/539/371
f 328/539/371 306/538/370 307/540/372
f 328/539/371 307/540/372 327/541/373
f 327/541/373 307/540/372 308/542/374
f 327/541/373 308/542/374 326/543/375
f 326/543/375 308/542/374 309/544/376
f 326/543/375 309/544/376 325/545/377
f 325/545/377 309/544/376 310/546/378
f 325/545/377 310/546/378 324/547/379
f 324/547/379 310/546/378 311/548/380
f 324/547/379 311/548/380 323/549/381
f 323/549/381 311/548/380 312/550/382
f 323/549/381 312/550/382 322/551/383
f 322/551/383 312/550/382 313/552/384
f 322/551/383 313/552/384 321/553/385
f 321/553/385 313/552/384 314/554/386
f 321/553/385 314/554/386 320/555/387
f 320/555/387 314/554/386 315/556/388
f 320/555/387 315/556/388 319/557/389
f 319/557/389 315/556/388 316/558/390
f 319/557/389 316/558/390 318/559/391
f 318/559/391 316/558/390 317/560/392
f 329/561/393 318/562/394 330/563/395
f 330/563/395 318/562/394 331/564/396
f 330/563/395 331/564/396 332/565/397
f 329/561/393 328/566/398 318/562/394
f 318/562/394 328/566/398 319/567/399
f 319/567/399 328/566/398 327/568/400
f 319/567/399 327/568/400 320/569/401
f 320/569/401 327/568/400 326/570/402
f 320/569/401 326/570/402 321/571/403
f 321/571/403 326/570/402 325/572/404
f 321/571/403 325/572/404 322/573/405
f 322/573/405 325/572/404 324/574/406
f 322/573/405 324/574/406 323/575/407
f 317/576/392 333/577/408 318/578/391
f 318/578/391 333/577/408 331/579/409
f 316/580/410 307/581/411 317/582/412
f 317/582/412 307/581/411 306/583/413
f 317/582/412 306/583/413 305/584/414
f 307/581/411 316/580/410 308/585/415
f 308/585/415 316/580/410 315/586/416
f 308/585/415 315/586/416 309/587/417
f 309/587/417 315/586/416 314/588/418
f 309/587/417 314/588/418 310/589/419
f 310/589/419 314/588/418 313/590/420
f 310/589/419 313/590/420 311/591/421
f 311/591/421 313/590/420 312/592/422
f 334/593/423 333/594/424 305/584/414
f 305/584/414 333/594/424 317/582/412
f 305/595/368 330/596/367 334/597/425
f 334/597/425 330/596/367 332/598/426
f 332/599/427 331/600/428 334/601/429
f 334/601/429 331/600/428 333/602/430
g Body7

v 30.000000 10.000000 15.863050
v 29.775989 10.000000 17.801608
v 29.115763 10.000000 19.637987
v 28.054122 10.000000 21.275396
v 26.647022 10.000000 22.627527
v 24.968631 10.000000 23.623114
v 23.107414 10.000000 24.209679
v 21.161472 10.000000 24.356306
v 19.233374 10.000000 24.055266
v 17.424746 10.000000 23.322426
v 15.830918 10.000000 22.196415
v 14.535900 10.000000 20.736581
v 13.607948 10.000000 19.019870
v 13.607948 -50.000000 19.019870
v 14.535900 -50.000000 20.736581
v 15.830918 -50.000000 22.196415
v 17.424746 -50.000000 23.322426
v 19.233374 -50.000000 24.055266
v 21.161472 -50.000000 24.356306
v 23.107414 -50.000000 24.209679
v 24.968631 -50.000000 23.623114
v 26.647022 -50.000000 22.627527
v 28.054122 -50.000000 21.275396
v 29.115763 -50.000000 19.637987
v 29.775989 -50.000000 17.801608
v 30.000000 -50.000000 15.863050
v 10.000000 -50.000000 10.000000
v 30.000000 -50.000000 10.000000
v 10.000000 10.000000 10.000000
v 30.000000 10.000000 10.000000
vt -0.000000 1.173462 0.000000
vt -6.000000 1.173462 0.000000
vt -0.000000 0.977885 0.000000
vt -6.000000 0.977885 0.000000
vt -0.000000 0.782308 0.000000
vt -6.000000 0.782308 0.000000
vt -0.000000 0.586731 0.000000
vt -6.000000 0.586731 0.000000
vt -0.000000 0.391154 0.000000
vt -6.000000 0.391154 0.000000
vt -0.000000 0.195577 0.000000
vt -6.000000 0.195577 0.000000
vt -0.000000 0.000000 0.000000
vt -6.000000 0.000000 0.000000
vt -0.000000 -0.195577 0.000000
vt -6.000000 -0.195577 0.000000
vt -0.000000 -0.391154 0.000000
vt -6.000000 -0.391154 0.000000
vt -0.000000 -0.586731 0.000000
vt -6.000000 -0.586731 0.000000
vt -0.000000 -0.782308 0.000000
vt -6.000000 -0.782308 0.000000
vt -0.000000 -0.977885 0.000000
vt -6.000000 -0.977885 0.000000
vt -0.000000 -1.173462 0.000000
vt -6.000000 -1.173462 0.000000
vt 1.977599 0.780161 0.000000
vt 0.360795 0.901987 0.000000
vt 2.000000 0.586305 0.000000
vt 0.000000 0.000000 0.000000
vt 2.000000 0.000000 0.000000
vt 1.911576 0.963799 0.000000
vt 0.453590 1.073658 0.000000
vt 1.805412 1.127540 0.000000
vt 0.583092 1.219641 0.000000
vt 1.664702 1.262753 0.000000
vt 0.742475 1.332243 0.000000
vt 1.496863 1.362311 0.000000
vt 0.923337 1.405527 0.000000
vt 1.310741 1.420968 0.000000
vt 1.116147 1.435631 0.000000
vt -0.971470 -6.000000 0.000000
vt -0.000000 -6.000000 0.000000
vt -0.971470 0.000000 0.000000
vt -0.000000 0.000000 0.000000
vt 1.546410 1.073658 0.000000
vt 0.088424 0.963799 0.000000
vt 1.639205 0.901987 0.000000
vt 0.022401 0.780161 0.000000
vt -0.000000 0.586305 0.000000
vt 0.194588 1.127540 0.000000
vt 1.416908 1.219641 0.000000
vt 0.335298 1.262753 0.000000
vt 1.257525 1.332243 0.000000
vt 0.503137 1.362311 0.000000
vt 1.076663 1.405527 0.000000
vt 0.689259 1.420968 0.000000
vt 0.883853 1.435631 0.000000
vt -0.000000 0.000000 0.000000
vt 2.000000 0.000000 0.000000
vt 6.000000 0.586305 0.000000
vt 0.000000 0.586305 0.000000
vt 6.000000 0.000000 0.000000
vt 0.000000 0.000000 0.000000
vt 1.000000 3.000000 0.000000
vt -1.000000 3.000000 0.000000
vt 1.000000 -3.000000 0.000000
vt -1.000000 -3.000000 0.000000
vn 0.100000 0.000000 -0.000000
vn 0.100000 0.000000 -0.000000
vn 0.097365 -0.000000 0.022807
vn 0.097365 -0.000000 0.022807
vn 0.089597 -0.000000 0.044411
vn 0.089597 -0.000000 0.044411
vn 0.077107 -0.000000 0.063675
vn 0.077107 -0.000000 0.063675
vn 0.060553 -0.000000 0.079582
vn 0.060553 -0.000000 0.079582
vn 0.040807 -0.000000 0.091295
vn 0.040807 -0.000000 0.091295
vn 0.018911 -0.000000 0.098196
vn 0.018911 -0.000000 0.098196
vn -0.003983 0.000000 0.099921
vn -0.003983 0.000000 0.099921
vn -0.026666 0.000000 0.096379
vn -0.026666 0.000000 0.096379
vn -0.047944 0.000000 0.087757
vn -0.047944 0.000000 0.087757
vn -0.066695 0.000000 0.074510
vn -0.066695 0.000000 0.074510
vn -0.081931 0.000000 0.057336
vn -0.081931 0.000000 0.057336
vn -0.092848 0.000000 0.037139
vn -0.092848 0.000000 0.037139
vn 0.000000 -0.100000 0.000000
vn 0.000000 -0.100000 0.000000
vn 0.000000 -0.100000 0.000000
vn 0.000000 -0.100000 0.000000
vn 0.000000 -0.100000 0.000000
vn 0.000000 -0.100000 0.000000
vn 0.000000 -0.100000 0.000000
vn 0.000000 -0.100000 0.000000
vn 0.000000 -0.100000 0.000000
vn 0.000000 -0.100000 0.000000
vn 0.000000 -0.100000 0.000000
vn 0.000000 -0.100000 0.000000
vn 0.000000 -0.100000 0.000000
vn 0.000000 -0.100000 0.000000
vn 0.000000 -0.100000 0.000000
vn -0.092848 0.000000 0.037139
vn -0.092848 0.000000 0.037139
vn 0.000000 0.100000 0.000000
vn 0.000000 0.100000 0.000000
vn 0.000000 0.100000 0.000000
vn 0.000000 0.100000 0.000000
vn 0.000000 0.100000 0.000000
vn 0.000000 0.100000 0.000000
vn 0.000000 0.100000 0.000000
vn 0.000000 0.100000 0.000000
vn 0.000000 0.100000 0.000000
vn 0.000000 0.100000 0.000000
vn 0.000000 0.100000 0.000000
vn 0.000000 0.100000 0.000000
vn 0.000000 0.100000 0.000000
vn 0.000000 0.100000 0.000000
vn 0.000000 0.100000 0.000000
vn 0.100000 0.000000 0.000000
vn 0.100000 0.000000 0.000000
vn 0.000000 0.000000 -0.100000
vn 0.000000 0.000000 -0.100000
vn 0.000000 0.000000 -0.100000
vn 0.000000 0.000000 -0.100000
f 360/603/431 335/604/432 359/605/433
f 359/605/433 335/604/432 336/606/434
f 359/605/433 336/606/434 358/607/435
f 358/607/435 336/606/434 337/608/436
f 358/607/435 337/608/436 357/609/437
f 357/609/437 337/608/436 338/610/438
f 357/609/437 338/610/438 356/611/439
f 356/611/439 338/610/438 339/612/440
f 356/611/439 339/612/440 355/613/441
f 355/613/441 339/612/440 340/614/442
f 355/613/441 340/614/442 354/615/443
f 354/615/443 340/614/442 341/616/444
f 354/615/443 341/616/444 353/617/445
f 353/617/445 341/616/444 342/618/446
f 353/617/445 342/618/446 352/619/447
f 352/619/447 342/618/446 343/620/448
f 352/619/447 343/620/448 351/621/449
f 351/621/449 343/620/448 344/622/450
f 351/621/449 344/622/450 350/623/451
f 350/623/451 344/622/450 345/624/452
f 350/623/451 345/624/452 349/625/453
f 349/625/453 345/624/452 346/626/454
f 349/625/453 346/626/454 348/627/455
f 348/627/455 346/626/454 347/628/456
f 359/629/457 348/630/458 360/631/459
f 360/631/459 348/630/458 361/632/460
f 360/631/459 361/632/460 362/633/461
f 359/629/457 358/634/462 348/630/458
f 348/630/458 358/634/462 349/635/463
f 349/635/463 358/634/462 357/636/464
f 349/635/463 357/636/464 350/637/465
f 350/637/465 357/636/464 356/638/466
f 350/637/465 356/638/466 351/639/467
f 351/639/467 356/638/466 355/640/468
f 351/639/467 355/640/468 352/641/469
f 352/641/469 355/640/468 354/642/470
f 352/641/469 354/642/470 353/643/471
f 347/644/456 363/645/472 348/646/455
f 348/646/455 363/645/472 361/647/473
f 346/648/474 337/649/475 347/650/476
f 347/650/476 337/649/475 336/651/477
f 347/650/476 336/651/477 335/652/478
f 337/649/475 346/648/474 338/653/479
f 338/653/479 346/648/474 345/654/480
f 338/653/479 345/654/480 339/655/481
f 339/655/481 345/654/480 344/656/482
f 339/655/481 344/656/482 340/657/483
f 340/657/483 344/656/482 343/658/484
f 340/657/483 343/658/484 341/659/485
f 341/659/485 343/658/484 342/660/486
f 364/661/487 363/662/488 335/652/478
f 335/652/478 363/662/488 347/650/476
f 335/663/432 360/664/431 364/665/489
f 364/665/489 360/664/431 362/666/490
f 362/667/491 361/668/492 364/669/493
f 364/669/493 361/668/492 363/670/494
g Body8

v 60.000000 10.000000 15.863050
v 59.775989 10.000000 17.801608
v 59.115763 10.000000 19.637987
v 58.054122 10.000000 21.275396
v 56.647022 10.000000 22.627527
v 54.968631 10.000000 23.623114
v 53.107414 10.000000 24.209679
v 51.161472 10.000000 24.356306
v 49.233374 10.000000 24.055266
v 47.424746 10.000000 23.322426
v 45.830918 10.000000 22.196415
v 44.535900 10.000000 20.736581
v 43.607948 10.000000 19.019870
v 43.607948 -50.000000 19.019870
v 44.535900 -50.000000 20.736581
v 45.830918 -50.000000 22.196415
v 47.424746 -50.000000 23.322426
v 49.233374 -50.000000 24.055266
v 51.161472 -50.000000 24.356306
v 53.107414 -50.000000 24.209679
v 54.968631 -50.000000 23.623114
v 56.647022 -50.000000 22.627527
v 58.054122 -50.000000 21.275396
v 59.115763 -50.000000 19.637987
v 59.775989 -50.000000 17.801608
v 60.000000 -50.000000 15.863050
v 40.000000 -50.000000 10.000000
v 60.000000 -50.000000 10.000000
v 40.000000 10.000000 10.000000
v 60.000000 10.000000 10.000000
vt -0.000000 1.173462 0.000000
vt -6.000000 1.173462 0.000000
vt -0.000000 0.977885 0.000000
vt -6.000000 0.977885 0.000000
vt -0.000000 0.782308 0.000000
vt -6.000000 0.782308 0.000000
vt -0.000000 0.586731 0.000000
vt -6.000000 0.586731 0.000000
vt -0.000000 0.391154 0.000000
vt -6.000000 0.391154 0.000000
vt -0.000000 0.195577 0.000000
vt -6.000000 0.195577 0.000000
vt -0.000000 0.000000 0.000000
vt -6.000000 0.000000 0.000000
vt -0.000000 -0.195577 0.000000
vt -6.000000 -0.195577 0.000000
vt -0.000000 -0.391154 0.000000
vt -6.000000 -0.391154 0.000000
vt -0.000000 -0.586731 0.000000
vt -6.000000 -0.586731 0.000000
vt -0.000000 -0.782308 0.000000
vt -6.000000 -0.782308 0.000000
vt -0.000000 -0.977885 0.000000
vt -6.000000 -0.977885 0.000000
vt -0.000000 -1.173462 0.000000
vt -6.000000 -1.173462 0.000000
vt 1.977599 0.780161 0.000000
vt 0.360795 0.901987 0.000000
vt 2.000000 0.586305 0.000000
vt 0.000000 0.000000 0.000000
vt 2.000000 0.000000 0.000000
vt 1.911576 0.963799 0.000000
vt 0.453590 1.073658 0.000000
vt 1.805412 1.127540 0.000000
vt 0.583092 1.219641 0.000000
vt 1.664702 1.262753 0.000000
vt 0.742475 1.332243 0.000000
vt 1.496863 1.362311 0.000000
vt 0.923337 1.405527 0.000000
vt 1.310741 1.420968 0.000000
vt 1.116147 1.435631 0.000000
vt -0.971470 -6.000000 0.000000
vt -0.000000 -6.000000 0.000000
vt -0.971470 0.000000 0.000000
vt -0.000000 0.000000 0.000000
vt 1.546410 1.073658 0.000000
vt 0.088424 0.963799 0.000000
vt 1.639205 0.901987 0.000000
vt 0.022401 0.780161 0.000000
vt -0.000000 0.586305 0.000000
vt 0.194588 1.127540 0.000000
vt 1.416908 1.219641 0.000000
vt 0.335298 1.262753 0.000000
vt 1.257525 1.332243 0.000000
vt 0.503137 1.362311 0.000000
vt 1.076663 1.405527 0.000000
vt 0.689259 1.420968 0.000000
vt 0.883853 1.435631 0.000000
vt -0.000000 0.000000 0.000000
vt 2.000000 0.000000 0.000000
vt 6.000000 0.586305 0.000000
vt 0.000000 0.586305 0.000000
vt 6.000000 0.000000 0.000000
vt 0.000000 0.000000 0.000000
vt 1.000000 3.000000 0.000000
vt -1.000000 3.000000 0.000000
vt 1.000000 -3.000000 0.000000
vt -1.000000 -3.000000 0.000000
vn 0.100000 0.000000 -0.000000
vn 0.100000 0.000000 -0.000000
vn 0.097365 -0.000000 0.022807
vn 0.097365 -0.000000 0.022807
vn 0.089597 -0.000000 0.044411
vn 0.089597 -0.000000 0.044411
vn 0.077107 -0.000000 0.063675
vn 0.077107 -0.000000 0.063675
vn 0.060553 -0.000000 0.079582
vn 0.060553 -0.000000 0.079582
vn 0.040807 -0.000000 0.091295
vn 0.040807 -0.000000 0.091295
vn 0.018911 -0.000000 0.098196
vn 0.018911 -0.000000 0.098196
vn -0.003983 0.000000 0.099921
vn -0.003983 0.000000 0.099921
vn -0.026666 0.000000 0.096379
vn -0.026666 0.000000 0.096379
vn -0.047944 0.000000 0.087757
vn -0.047944 0.000000 0.087757
vn -0.066695 0.000000 0.074510
vn -0.066695 0.000000 0.074510
vn -0.081931 0.000000 0.057336
vn -0.081931 0.000000 0.057336
vn -0.092848 0.000000 0.037139
vn -0.092848 0.000000 0.037139
vn 0.000000 -0.100000 0.000000
vn 0.000000 -0.100000 0.000000
vn 0.000000 -0.100000 0.000000
vn 0.000000 -0.100000 0.000000
vn 0.000000 -0.100000 0.000000
vn 0.000000 -0.100000 0.000000
vn 0.000000 -0.100000 0.000000
vn 0.000000 -0.100000 0.000000
vn 0.000000 -0.100000 0.000000
vn 0.000000 -0.100000 0.000000
vn 0.000000 -0.100000 0.000000
vn 0.000000 -0.100000 0.000000
vn 0.000000 -0.100000 0.000000
vn 0.000000 -0.100000 0.000000
vn 0.000000 -0.100000 0.000000
vn -0.092848 0.000000 0.037139
vn -0.092848 0.000000 0.037139
vn 0.000000 0.100000 0.000000
vn 0.000000 0.100000 0.000000
vn 0.000000 0.100000 0.000000
vn 0.000000 0.100000 0.000000
vn 0.000000 0.100000 0.000000
vn 0.000000 0.100000 0.000000
vn 0.000000 0.100000 0.000000
vn 0.000000 0.100000 0.000000
vn 0.000000 0.100000 0.000000
vn 0.000000 0.100000 0.000000
vn 0.000000 0.100000 0.000000
vn 0.000000 0.100000 0.000000
vn 0.000000 0.100000 0.000000
vn 0.000000 0.100000 0.000000
vn 0.000000 0.100000 0.000000
vn 0.100000 0.000000 0.000000
vn 0.100000 0.000000 0.000000
vn 0.000000 0.000000 -0.100000
vn 0.000000 0.000000 -0.100000
vn 0.000000 0.000000 -0.100000
vn 0.000000 0.000000 -0.100000
f 390/671/495 365/672/496 389/673/497
f 389/673/497 365/672/496 366/674/498
f 389/673/497 366/674/498 388/675/499
f 388/675/499 366/674/498 367/676/500
f 388/675/499 367/676/500 387/677/501
f 387/677/501 367/676/500 368/678/502
f 387/677/501 368/678/502 386/679/503
f 386/679/503 368/678/502 369/680/504
f 386/679/503 369/680/504 385/681/505
f 385/681/505 369/680/504 370/682/506
f 385/681/505 370/682/506 384/683/507
f 384/683/507 370/682/506 371/684/508
f 384/683/507 371/684/508 383/685/509
f 383/685/509 371/684/508 372/686/510
f 383/685/509 372/686/510 382/687/511
f 382/687/511 372/686/510 373/688/512
f 382/687/511 373/688/512 381/689/513
f 381/689/513 373/688/512 374/690/514
f 381/689/513 374/690/514 380/691/515
f 380/691/515 374/690/514 375/692/516
f 380/691/515 375/692/516 379/693/517
f 379/693/517 375/692/516 376/694/518
f 379/693/517 376/694/518 378/695/519
f 378/695/519 376/694/518 377/696/520
f 389/697/521 378/698/522 390/699/523
f 390/699/523 378/698/522 391/700/524
f 390/699/523 391/700/524 392/701/525
f 389/697/521 388/702/526 378/698/522
f 378/698/522 388/702/526 379/703/527
f 379/703/527 388/702/526 387/704/528
f 379/703/527 387/704/528 380/705/529
f 380/705/529 387/704/528 386/706/530
f 380/705/529 386/706/530 381/707/531
f 381/707/531 386/706/530 385/708/532
f 381/707/531 385/708/532 382/709/533
f 382/709/533 385/708/532 384/710/534
f 382/709/533 384/710/534 383/711/535
f 377/712/520 393/713/536 378/714/519
f 378/714/519 393/713/536 391/715/537
f 376/716/538 367/717/539 377/718/540
f 377/718/540 367/717/539 366/719/541
f 377/718/540 366/719/541 365/720/542
f 367/717/539 376/716/538 368/721/543
f 368/721/543 376/716/538 375/722/544
f 368/721/543 375/722/544 369/723/545
f 369/723/545 375/722/544 374/724/546
f 369/723/545 374/724/546 370/725/547
f 370/725/547 374/724/546 373/726/548
f 370/725/547 373/726/548 371/727/549
f 371/727/549 373/726/548 372/728/550
f 394/729/551 393/730/552 365/720/542
f 365/720/542 393/730/552 377/718/540
f 365/731/496 390/732/495 394/733/553
f 394/733/553 390/732/495 392/734/554
f 392/735/555 391/736/556 394/737/557
f 394/737/557 391/736/556 393/738/558
g Body9

v 90.000000 10.000000 15.863050
v 89.775989 10.000000 17.801608
v 89.115763 10.000000 19.637987
v 88.054122 10.000000 21.275396
v 86.647022 10.000000 22.627527
v 84.968631 10.000000 23.623114
v 83.107414 10.000000 24.209679
v 81.161472 10.000000 24.356306
v 79.233374 10.000000 24.055266
v 77.424746 10.000000 23.322426
v 75.830918 10.000000 22.196415
v 74.535900 10.000000 20.736581
v 73.607948 10.000000 19.019870
v 73.607948 -50.000000 19.019870
v 74.535900 -50.000000 20.736581
v 75.830918 -50.000000 22.196415
v 77.424746 -50.000000 23.322426
v 79.233374 -50.000000 24.055266
v 81.161472 -50.000000 24.356306
v 83.107414 -50.000000 24.209679
v 84.968631 -50.000000 23.623114
v 86.647022 -50.000000 22.627527
v 88.054122 -50.000000 21.275396
v 89.115763 -50.000000 19.637987
v 89.775989 -50.000000 17.801608
v 90.000000 -50.000000 15.863050
v 70.000000 -50.000000 10.000000
v 90.000000 -50.000000 10.000000
v 70.000000 10.000000 10.000000
v 90.000000 10.000000 10.000000
vt -0.000000 1.173462 0.000000
vt -6.000000 1.173462 0.000000
vt -0.000000 0.977885 0.000000
vt -6.000000 0.977885 0.000000
vt -0.000000 0.782308 0.000000
vt -6.000000 0.782308 0.000000
vt -0.000000 0.586731 0.000000
vt -6.000000 0.586731 0.000000
vt -0.000000 0.391154 0.000000
vt -6.000000 0.391154 0.000000
vt -0.000000 0.195577 0.000000
vt -6.000000 0.195577 0.000000
vt -0.000000 0.000000 0.000000
vt -6.000000 0.000000 0.000000
vt -0.000000 -0.195577 0.000000
vt -6.000000 -0.195577 0.000000
vt -0.000000 -0.391154 0.000000
vt -6.000000 -0.391154 0.000000
vt -0.000000 -0.586731 0.000000
vt -6.000000 -0.586731 0.000000
vt -0.000000 -0.782308 0.000000
vt -6.000000 -0.782308 0.000000
vt -0.000000 -0.977885 0.000000
vt -6.000000 -0.977885 0.000000
vt -0.000000 -1.173462 0.000000
vt -6.000000 -1.173462 0.000000
vt 1.977599 0.780161 0.000000
vt 0.360795 0.901987 0.000000
vt 2.000000 0.586305 0.000000
vt 0.000000 0.000000 0.000000
vt 2.000000 0.000000 0.000000
vt 1.911576 0.963799 0.000000
vt 0.453590 1.073658 0.000000
vt 1.805412 1.127540 0.000000
vt 0.583092 1.219641 0.000000
vt 1.664702 1.262753 0.000000
vt 0.742475 1.332243 0.000000
vt 1.496863 1.362311 0.000000
vt 0.923337 1.405527 0.000000
vt 1.310741 1.420968 0.000000
vt 1.116147 1.435631 0.000000
vt -0.971470 -6.000000 0.000000
vt -0.000000 -6.000000 0.000000
vt -0.971470 0.000000 0.000000
vt -0.000000 0.000000 0.000000
vt 1.546410 1.073658 0.000000
vt 0.088424 0.963799 0.000000
vt 1.639205 0.901987 0.000000
vt 0.022401 0.780161 0.000000
vt -0.000000 0.586305 0.000000
vt 0.194588 1.127540 0.000000
vt 1.416908 1.219641 0.000000
vt 0.335298 1.262753 0.000000
vt 1.257525 1.332243 0.000000
vt 0.503137 1.362311 0.000000
vt 1.076663 1.405527 0.000000
vt 0.689259 1.420968 0.000000
vt 0.883853 1.435631 0.000000
vt -0.000000 0.000000 0.000000
vt 2.000000 0.000000 0.000000
vt 6.000000 0.586305 0.000000
vt 0.000000 0.586305 0.000000
vt 6.000000 0.000000 0.000000
vt 0.000000 0.000000 0.000000
vt 1.000000 3.000000 0.000000
vt -1.000000 3.000000 0.000000
vt 1.000000 -3.000000 0.000000
vt -1.000000 -3.000000 0.000000
vn 0.100000 0.000000 0.000000
vn 0.100000 0.000000 0.000000
vn 0.097365 -0.000000 0.022807
vn 0.097365 -0.000000 0.022807
vn 0.089597 -0.000000 0.044411
vn 0.089597 -0.000000 0.044411
vn 0.077107 -0.000000 0.063675
vn 0.077107 -0.000000 0.063675
vn 0.060553 -0.000000 0.079582
vn 0.060553 -0.000000 0.079582
vn 0.040807 -0.000000 0.091295
vn 0.040807 -0.000000 0.091295
vn 0.018911 -0.000000 0.098196
vn 0.018911 -0.000000 0.098196
vn -0.003983 0.000000 0.099921
vn -0.003983 0.000000 0.099921
vn -0.026666 0.000000 0.096379
vn -0.026666 0.000000 0.096379
vn -0.047944 0.000000 0.087757
vn -0.047944 0.000000 0.087757
vn -0.066695 0.000000 0.074510
vn -0.066695 0.000000 0.074510
vn -0.081931 0.000000 0.057336
vn -0.081931 0.000000 0.057336
vn -0.092848 0.000000 0.037139
vn -0.092848 0.000000 0.037139
vn 0.000000 -0.100000 0.000000
vn 0.000000 -0.100000 0.000000
vn 0.000000 -0.100000 0.000000
vn 0.000000 -0.100000 0.000000
vn 0.000000 -0.100000 0.000000
vn 0.000000 -0.100000 0.000000
vn 0.000000 -0.100000 0.000000
vn 0.000000 -0.100000 0.000000
vn 0.000000 -0.100000 0.000000
vn 0.000000 -0.100000 0.000000
vn 0.000000 -0.100000 0.000000
vn 0.000000 -0.100000 0.000000
vn 0.000000 -0.100000 0.000000
vn 0.000000 -0.100000 0.000000
vn 0.000000 -0.100000 0.000000
vn -0.092848 0.000000 0.037139
vn -0.092848 0.000000 0.037139
vn 0.000000 0.100000 0.000000
vn 0.000000 0.100000 0.000000
vn 0.000000 0.100000 0.000000
vn 0.000000 0.100000 0.000000
vn 0.000000 0.100000 0.000000
vn 0.000000 0.100000 0.000000
vn 0.000000 0.100000 0.000000
vn 0.000000 0.100000 0.000000
vn 0.000000 0.100000 0.000000
vn 0.000000 0.100000 0.000000
vn 0.000000 0.100000 0.000000
vn 0.000000 0.100000 0.000000
vn 0.000000 0.100000 0.000000
vn 0.000000 0.100000 0.000000
vn 0.000000 0.100000 0.000000
vn 0.100000 0.000000 0.000000
vn 0.100000 0.000000 0.000000
vn 0.000000 0.000000 -0.100000
vn 0.000000 0.000000 -0.100000
vn 0.000000 0.000000 -0.100000
vn 0.000000 0.000000 -0.100000
f 420/739/559 395/740/560 419/741/561
f 419/741/561 395/740/560 396/742/562
f 419/741/561 396/742/562 418/743/563
f 418/743/563 396/742/562 397/744/564
f 418/743/563 397/744/564 417/745/565
f 417/745/565 397/744/564 398/746/566
f 417/745/565 398/746/566 416/747/567
f 416/747/567 398/746/566 399/748/568
f 416/747/567 399/748/568 415/749/569
f 415/749/569 399/748/568 400/750/570
f 415/749/569 400/750/570 414/751/571
f 414/751/571 400/750/570 401/752/572
f 414/751/571 401/752/572 413/753/573
f 413/753/573 401/752/572 402/754/574
f 413/753/573 402/754/574 412/755/575
f 412/755/575 402/754/574 403/756/576
f 412/755/575 403/756/576 411/757/577
f 411/757/577 403/756/576 404/758/578
f 411/757/577 404/758/578 410/759/579
f 410/759/579 404/758/578 405/760/580
f 410/759/579 405/760/580 409/761/581
f 409/761/581 405/760/580 406/762/582
f 409/761/581 406/762/582 408/763/583
f 408/763/583 406/762/582 407/764/584
f 419/765/585 408/766/586 420/767/587
f 420/767/587 408/766/586 421/768/588
f 420/767/587 421/768/588 422/769/589
f 419/765/585 418/770/590 408/766/586
f 408/766/586 418/770/590 409/771/591
f 409/771/591 418/770/590 417/772/592
f 409/771/591 417/772/592 410/773/593
f 410/773/593 417/772/592 416/774/594
f 410/773/593 416/774/594 411/775/595
f 411/775/595 416/774/594 415/776/596
f 411/775/595 415/776/596 412/777/597
f 412/777/597 415/776/596 414/778/598
f 412/777/597 414/778/598 413/779/599
f 407/780/584 423/781/600 408/782/583
f 408/782/583 423/781/600 421/783/601
f 406/784/602 397/785/603 407/786/604
f 407/786/604 397/785/603 396/787/605
f 407/786/604 396/787/605 395/788/606
f 397/785/603 406/784/602 398/789/607
f 398/789/607 406/784/602 405/790/608
f 398/789/607 405/790/608 399/791/609
f 399/791/609 405/790/608 404/792/610
f 399/791/609 404/792/610 400/793/611
f 400/793/611 404/792/610 403/794/612
f 400/793/611 403/794/612 401/795/613
f 401/795/613 403/794/612 402/796/614
f 424/797/615 423/798/616 395/788/606
f 395/788/606 423/798/616 407/786/604
f 395/799/560 420/800/559 424/801/617
f 424/801/617 420/800/559 422/802/618
f 422/803/619 421/804/620 424/805/621
f 424/805/621 421/804/620 423/806/622
g Body10

v -30.000000 -25.000000 10.000000
v 100.000000 -25.000000 10.000000
v 100.000000 -25.000000 15.000000
v -30.000000 -25.000000 15.000000
v -30.000000 -15.000000 10.000000
v -30.000000 -15.000000 15.000000
v 100.000000 -15.000000 10.000000
v 100.000000 -15.000000 15.000000
vt 0.000000 0.000000 0.000000
vt 13.000000 0.000000 0.000000
vt 0.000000 0.500000 0.000000
vt 13.000000 0.500000 0.000000
vt 0.000000 0.000000 0.000000
vt 1.000000 0.000000 0.000000
vt 0.000000 0.500000 0.000000
vt 1.000000 0.500000 0.000000
vt 0.000000 0.000000 0.000000
vt 13.000000 0.000000 0.000000
vt 0.000000 0.500000 0.000000
vt 13.000000 0.500000 0.000000
vt 0.000000 0.000000 0.000000
vt 1.000000 0.000000 0.000000
vt 0.000000 0.500000 0.000000
vt 1.000000 0.500000 0.000000
vt 6.500000 0.500000 0.000000
vt -6.500000 0.500000 0.000000
vt 6.500000 -0.500000 0.000000
vt -6.500000 -0.500000 0.000000
vt 6.500000 0.500000 0.000000
vt -6.500000 0.500000 0.000000
vt 6.500000 -0.500000 0.000000
vt -6.500000 -0.500000 0.000000
vn 0.000000 -0.100000 0.000000
vn 0.000000 -0.100000 0.000000
vn 0.000000 -0.100000 0.000000
vn 0.000000 -0.100000 0.000000
vn -0.100000 0.000000 0.000000
vn -0.100000 0.000000 0.000000
vn -0.100000 0.000000 0.000000
vn -0.100000 0.000000 0.000000
vn 0.000000 0.100000 0.000000
vn 0.000000 0.100000 0.000000
vn 0.000000 0.100000 0.000000
vn 0.000000 0.100000 0.000000
vn 0.100000 0.000000 0.000000
vn 0.100000 0.000000 0.000000
vn 0.100000 0.000000 0.000000
vn 0.100000 0.000000 0.000000
vn 0.000000 0.000000 0.100000
vn 0.000000 0.000000 0.100000
vn 0.000000 0.000000 0.100000
vn 0.000000 0.000000 0.100000
vn 0.000000 0.000000 -0.100000
vn 0.000000 0.000000 -0.100000
vn 0.000000 0.000000 -0.100000
vn 0.000000 0.000000 -0.100000
usemtl Steel_-_Satin
f 425/807/623 426/808/624 428/809/625
f 428/809/625 426/808/624 427/810/626
f 429/811/627 425/812/628 430/813/629
f 430/813/629 425/812/628 428/814/630
f 431/815/631 429/816/632 432/817/633
f 432/817/633 429/816/632 430/818/634
f 426/819/635 431/820/636 427/821/637
f 427/821/637 431/820/636 432/822/638
f 432/823/639 430/824/640 427/825/641
f 427/825/641 430/824/640 428/826/642
f 426/827/643 425/828/644 431/829/645
f 431/829/645 425/828/644 429/830/646
# 432 vertices
# 830 texture params
# 646 normals
# 840 facets

# 6 groups
