%YAML 1.1
%TAG !u! tag:unity3d.com,2011:
--- !u!1 &3538631390085162426
GameObject:
  m_ObjectHideFlags: 0
  m_CorrespondingSourceObject: {fileID: 0}
  m_PrefabInstance: {fileID: 0}
  m_PrefabAsset: {fileID: 0}
  serializedVersion: 6
  m_Component:
  - component: {fileID: 3538631390085162430}
  - component: {fileID: 3538631390085162425}
  - component: {fileID: 3538631390085162424}
  - component: {fileID: 3538631390085162427}
  m_Layer: 5
  m_Name: Map
  m_TagString: Untagged
  m_Icon: {fileID: 0}
  m_NavMeshLayer: 0
  m_StaticEditorFlags: 0
  m_IsActive: 1
--- !u!224 &3538631390085162430
RectTransform:
  m_ObjectHideFlags: 0
  m_CorrespondingSourceObject: {fileID: 0}
  m_PrefabInstance: {fileID: 0}
  m_PrefabAsset: {fileID: 0}
  m_GameObject: {fileID: 3538631390085162426}
  m_LocalRotation: {x: 0, y: 0.7071068, z: 0.7071068, w: 0}
  m_LocalPosition: {x: 0, y: 0, z: 0}
  m_LocalScale: {x: 1, y: 1, z: 1}
  m_Children:
  - {fileID: 3084269115001969697}
  - {fileID: 3538631390195157323}
  - {fileID: 3084269115276606305}
  - {fileID: 3084269114085764631}
  - {fileID: 3084269115362615759}
  - {fileID: 3084269114046197428}
  m_Father: {fileID: 0}
  m_RootOrder: 0
  m_LocalEulerAnglesHint: {x: -90, y: 180, z: 0}
  m_AnchorMin: {x: 0, y: 0}
  m_AnchorMax: {x: 0, y: 0}
  m_AnchoredPosition: {x: 0, y: 0}
  m_SizeDelta: {x: 130, y: 170}
  m_Pivot: {x: 0.5, y: 0.5}
--- !u!223 &3538631390085162425
Canvas:
  m_ObjectHideFlags: 0
  m_CorrespondingSourceObject: {fileID: 0}
  m_PrefabInstance: {fileID: 0}
  m_PrefabAsset: {fileID: 0}
  m_GameObject: {fileID: 3538631390085162426}
  m_Enabled: 1
  serializedVersion: 3
  m_RenderMode: 2
  m_Camera: {fileID: 0}
  m_PlaneDistance: 100
  m_PixelPerfect: 0
  m_ReceivesEvents: 1
  m_OverrideSorting: 0
  m_OverridePixelPerfect: 0
  m_SortingBucketNormalizedSize: 0
  m_AdditionalShaderChannelsFlag: 0
  m_SortingLayerID: 0
  m_SortingOrder: 0
  m_TargetDisplay: 0
--- !u!114 &3538631390085162424
MonoBehaviour:
  m_ObjectHideFlags: 0
  m_CorrespondingSourceObject: {fileID: 0}
  m_PrefabInstance: {fileID: 0}
  m_PrefabAsset: {fileID: 0}
  m_GameObject: {fileID: 3538631390085162426}
  m_Enabled: 1
  m_EditorHideFlags: 0
  m_Script: {fileID: 11500000, guid: 0cd44c1031e13a943bb63640046fad76, type: 3}
  m_Name: 
  m_EditorClassIdentifier: 
  m_UiScaleMode: 0
  m_ReferencePixelsPerUnit: 100
  m_ScaleFactor: 1
  m_ReferenceResolution: {x: 800, y: 600}
  m_ScreenMatchMode: 0
  m_MatchWidthOrHeight: 0
  m_PhysicalUnit: 3
  m_FallbackScreenDPI: 96
  m_DefaultSpriteDPI: 96
  m_DynamicPixelsPerUnit: 1
  m_PresetInfoIsWorld: 1
--- !u!114 &3538631390085162427
MonoBehaviour:
  m_ObjectHideFlags: 0
  m_CorrespondingSourceObject: {fileID: 0}
  m_PrefabInstance: {fileID: 0}
  m_PrefabAsset: {fileID: 0}
  m_GameObject: {fileID: 3538631390085162426}
  m_Enabled: 1
  m_EditorHideFlags: 0
  m_Script: {fileID: 11500000, guid: dc42784cf147c0c48a680349fa168899, type: 3}
  m_Name: 
  m_EditorClassIdentifier: 
  m_IgnoreReversedGraphics: 1
  m_BlockingObjects: 0
  m_BlockingMask:
    serializedVersion: 2
    m_Bits: 4294967295
--- !u!1 &3538631390195157322
GameObject:
  m_ObjectHideFlags: 0
  m_CorrespondingSourceObject: {fileID: 0}
  m_PrefabInstance: {fileID: 0}
  m_PrefabAsset: {fileID: 0}
  serializedVersion: 6
  m_Component:
  - component: {fileID: 3538631390195157323}
  - component: {fileID: 3538631390195157321}
  - component: {fileID: 3538631390195157320}
  m_Layer: 5
  m_Name: Pivot
  m_TagString: Untagged
  m_Icon: {fileID: 0}
  m_NavMeshLayer: 0
  m_StaticEditorFlags: 0
  m_IsActive: 1
--- !u!224 &3538631390195157323
RectTransform:
  m_ObjectHideFlags: 0
  m_CorrespondingSourceObject: {fileID: 0}
  m_PrefabInstance: {fileID: 0}
  m_PrefabAsset: {fileID: 0}
  m_GameObject: {fileID: 3538631390195157322}
  m_LocalRotation: {x: 0, y: 0, z: 0, w: 1}
  m_LocalPosition: {x: 0, y: 0, z: 0}
  m_LocalScale: {x: 1, y: 1, z: 1}
  m_Children: []
  m_Father: {fileID: 3538631390085162430}
  m_RootOrder: 1
  m_LocalEulerAnglesHint: {x: 0, y: 0, z: 0}
  m_AnchorMin: {x: 0.5, y: 0.5}
  m_AnchorMax: {x: 0.5, y: 0.5}
  m_AnchoredPosition: {x: 0, y: 0}
  m_SizeDelta: {x: 10, y: 10}
  m_Pivot: {x: 0.5, y: 0.5}
--- !u!222 &3538631390195157321
CanvasRenderer:
  m_ObjectHideFlags: 0
  m_CorrespondingSourceObject: {fileID: 0}
  m_PrefabInstance: {fileID: 0}
  m_PrefabAsset: {fileID: 0}
  m_GameObject: {fileID: 3538631390195157322}
  m_CullTransparentMesh: 1
--- !u!114 &3538631390195157320
MonoBehaviour:
  m_ObjectHideFlags: 0
  m_CorrespondingSourceObject: {fileID: 0}
  m_PrefabInstance: {fileID: 0}
  m_PrefabAsset: {fileID: 0}
  m_GameObject: {fileID: 3538631390195157322}
  m_Enabled: 1
  m_EditorHideFlags: 0
  m_Script: {fileID: 11500000, guid: fe87c0e1cc204ed48ad3b37840f39efc, type: 3}
  m_Name: 
  m_EditorClassIdentifier: 
  m_Material: {fileID: 0}
  m_Color: {r: 1, g: 1, b: 1, a: 1}
  m_RaycastTarget: 1
  m_RaycastPadding: {x: 0, y: 0, z: 0, w: 0}
  m_Maskable: 1
  m_OnCullStateChanged:
    m_PersistentCalls:
      m_Calls: []
  m_Sprite: {fileID: 21300000, guid: 4381ee0181a6cac4d8de48c934cf74b9, type: 3}
  m_Type: 0
  m_PreserveAspect: 0
  m_FillCenter: 1
  m_FillMethod: 4
  m_FillAmount: 1
  m_FillClockwise: 1
  m_FillOrigin: 0
  m_UseSpriteMesh: 0
  m_PixelsPerUnitMultiplier: 1
--- !u!1001 &3538631389803577814
PrefabInstance:
  m_ObjectHideFlags: 0
  serializedVersion: 2
  m_Modification:
    m_TransformParent: {fileID: 3538631390085162430}
    m_Modifications:
    - target: {fileID: 2005853267813153462, guid: 7d375ea870c0d9b4b880684bd471d5d9,
        type: 3}
      propertyPath: m_Name
      value: asteroid_img1
      objectReference: {fileID: 0}
    - target: {fileID: 2005853267813153463, guid: 7d375ea870c0d9b4b880684bd471d5d9,
        type: 3}
      propertyPath: m_Pivot.x
      value: 0.5
      objectReference: {fileID: 0}
    - target: {fileID: 2005853267813153463, guid: 7d375ea870c0d9b4b880684bd471d5d9,
        type: 3}
      propertyPath: m_Pivot.y
      value: 0.5
      objectReference: {fileID: 0}
    - target: {fileID: 2005853267813153463, guid: 7d375ea870c0d9b4b880684bd471d5d9,
        type: 3}
      propertyPath: m_RootOrder
      value: 2
      objectReference: {fileID: 0}
    - target: {fileID: 2005853267813153463, guid: 7d375ea870c0d9b4b880684bd471d5d9,
        type: 3}
      propertyPath: m_AnchorMax.x
      value: 0.5
      objectReference: {fileID: 0}
    - target: {fileID: 2005853267813153463, guid: 7d375ea870c0d9b4b880684bd471d5d9,
        type: 3}
      propertyPath: m_AnchorMax.y
      value: 0.5
      objectReference: {fileID: 0}
    - target: {fileID: 2005853267813153463, guid: 7d375ea870c0d9b4b880684bd471d5d9,
        type: 3}
      propertyPath: m_AnchorMin.x
      value: 0.5
      objectReference: {fileID: 0}
    - target: {fileID: 2005853267813153463, guid: 7d375ea870c0d9b4b880684bd471d5d9,
        type: 3}
      propertyPath: m_AnchorMin.y
      value: 0.5
      objectReference: {fileID: 0}
    - target: {fileID: 2005853267813153463, guid: 7d375ea870c0d9b4b880684bd471d5d9,
        type: 3}
      propertyPath: m_SizeDelta.x
      value: 5
      objectReference: {fileID: 0}
    - target: {fileID: 2005853267813153463, guid: 7d375ea870c0d9b4b880684bd471d5d9,
        type: 3}
      propertyPath: m_SizeDelta.y
      value: 5
      objectReference: {fileID: 0}
    - target: {fileID: 2005853267813153463, guid: 7d375ea870c0d9b4b880684bd471d5d9,
        type: 3}
      propertyPath: m_LocalPosition.x
      value: 0
      objectReference: {fileID: 0}
    - target: {fileID: 2005853267813153463, guid: 7d375ea870c0d9b4b880684bd471d5d9,
        type: 3}
      propertyPath: m_LocalPosition.y
      value: 0
      objectReference: {fileID: 0}
    - target: {fileID: 2005853267813153463, guid: 7d375ea870c0d9b4b880684bd471d5d9,
        type: 3}
      propertyPath: m_LocalPosition.z
      value: 0
      objectReference: {fileID: 0}
    - target: {fileID: 2005853267813153463, guid: 7d375ea870c0d9b4b880684bd471d5d9,
        type: 3}
      propertyPath: m_LocalRotation.w
      value: 1
      objectReference: {fileID: 0}
    - target: {fileID: 2005853267813153463, guid: 7d375ea870c0d9b4b880684bd471d5d9,
        type: 3}
      propertyPath: m_LocalRotation.x
      value: 0
      objectReference: {fileID: 0}
    - target: {fileID: 2005853267813153463, guid: 7d375ea870c0d9b4b880684bd471d5d9,
        type: 3}
      propertyPath: m_LocalRotation.y
      value: 0
      objectReference: {fileID: 0}
    - target: {fileID: 2005853267813153463, guid: 7d375ea870c0d9b4b880684bd471d5d9,
        type: 3}
      propertyPath: m_LocalRotation.z
      value: 0
      objectReference: {fileID: 0}
    - target: {fileID: 2005853267813153463, guid: 7d375ea870c0d9b4b880684bd471d5d9,
        type: 3}
      propertyPath: m_AnchoredPosition.x
      value: 0
      objectReference: {fileID: 0}
    - target: {fileID: 2005853267813153463, guid: 7d375ea870c0d9b4b880684bd471d5d9,
        type: 3}
      propertyPath: m_AnchoredPosition.y
      value: 0
      objectReference: {fileID: 0}
    - target: {fileID: 2005853267813153463, guid: 7d375ea870c0d9b4b880684bd471d5d9,
        type: 3}
      propertyPath: m_LocalEulerAnglesHint.x
      value: 0
      objectReference: {fileID: 0}
    - target: {fileID: 2005853267813153463, guid: 7d375ea870c0d9b4b880684bd471d5d9,
        type: 3}
      propertyPath: m_LocalEulerAnglesHint.y
      value: 0
      objectReference: {fileID: 0}
    - target: {fileID: 2005853267813153463, guid: 7d375ea870c0d9b4b880684bd471d5d9,
        type: 3}
      propertyPath: m_LocalEulerAnglesHint.z
      value: 0
      objectReference: {fileID: 0}
    m_RemovedComponents: []
  m_SourcePrefab: {fileID: 100100000, guid: 7d375ea870c0d9b4b880684bd471d5d9, type: 3}
--- !u!224 &3084269115276606305 stripped
RectTransform:
  m_CorrespondingSourceObject: {fileID: 2005853267813153463, guid: 7d375ea870c0d9b4b880684bd471d5d9,
    type: 3}
  m_PrefabInstance: {fileID: 3538631389803577814}
  m_PrefabAsset: {fileID: 0}
--- !u!1001 &3538631390258699128
PrefabInstance:
  m_ObjectHideFlags: 0
  serializedVersion: 2
  m_Modification:
    m_TransformParent: {fileID: 3538631390085162430}
    m_Modifications:
    - target: {fileID: 2005853267813153462, guid: 7d375ea870c0d9b4b880684bd471d5d9,
        type: 3}
      propertyPath: m_Name
      value: asteroid_img (2)
      objectReference: {fileID: 0}
    - target: {fileID: 2005853267813153463, guid: 7d375ea870c0d9b4b880684bd471d5d9,
        type: 3}
      propertyPath: m_Pivot.x
      value: 0.5
      objectReference: {fileID: 0}
    - target: {fileID: 2005853267813153463, guid: 7d375ea870c0d9b4b880684bd471d5d9,
        type: 3}
      propertyPath: m_Pivot.y
      value: 0.5
      objectReference: {fileID: 0}
    - target: {fileID: 2005853267813153463, guid: 7d375ea870c0d9b4b880684bd471d5d9,
        type: 3}
      propertyPath: m_RootOrder
      value: 4
      objectReference: {fileID: 0}
    - target: {fileID: 2005853267813153463, guid: 7d375ea870c0d9b4b880684bd471d5d9,
        type: 3}
      propertyPath: m_AnchorMax.x
      value: 0.5
      objectReference: {fileID: 0}
    - target: {fileID: 2005853267813153463, guid: 7d375ea870c0d9b4b880684bd471d5d9,
        type: 3}
      propertyPath: m_AnchorMax.y
      value: 0.5
      objectReference: {fileID: 0}
    - target: {fileID: 2005853267813153463, guid: 7d375ea870c0d9b4b880684bd471d5d9,
        type: 3}
      propertyPath: m_AnchorMin.x
      value: 0.5
      objectReference: {fileID: 0}
    - target: {fileID: 2005853267813153463, guid: 7d375ea870c0d9b4b880684bd471d5d9,
        type: 3}
      propertyPath: m_AnchorMin.y
      value: 0.5
      objectReference: {fileID: 0}
    - target: {fileID: 2005853267813153463, guid: 7d375ea870c0d9b4b880684bd471d5d9,
        type: 3}
      propertyPath: m_SizeDelta.x
      value: 5
      objectReference: {fileID: 0}
    - target: {fileID: 2005853267813153463, guid: 7d375ea870c0d9b4b880684bd471d5d9,
        type: 3}
      propertyPath: m_SizeDelta.y
      value: 5
      objectReference: {fileID: 0}
    - target: {fileID: 2005853267813153463, guid: 7d375ea870c0d9b4b880684bd471d5d9,
        type: 3}
      propertyPath: m_LocalPosition.x
      value: 0
      objectReference: {fileID: 0}
    - target: {fileID: 2005853267813153463, guid: 7d375ea870c0d9b4b880684bd471d5d9,
        type: 3}
      propertyPath: m_LocalPosition.y
      value: 0
      objectReference: {fileID: 0}
    - target: {fileID: 2005853267813153463, guid: 7d375ea870c0d9b4b880684bd471d5d9,
        type: 3}
      propertyPath: m_LocalPosition.z
      value: 0
      objectReference: {fileID: 0}
    - target: {fileID: 2005853267813153463, guid: 7d375ea870c0d9b4b880684bd471d5d9,
        type: 3}
      propertyPath: m_LocalRotation.w
      value: 1
      objectReference: {fileID: 0}
    - target: {fileID: 2005853267813153463, guid: 7d375ea870c0d9b4b880684bd471d5d9,
        type: 3}
      propertyPath: m_LocalRotation.x
      value: 0
      objectReference: {fileID: 0}
    - target: {fileID: 2005853267813153463, guid: 7d375ea870c0d9b4b880684bd471d5d9,
        type: 3}
      propertyPath: m_LocalRotation.y
      value: 0
      objectReference: {fileID: 0}
    - target: {fileID: 2005853267813153463, guid: 7d375ea870c0d9b4b880684bd471d5d9,
        type: 3}
      propertyPath: m_LocalRotation.z
      value: 0
      objectReference: {fileID: 0}
    - target: {fileID: 2005853267813153463, guid: 7d375ea870c0d9b4b880684bd471d5d9,
        type: 3}
      propertyPath: m_AnchoredPosition.x
      value: 0
      objectReference: {fileID: 0}
    - target: {fileID: 2005853267813153463, guid: 7d375ea870c0d9b4b880684bd471d5d9,
        type: 3}
      propertyPath: m_AnchoredPosition.y
      value: 0
      objectReference: {fileID: 0}
    - target: {fileID: 2005853267813153463, guid: 7d375ea870c0d9b4b880684bd471d5d9,
        type: 3}
      propertyPath: m_LocalEulerAnglesHint.x
      value: 0
      objectReference: {fileID: 0}
    - target: {fileID: 2005853267813153463, guid: 7d375ea870c0d9b4b880684bd471d5d9,
        type: 3}
      propertyPath: m_LocalEulerAnglesHint.y
      value: 0
      objectReference: {fileID: 0}
    - target: {fileID: 2005853267813153463, guid: 7d375ea870c0d9b4b880684bd471d5d9,
        type: 3}
      propertyPath: m_LocalEulerAnglesHint.z
      value: 0
      objectReference: {fileID: 0}
    m_RemovedComponents: []
  m_SourcePrefab: {fileID: 100100000, guid: 7d375ea870c0d9b4b880684bd471d5d9, type: 3}
--- !u!224 &3084269115362615759 stripped
RectTransform:
  m_CorrespondingSourceObject: {fileID: 2005853267813153463, guid: 7d375ea870c0d9b4b880684bd471d5d9,
    type: 3}
  m_PrefabInstance: {fileID: 3538631390258699128}
  m_PrefabAsset: {fileID: 0}
--- !u!1001 &3538631390619346582
PrefabInstance:
  m_ObjectHideFlags: 0
  serializedVersion: 2
  m_Modification:
    m_TransformParent: {fileID: 3538631390085162430}
    m_Modifications:
    - target: {fileID: 2005853267813153462, guid: 7d375ea870c0d9b4b880684bd471d5d9,
        type: 3}
      propertyPath: m_Name
      value: asteroid_img (1)
      objectReference: {fileID: 0}
    - target: {fileID: 2005853267813153463, guid: 7d375ea870c0d9b4b880684bd471d5d9,
        type: 3}
      propertyPath: m_Pivot.x
      value: 0.5
      objectReference: {fileID: 0}
    - target: {fileID: 2005853267813153463, guid: 7d375ea870c0d9b4b880684bd471d5d9,
        type: 3}
      propertyPath: m_Pivot.y
      value: 0.5
      objectReference: {fileID: 0}
    - target: {fileID: 2005853267813153463, guid: 7d375ea870c0d9b4b880684bd471d5d9,
        type: 3}
      propertyPath: m_RootOrder
      value: 0
      objectReference: {fileID: 0}
    - target: {fileID: 2005853267813153463, guid: 7d375ea870c0d9b4b880684bd471d5d9,
        type: 3}
      propertyPath: m_AnchorMax.x
      value: 0.5
      objectReference: {fileID: 0}
    - target: {fileID: 2005853267813153463, guid: 7d375ea870c0d9b4b880684bd471d5d9,
        type: 3}
      propertyPath: m_AnchorMax.y
      value: 0.5
      objectReference: {fileID: 0}
    - target: {fileID: 2005853267813153463, guid: 7d375ea870c0d9b4b880684bd471d5d9,
        type: 3}
      propertyPath: m_AnchorMin.x
      value: 0.5
      objectReference: {fileID: 0}
    - target: {fileID: 2005853267813153463, guid: 7d375ea870c0d9b4b880684bd471d5d9,
        type: 3}
      propertyPath: m_AnchorMin.y
      value: 0.5
      objectReference: {fileID: 0}
    - target: {fileID: 2005853267813153463, guid: 7d375ea870c0d9b4b880684bd471d5d9,
        type: 3}
      propertyPath: m_SizeDelta.x
      value: 5
      objectReference: {fileID: 0}
    - target: {fileID: 2005853267813153463, guid: 7d375ea870c0d9b4b880684bd471d5d9,
        type: 3}
      propertyPath: m_SizeDelta.y
      value: 5
      objectReference: {fileID: 0}
    - target: {fileID: 2005853267813153463, guid: 7d375ea870c0d9b4b880684bd471d5d9,
        type: 3}
      propertyPath: m_LocalPosition.x
      value: 0
      objectReference: {fileID: 0}
    - target: {fileID: 2005853267813153463, guid: 7d375ea870c0d9b4b880684bd471d5d9,
        type: 3}
      propertyPath: m_LocalPosition.y
      value: 0
      objectReference: {fileID: 0}
    - target: {fileID: 2005853267813153463, guid: 7d375ea870c0d9b4b880684bd471d5d9,
        type: 3}
      propertyPath: m_LocalPosition.z
      value: 0
      objectReference: {fileID: 0}
    - target: {fileID: 2005853267813153463, guid: 7d375ea870c0d9b4b880684bd471d5d9,
        type: 3}
      propertyPath: m_LocalRotation.w
      value: 1
      objectReference: {fileID: 0}
    - target: {fileID: 2005853267813153463, guid: 7d375ea870c0d9b4b880684bd471d5d9,
        type: 3}
      propertyPath: m_LocalRotation.x
      value: 0
      objectReference: {fileID: 0}
    - target: {fileID: 2005853267813153463, guid: 7d375ea870c0d9b4b880684bd471d5d9,
        type: 3}
      propertyPath: m_LocalRotation.y
      value: 0
      objectReference: {fileID: 0}
    - target: {fileID: 2005853267813153463, guid: 7d375ea870c0d9b4b880684bd471d5d9,
        type: 3}
      propertyPath: m_LocalRotation.z
      value: 0
      objectReference: {fileID: 0}
    - target: {fileID: 2005853267813153463, guid: 7d375ea870c0d9b4b880684bd471d5d9,
        type: 3}
      propertyPath: m_AnchoredPosition.x
      value: 0
      objectReference: {fileID: 0}
    - target: {fileID: 2005853267813153463, guid: 7d375ea870c0d9b4b880684bd471d5d9,
        type: 3}
      propertyPath: m_AnchoredPosition.y
      value: 0
      objectReference: {fileID: 0}
    - target: {fileID: 2005853267813153463, guid: 7d375ea870c0d9b4b880684bd471d5d9,
        type: 3}
      propertyPath: m_LocalEulerAnglesHint.x
      value: 0
      objectReference: {fileID: 0}
    - target: {fileID: 2005853267813153463, guid: 7d375ea870c0d9b4b880684bd471d5d9,
        type: 3}
      propertyPath: m_LocalEulerAnglesHint.y
      value: 0
      objectReference: {fileID: 0}
    - target: {fileID: 2005853267813153463, guid: 7d375ea870c0d9b4b880684bd471d5d9,
        type: 3}
      propertyPath: m_LocalEulerAnglesHint.z
      value: 0
      objectReference: {fileID: 0}
    m_RemovedComponents: []
  m_SourcePrefab: {fileID: 100100000, guid: 7d375ea870c0d9b4b880684bd471d5d9, type: 3}
--- !u!224 &3084269115001969697 stripped
RectTransform:
  m_CorrespondingSourceObject: {fileID: 2005853267813153463, guid: 7d375ea870c0d9b4b880684bd471d5d9,
    type: 3}
  m_PrefabInstance: {fileID: 3538631390619346582}
  m_PrefabAsset: {fileID: 0}
--- !u!1001 &3538631390860235936
PrefabInstance:
  m_ObjectHideFlags: 0
  serializedVersion: 2
  m_Modification:
    m_TransformParent: {fileID: 3538631390085162430}
    m_Modifications:
    - target: {fileID: 2005853267813153462, guid: 7d375ea870c0d9b4b880684bd471d5d9,
        type: 3}
      propertyPath: m_Name
      value: asteroid_img
      objectReference: {fileID: 0}
    - target: {fileID: 2005853267813153463, guid: 7d375ea870c0d9b4b880684bd471d5d9,
        type: 3}
      propertyPath: m_Pivot.x
      value: 0.5
      objectReference: {fileID: 0}
    - target: {fileID: 2005853267813153463, guid: 7d375ea870c0d9b4b880684bd471d5d9,
        type: 3}
      propertyPath: m_Pivot.y
      value: 0.5
      objectReference: {fileID: 0}
    - target: {fileID: 2005853267813153463, guid: 7d375ea870c0d9b4b880684bd471d5d9,
        type: 3}
      propertyPath: m_RootOrder
      value: 3
      objectReference: {fileID: 0}
    - target: {fileID: 2005853267813153463, guid: 7d375ea870c0d9b4b880684bd471d5d9,
        type: 3}
      propertyPath: m_AnchorMax.x
      value: 0.5
      objectReference: {fileID: 0}
    - target: {fileID: 2005853267813153463, guid: 7d375ea870c0d9b4b880684bd471d5d9,
        type: 3}
      propertyPath: m_AnchorMax.y
      value: 0.5
      objectReference: {fileID: 0}
    - target: {fileID: 2005853267813153463, guid: 7d375ea870c0d9b4b880684bd471d5d9,
        type: 3}
      propertyPath: m_AnchorMin.x
      value: 0.5
      objectReference: {fileID: 0}
    - target: {fileID: 2005853267813153463, guid: 7d375ea870c0d9b4b880684bd471d5d9,
        type: 3}
      propertyPath: m_AnchorMin.y
      value: 0.5
      objectReference: {fileID: 0}
    - target: {fileID: 2005853267813153463, guid: 7d375ea870c0d9b4b880684bd471d5d9,
        type: 3}
      propertyPath: m_SizeDelta.x
      value: 5
      objectReference: {fileID: 0}
    - target: {fileID: 2005853267813153463, guid: 7d375ea870c0d9b4b880684bd471d5d9,
        type: 3}
      propertyPath: m_SizeDelta.y
      value: 5
      objectReference: {fileID: 0}
    - target: {fileID: 2005853267813153463, guid: 7d375ea870c0d9b4b880684bd471d5d9,
        type: 3}
      propertyPath: m_LocalPosition.x
      value: 0
      objectReference: {fileID: 0}
    - target: {fileID: 2005853267813153463, guid: 7d375ea870c0d9b4b880684bd471d5d9,
        type: 3}
      propertyPath: m_LocalPosition.y
      value: 0
      objectReference: {fileID: 0}
    - target: {fileID: 2005853267813153463, guid: 7d375ea870c0d9b4b880684bd471d5d9,
        type: 3}
      propertyPath: m_LocalPosition.z
      value: 0
      objectReference: {fileID: 0}
    - target: {fileID: 2005853267813153463, guid: 7d375ea870c0d9b4b880684bd471d5d9,
        type: 3}
      propertyPath: m_LocalRotation.w
      value: 1
      objectReference: {fileID: 0}
    - target: {fileID: 2005853267813153463, guid: 7d375ea870c0d9b4b880684bd471d5d9,
        type: 3}
      propertyPath: m_LocalRotation.x
      value: 0
      objectReference: {fileID: 0}
    - target: {fileID: 2005853267813153463, guid: 7d375ea870c0d9b4b880684bd471d5d9,
        type: 3}
      propertyPath: m_LocalRotation.y
      value: 0
      objectReference: {fileID: 0}
    - target: {fileID: 2005853267813153463, guid: 7d375ea870c0d9b4b880684bd471d5d9,
        type: 3}
      propertyPath: m_LocalRotation.z
      value: 0
      objectReference: {fileID: 0}
    - target: {fileID: 2005853267813153463, guid: 7d375ea870c0d9b4b880684bd471d5d9,
        type: 3}
      propertyPath: m_AnchoredPosition.x
      value: 0
      objectReference: {fileID: 0}
    - target: {fileID: 2005853267813153463, guid: 7d375ea870c0d9b4b880684bd471d5d9,
        type: 3}
      propertyPath: m_AnchoredPosition.y
      value: 0
      objectReference: {fileID: 0}
    - target: {fileID: 2005853267813153463, guid: 7d375ea870c0d9b4b880684bd471d5d9,
        type: 3}
      propertyPath: m_LocalEulerAnglesHint.x
      value: 0
      objectReference: {fileID: 0}
    - target: {fileID: 2005853267813153463, guid: 7d375ea870c0d9b4b880684bd471d5d9,
        type: 3}
      propertyPath: m_LocalEulerAnglesHint.y
      value: 0
      objectReference: {fileID: 0}
    - target: {fileID: 2005853267813153463, guid: 7d375ea870c0d9b4b880684bd471d5d9,
        type: 3}
      propertyPath: m_LocalEulerAnglesHint.z
      value: 0
      objectReference: {fileID: 0}
    m_RemovedComponents: []
  m_SourcePrefab: {fileID: 100100000, guid: 7d375ea870c0d9b4b880684bd471d5d9, type: 3}
--- !u!224 &3084269114085764631 stripped
RectTransform:
  m_CorrespondingSourceObject: {fileID: 2005853267813153463, guid: 7d375ea870c0d9b4b880684bd471d5d9,
    type: 3}
  m_PrefabInstance: {fileID: 3538631390860235936}
  m_PrefabAsset: {fileID: 0}
--- !u!1001 &3538631391038247939
PrefabInstance:
  m_ObjectHideFlags: 0
  serializedVersion: 2
  m_Modification:
    m_TransformParent: {fileID: 3538631390085162430}
    m_Modifications:
    - target: {fileID: 2005853267813153462, guid: 7d375ea870c0d9b4b880684bd471d5d9,
        type: 3}
      propertyPath: m_Name
      value: asteroid_img (3)
      objectReference: {fileID: 0}
    - target: {fileID: 2005853267813153463, guid: 7d375ea870c0d9b4b880684bd471d5d9,
        type: 3}
      propertyPath: m_Pivot.x
      value: 0.5
      objectReference: {fileID: 0}
    - target: {fileID: 2005853267813153463, guid: 7d375ea870c0d9b4b880684bd471d5d9,
        type: 3}
      propertyPath: m_Pivot.y
      value: 0.5
      objectReference: {fileID: 0}
    - target: {fileID: 2005853267813153463, guid: 7d375ea870c0d9b4b880684bd471d5d9,
        type: 3}
      propertyPath: m_RootOrder
      value: 5
      objectReference: {fileID: 0}
    - target: {fileID: 2005853267813153463, guid: 7d375ea870c0d9b4b880684bd471d5d9,
        type: 3}
      propertyPath: m_AnchorMax.x
      value: 0.5
      objectReference: {fileID: 0}
    - target: {fileID: 2005853267813153463, guid: 7d375ea870c0d9b4b880684bd471d5d9,
        type: 3}
      propertyPath: m_AnchorMax.y
      value: 0.5
      objectReference: {fileID: 0}
    - target: {fileID: 2005853267813153463, guid: 7d375ea870c0d9b4b880684bd471d5d9,
        type: 3}
      propertyPath: m_AnchorMin.x
      value: 0.5
      objectReference: {fileID: 0}
    - target: {fileID: 2005853267813153463, guid: 7d375ea870c0d9b4b880684bd471d5d9,
        type: 3}
      propertyPath: m_AnchorMin.y
      value: 0.5
      objectReference: {fileID: 0}
    - target: {fileID: 2005853267813153463, guid: 7d375ea870c0d9b4b880684bd471d5d9,
        type: 3}
      propertyPath: m_SizeDelta.x
      value: 5
      objectReference: {fileID: 0}
    - target: {fileID: 2005853267813153463, guid: 7d375ea870c0d9b4b880684bd471d5d9,
        type: 3}
      propertyPath: m_SizeDelta.y
      value: 5
      objectReference: {fileID: 0}
    - target: {fileID: 2005853267813153463, guid: 7d375ea870c0d9b4b880684bd471d5d9,
        type: 3}
      propertyPath: m_LocalPosition.x
      value: 0
      objectReference: {fileID: 0}
    - target: {fileID: 2005853267813153463, guid: 7d375ea870c0d9b4b880684bd471d5d9,
        type: 3}
      propertyPath: m_LocalPosition.y
      value: 0
      objectReference: {fileID: 0}
    - target: {fileID: 2005853267813153463, guid: 7d375ea870c0d9b4b880684bd471d5d9,
        type: 3}
      propertyPath: m_LocalPosition.z
      value: 0
      objectReference: {fileID: 0}
    - target: {fileID: 2005853267813153463, guid: 7d375ea870c0d9b4b880684bd471d5d9,
        type: 3}
      propertyPath: m_LocalRotation.w
      value: 1
      objectReference: {fileID: 0}
    - target: {fileID: 2005853267813153463, guid: 7d375ea870c0d9b4b880684bd471d5d9,
        type: 3}
      propertyPath: m_LocalRotation.x
      value: 0
      objectReference: {fileID: 0}
    - target: {fileID: 2005853267813153463, guid: 7d375ea870c0d9b4b880684bd471d5d9,
        type: 3}
      propertyPath: m_LocalRotation.y
      value: 0
      objectReference: {fileID: 0}
    - target: {fileID: 2005853267813153463, guid: 7d375ea870c0d9b4b880684bd471d5d9,
        type: 3}
      propertyPath: m_LocalRotation.z
      value: 0
      objectReference: {fileID: 0}
    - target: {fileID: 2005853267813153463, guid: 7d375ea870c0d9b4b880684bd471d5d9,
        type: 3}
      propertyPath: m_AnchoredPosition.x
      value: 0
      objectReference: {fileID: 0}
    - target: {fileID: 2005853267813153463, guid: 7d375ea870c0d9b4b880684bd471d5d9,
        type: 3}
      propertyPath: m_AnchoredPosition.y
      value: 0
      objectReference: {fileID: 0}
    - target: {fileID: 2005853267813153463, guid: 7d375ea870c0d9b4b880684bd471d5d9,
        type: 3}
      propertyPath: m_LocalEulerAnglesHint.x
      value: 0
      objectReference: {fileID: 0}
    - target: {fileID: 2005853267813153463, guid: 7d375ea870c0d9b4b880684bd471d5d9,
        type: 3}
      propertyPath: m_LocalEulerAnglesHint.y
      value: 0
      objectReference: {fileID: 0}
    - target: {fileID: 2005853267813153463, guid: 7d375ea870c0d9b4b880684bd471d5d9,
        type: 3}
      propertyPath: m_LocalEulerAnglesHint.z
      value: 0
      objectReference: {fileID: 0}
    m_RemovedComponents: []
  m_SourcePrefab: {fileID: 100100000, guid: 7d375ea870c0d9b4b880684bd471d5d9, type: 3}
--- !u!224 &3084269114046197428 stripped
RectTransform:
  m_CorrespondingSourceObject: {fileID: 2005853267813153463, guid: 7d375ea870c0d9b4b880684bd471d5d9,
    type: 3}
  m_PrefabInstance: {fileID: 3538631391038247939}
  m_PrefabAsset: {fileID: 0}
