%YAML 1.1
%TAG !u! tag:unity3d.com,2011:
--- !u!1 &8100106090493808347
GameObject:
  m_ObjectHideFlags: 0
  m_CorrespondingSourceObject: {fileID: 0}
  m_PrefabInstance: {fileID: 0}
  m_PrefabAsset: {fileID: 0}
  serializedVersion: 6
  m_Component:
  - component: {fileID: 1897299954540411679}
  m_Layer: 0
  m_Name: BatteryUncharged
  m_TagString: Untagged
  m_Icon: {fileID: 0}
  m_NavMeshLayer: 0
  m_StaticEditorFlags: 0
  m_IsActive: 1
--- !u!4 &1897299954540411679
Transform:
  m_ObjectHideFlags: 0
  m_CorrespondingSourceObject: {fileID: 0}
  m_PrefabInstance: {fileID: 0}
  m_PrefabAsset: {fileID: 0}
  m_GameObject: {fileID: 8100106090493808347}
  m_LocalRotation: {x: 0, y: 0, z: 0, w: 1}
  m_LocalPosition: {x: 0, y: 0, z: 0}
  m_LocalScale: {x: 1, y: 1, z: 1}
  m_Children:
  - {fileID: 2261851456141287500}
  m_Father: {fileID: 0}
  m_RootOrder: 0
  m_LocalEulerAnglesHint: {x: 0, y: 0, z: 0}
--- !u!1001 &1794979769645598631
PrefabInstance:
  m_ObjectHideFlags: 0
  serializedVersion: 2
  m_Modification:
    m_TransformParent: {fileID: 1897299954540411679}
    m_Modifications:
    - target: {fileID: -8679921383154817045, guid: 78a2acb722a67bc4292cdf9f38834999,
        type: 3}
      propertyPath: m_RootOrder
      value: 0
      objectReference: {fileID: 0}
    - target: {fileID: -8679921383154817045, guid: 78a2acb722a67bc4292cdf9f38834999,
        type: 3}
      propertyPath: m_LocalPosition.x
      value: 0
      objectReference: {fileID: 0}
    - target: {fileID: -8679921383154817045, guid: 78a2acb722a67bc4292cdf9f38834999,
        type: 3}
      propertyPath: m_LocalPosition.y
      value: 0
      objectReference: {fileID: 0}
    - target: {fileID: -8679921383154817045, guid: 78a2acb722a67bc4292cdf9f38834999,
        type: 3}
      propertyPath: m_LocalPosition.z
      value: 0
      objectReference: {fileID: 0}
    - target: {fileID: -8679921383154817045, guid: 78a2acb722a67bc4292cdf9f38834999,
        type: 3}
      propertyPath: m_LocalRotation.w
      value: 0.50045747
      objectReference: {fileID: 0}
    - target: {fileID: -8679921383154817045, guid: 78a2acb722a67bc4292cdf9f38834999,
        type: 3}
      propertyPath: m_LocalRotation.x
      value: -0.49988928
      objectReference: {fileID: 0}
    - target: {fileID: -8679921383154817045, guid: 78a2acb722a67bc4292cdf9f38834999,
        type: 3}
      propertyPath: m_LocalRotation.y
      value: -0.5001104
      objectReference: {fileID: 0}
    - target: {fileID: -8679921383154817045, guid: 78a2acb722a67bc4292cdf9f38834999,
        type: 3}
      propertyPath: m_LocalRotation.z
      value: -0.4995425
      objectReference: {fileID: 0}
    - target: {fileID: -8679921383154817045, guid: 78a2acb722a67bc4292cdf9f38834999,
        type: 3}
      propertyPath: m_LocalEulerAnglesHint.x
      value: -89.941
      objectReference: {fileID: 0}
    - target: {fileID: -8679921383154817045, guid: 78a2acb722a67bc4292cdf9f38834999,
        type: 3}
      propertyPath: m_LocalEulerAnglesHint.y
      value: 0
      objectReference: {fileID: 0}
    - target: {fileID: -8679921383154817045, guid: 78a2acb722a67bc4292cdf9f38834999,
        type: 3}
      propertyPath: m_LocalEulerAnglesHint.z
      value: -89.895
      objectReference: {fileID: 0}
    - target: {fileID: -7511558181221131132, guid: 78a2acb722a67bc4292cdf9f38834999,
        type: 3}
      propertyPath: m_Materials.Array.data[0]
      value: 
      objectReference: {fileID: 2100000, guid: ea739d2a7e459814a956e29ed42498f8, type: 2}
    - target: {fileID: 919132149155446097, guid: 78a2acb722a67bc4292cdf9f38834999,
        type: 3}
      propertyPath: m_Name
      value: battery_block
      objectReference: {fileID: 0}
    m_RemovedComponents: []
  m_SourcePrefab: {fileID: 100100000, guid: 78a2acb722a67bc4292cdf9f38834999, type: 3}
--- !u!4 &2261851456141287500 stripped
Transform:
  m_CorrespondingSourceObject: {fileID: -8679921383154817045, guid: 78a2acb722a67bc4292cdf9f38834999,
    type: 3}
  m_PrefabInstance: {fileID: 1794979769645598631}
  m_PrefabAsset: {fileID: 0}
