 10.4472  23.8639  189.637
 2.58119  59.3039  294.183
 169.264  76.6307  266.516
  38.202  38.3528  79.4652
 347.556  146.937  219.574
 335.982  37.7278  292.572
 191.486  45.0765  30.1461
 81.2358  79.2329  275.697
 269.389  61.6548  83.7785
 316.472   105.13   23.031
 80.2594  155.095  31.1733
 150.716  114.877   103.67
 179.293  106.886  78.3859
 232.815  40.4118  53.2424
  332.83  125.852  207.978
 124.023  109.515  64.6007
 32.4279  83.8837 0.661313
 140.431  111.846  0.56868
 75.0216  59.2042  179.917
 320.096  25.8683  102.121
 351.516  25.1389  187.463
 299.265  15.7175  336.763
 156.524  65.5451  106.127
 283.856  77.8548  42.4157
 144.257  80.3787  276.553
 281.621  81.9813  215.564
 320.081  92.3918  176.825
 118.049  119.079  137.562
 3.47087  98.9643  99.6295
 54.0039  88.4076   94.661
 259.096  60.0603  266.561
  174.65  117.884  323.442
 192.186  145.457  327.871
 314.285  75.3324  167.593
 28.4435  96.1151  270.344
 2.52256  89.4803   220.92
 230.052  56.9894  222.942
 303.007  37.1903  218.755
 241.139  116.501  124.798
 72.9903  151.023  197.131
 238.929  31.7483  47.5741
 99.7694   46.425  276.077
 73.5976  80.7524  235.332
 187.675   41.253  196.618
 46.1072  102.213  289.576
 155.168  117.691  41.5359
 278.043  66.8473  46.9462
 160.171  106.127  282.426
 164.363  58.2128   309.37
 200.075  109.669    52.77
 312.404  104.697  235.566
 208.607  133.962  186.701
 139.733  44.5792  1.95072
 239.337   105.84  250.707
 61.5195  114.725  275.054
 25.6465  27.3038  181.738
 234.369  103.414  327.601
 150.691  39.5353  54.9842
 149.112  102.311  79.9844
 261.549  108.019  3.34127
 138.561  142.738  291.867
 117.847  51.2604  336.376
 206.627  136.273  30.7616
 178.893  115.298  233.426
  54.554  150.753   37.826
 95.9979  14.3506  228.645
  83.835  156.843  105.009
 175.044  124.955   318.32
 222.329  92.0329   125.04
 156.115  101.732  264.084
 307.127  96.1658  359.574
 53.4061  170.693  34.5258
  337.15   71.245  161.316
  121.16  108.196   99.903
 186.373  126.883   258.48
 348.894  46.7701  33.6823
 118.893  33.9999  20.7454
 359.422  89.7143  263.653
 8.60265  88.1702  85.5641
 301.627  79.9429  88.0361
  318.43  100.418  253.756
 172.324  50.0538  84.0867
 273.281  69.0726  217.018
 66.0448  41.5506  33.1077
 150.554  30.4121  324.688
 164.462  50.3549   182.91
 353.226  36.2661  225.002
 311.456  110.459  242.012
 298.183  131.253   101.11
 233.373  125.183   127.86
  328.24  66.8057  49.2253
 2.49988  81.5664  195.161
 100.173  153.569  83.9388
 1.09051  123.074  190.326
  50.096   42.685  348.396
 194.865  106.753  2.92327
 63.6746  67.0835  165.023
 23.5281  87.1726  265.201
 286.436  113.483  320.149
 232.957  96.5338  320.741
 333.161  78.0766  226.142
 92.8073  93.6439  239.067
 45.0229  94.6654  273.106
 40.3799  80.9391  230.448
 14.6163   98.436   173.91
 236.293  121.949  60.1877
 90.9336  38.4252  200.887
 200.064  13.1618  234.814
 91.8569  102.475  55.2068
 211.374  41.8257  295.877
 216.305  134.438   170.83
 17.3188  97.2454   19.048
 315.365  113.789  33.4022
 215.515  41.0808  91.0282
 206.549   108.57  58.8612
 61.0319  97.1514  156.121
 4.46157  105.648  3.08203
 205.853  168.714  36.2766
 221.107  134.304  294.677
 178.384  103.659  141.246
 229.349  45.9901  38.9317
 340.431  86.0796  343.748
 5.55511  52.6586  3.88747
 45.2887  130.239  176.191
 349.897  64.8534  62.6724
 74.5413  68.7405  331.544
 280.694  119.507   14.851
 308.575  63.1394  297.559
 67.9579   132.45   275.41
 155.047  119.602  99.5143
 91.0871  108.315  304.317
 148.134  24.9932  231.255
 264.331  103.761  260.182
 239.623  43.6014  140.925
 2.96742   80.884  85.9733
 253.411  86.5989  329.101
 85.2611  9.74201  156.826
  231.79  102.473  249.288
 127.891  64.2895  23.0467
 155.238  146.588  309.984
   297.6  148.682  321.727
 58.8063  101.919  347.252
 121.176  105.869  282.063
 272.843  56.4549  68.0577
 259.566  43.3706  64.0695
 14.9089  125.693  105.293
 54.5981  100.255   110.12
 136.006   86.172  4.46679
 124.906  144.961  318.231
 121.633  43.3022  282.463
 126.273  129.851  136.185
   306.1  146.207  229.197
  311.66  138.944  290.998
  314.68  75.5088  23.7386
 90.6181   79.091  313.807
 162.127  38.9181  341.971
  88.504  93.2581  47.0584
 205.446  72.1033  219.703
 126.616  87.0362  52.6576
 9.76078  57.6687  327.015
 16.2052  145.363  238.895
 11.0511  121.213  31.2884
 273.901  93.5414  26.5773
 13.5173  93.0911  324.513
 197.394  112.722  71.4336
 358.795  170.302  79.1019
 154.214  52.9024  244.793
 101.093  114.737   192.81
 142.075  70.1331  149.621
 306.717  136.537  28.8242
 285.496   150.52   174.79
 304.325  100.141  135.571
 65.7936  127.083  91.1431
 185.426  119.356  247.033
 171.107  53.7046  55.3404
 287.881  100.311  332.594
 219.332  41.4344  223.471
 305.611  145.089  284.416
 281.525  143.473  23.5141
 73.4584    119.2  57.5295
 89.4775  156.081   331.82
 274.081  148.653  272.541
 285.812  108.083  100.335
 338.514   62.607  329.896
 265.276  83.0166  11.2828
 208.307  70.8876  195.846
 127.781  129.242  270.019
 27.5807  107.081   175.74
 115.357  136.126  143.157
 202.985  55.8579  19.3785
 212.835    86.54  115.026
 33.4627  100.261  329.284
 219.599  129.151  209.785
 302.391  33.0508  170.199
 155.925  67.6658  114.474
 192.136  51.2104  326.896
 91.1995  101.857  328.612
 339.698  132.895  197.739
 309.753  37.5884  304.607
 126.003  74.0784  101.027
 168.822  119.898  88.8523
 37.5808  61.3162  282.522
 261.272  139.093  216.579
 37.4116  60.0807  86.3237
  292.16  80.7829  150.545
 227.913  34.7392  55.6262
 53.6637  81.9731  60.4539
 68.8093  103.352  243.324
 59.5909  64.2932  323.318
 305.888  96.8952  206.524
 128.846  51.8903  340.301
 50.8478  35.3828  190.759
 79.3912  60.5494  87.8986
 157.531  75.9888  101.933
 69.3372  134.251  331.967
 169.803  128.617  194.378
 181.977  95.2307    180.8
  354.54  62.5964  147.554
 158.715  52.9208  230.693
 255.677  160.957  254.514
  337.74  117.412  85.7275
 69.9919  93.5017  336.245
 61.3628  110.254  84.4101
 236.001  19.2707  93.6744
 255.715  151.989  199.841
 9.97522  169.959  97.1937
 311.775  145.269  57.1381
 116.223  55.1239  93.5214
 248.148  134.915  305.888
 178.679  106.595  45.4024
 286.079  109.594  279.229
 327.686  54.2742  9.16823
 276.401  47.5712  222.655
 31.5031  69.9701  97.7947
 119.245  85.1767  9.45196
  158.02  10.6056  146.579
 224.287  134.047  253.868
 107.786  68.3222  335.374
 29.3973  37.0564  21.4913
 312.325  95.6627  25.8119
 264.351  38.2525  85.4574
 8.63008  122.284  44.0024
 273.665  47.0428  26.4827
 227.521  152.893  64.6272
 225.255  60.7421  314.342
 261.589   74.439   306.34
 215.698  123.517  308.009
 351.371  19.3909  198.159
 305.917  65.0089  155.476
 309.824  147.532  320.904
 358.182  63.9672  30.6018
 319.714  100.007  221.637
 242.672  27.2267  129.857
 224.563  132.423  253.011
 329.629   98.159  241.571
 326.608  156.398  358.665
 254.401  50.2091  73.0969
 162.164  109.055  174.921
 174.153   159.01  23.8259
 122.936  99.5201  56.8946
 213.547  116.342   307.16
 82.5157  22.9355  6.97261
 341.164  91.3894   65.431
 71.1425   154.63  203.969
  6.7624  87.3228  127.434
 187.186  37.2309  328.291
  108.55  12.8032  293.418
 319.732  130.576    184.1
 260.368  92.6764  133.092
 357.941  72.5914  165.527
 238.363   134.12  302.167
 240.876  90.4897  36.5426
  60.267  117.345  73.3469
 249.924  80.9323  136.181
 77.7862  34.9395  95.2161
 206.155  52.9353   14.509
 102.804  108.047  160.078
 296.211  62.3808  234.684
 10.5591   105.58  331.726
 154.462  85.1711  119.063
 320.375  82.9556  230.671
 169.121  22.5918  253.846
 74.6898  137.494  354.817
 127.106  68.8151    182.9
 306.288  77.4815  104.461
 47.6513  88.5559  67.3191
 256.335  108.105  283.694
  314.29  173.074  157.158
 43.2986  87.3007  20.3024
 346.921  87.7336  330.484
 46.1222  104.438  37.1754
 105.446  93.3741  238.745
 296.786  38.0474  80.2989
 303.676  112.306  185.543
 282.341  61.4757  54.9739
 217.115  97.0513  88.2935
 216.936   103.07  63.8098
 106.782   63.708  26.6765
 333.675  78.3842  287.836
 306.991  108.707  141.946
 274.685  60.4495  52.9175
 2.07641  61.9243  312.895
0.908505  92.7468  43.6865
 312.543  30.6783  331.879
 29.3052  101.983  195.393
 266.245  173.078  9.32446
 251.387  92.4311  26.0246
 74.3534  70.2831  44.9098
 259.736  49.1892  235.635
 148.953  120.773  213.587
 148.718  115.376  103.234
 305.096  80.7613  42.1147
 85.2518  151.933  174.291
 69.9255  37.9601  327.067
 255.319  74.1207  30.7499
 292.398  94.0406  28.3033
 252.597  89.0887  29.8133
 136.943  96.5909  163.015
 59.5832  137.773  196.787
 89.8774  55.8649  60.8316
 325.116  127.919  23.1818
 161.067  51.6106  82.4379
 132.351  33.3294   32.264
 281.329  119.336  104.228
 196.415  30.1487   90.012
 148.525  102.555   318.04
 162.261  108.355  84.2891
 268.998  105.636  170.821
 6.53159  104.715   105.13
 191.183   87.744  265.578
  144.37  66.1984   242.73
 88.0892  115.002   111.17
    57.3  42.9384  119.524
 166.377  49.4973  43.6398
 265.774  106.109  292.926
 332.759  72.3422   160.55
 328.272  104.115  306.574
 8.66845  95.2082  157.664
 315.156  74.5503  125.708
 218.238  77.5335  26.8037
 162.759  144.259  60.6155
  114.98  96.6649  235.367
 30.4312  54.0615  340.698
 333.598  53.5609  339.716
 153.034  118.905  210.171
 192.689  51.4307  136.505
 87.4546  24.1369  185.198
 199.563  39.3114  278.606
 264.733  128.859  16.4057
 335.189   140.16  240.955
 309.089  117.972  136.162
 309.293  25.1503 0.427233
 271.025  144.524  259.611
 316.482  71.3554  158.105
 120.393  149.755  319.623
 311.794  36.2834  204.194
 89.1697  23.2376  321.552
 313.957  24.2475  187.588
 136.514  42.8913  231.505
 324.126  139.595  36.1116
 134.706  83.9722  153.847
 27.8717  59.5052  10.6051
 82.2742  136.354  255.894
 316.483  66.6054  242.382
 72.3731  55.5748  302.737
 334.704  53.2773  314.694
 148.937  132.617  226.694
 43.7819  50.7843  127.628
 167.623  61.4054  219.517
 271.393  80.4151  338.597
 223.285   78.451  190.343
 224.875  161.326  94.7142
 318.171  65.3511  167.114
 343.345  136.168  293.145
 277.467  31.8518  185.974
 242.052  31.9704  162.344
  347.03  113.862  66.7814
  36.581  84.9757  71.0939
  255.77  125.393  170.861
   114.3  58.1292  24.8728
 229.744   74.146  43.5996
 76.2967  84.7701  10.5971
 163.491  36.6063  39.7398
 181.043  54.1673  246.588
 259.521  71.7294  209.891
 194.416  150.184  183.911
 55.4779  91.7673  337.016
 43.8921  121.527  251.108
 192.553   88.421  5.04213
 178.766  63.1215  251.871
 105.849  20.5498  166.462
 302.181  150.347  284.944
 39.8186  45.3931  159.039
 57.7175  140.695  100.905
 186.679  72.5044  280.597
 55.3627  101.356  37.1075
 83.5996  134.126  274.005
 326.492  57.1795  134.276
 124.861  45.4731  256.691
 195.351  116.878  322.754
  213.34  150.192  131.555
 111.817  47.4089  228.432
 65.9871  76.4334  209.422
 1.75786  86.7004  242.924
  264.96  120.773  254.965
 326.557  117.902  148.523
 238.173  43.2024  260.001
 47.8038   119.56  310.441
 268.419  29.0115  178.642
 289.167    41.94  15.3738
 287.948  124.108  247.332
 278.911   154.97  222.026
 64.3148  35.3892  60.6866
 159.551  44.3695  211.241
 292.663  83.0742   274.72
 131.019  101.811  118.254
 289.686  92.3926  26.3661
  291.66  77.1757  190.783
 310.936  70.8478 0.482466
 67.4483  102.073  231.454
 203.304  81.4175  125.488
 177.694  74.2773  93.3642
 224.103  98.2203  31.3568
 291.581  129.329  225.481
 268.876  55.1835  231.189
 151.056  87.0473  117.707
 148.816  21.0344  19.1408
 207.831  109.837  264.996
 166.795   99.778  359.598
 212.473  172.649  208.689
 131.376   134.76   212.41
 192.963  94.8569  301.772
 26.9485  145.871   159.95
 128.798  151.499  243.381
 226.519  115.036  80.0877
 180.602  137.707  109.781
 214.979   90.782 0.267744
 224.587  166.512  93.6054
 279.904  110.045   200.41
 193.793  71.6109  274.333
 32.7053  89.4109  26.6885
 89.8686   48.234    60.95
 255.675   107.98  46.2226
 248.768  118.964  191.744
 80.5732  103.541   282.02
  55.856   102.63  10.2262
 234.955  121.874  319.872
 265.835  14.8567  7.46039
 181.316  65.4748  197.816
 32.0717  112.997  68.9432
 138.673  128.513  193.293
  238.77  102.012  141.124
 209.868  55.2123  31.0623
 261.304  123.034  147.848
 108.238    69.74   93.616
 351.512  101.869  69.2911
0.632217   72.746   127.27
 348.278  150.802  56.4379
 55.4365   101.61  199.344
 214.125  38.4502  72.9992
 43.9342  42.1305  94.7157
 2.33831  101.437 0.736677
 75.0171  106.778  293.603
 190.722   57.558  40.7654
 154.257  56.7963  58.8299
 302.077  85.9317  207.299
 266.507  148.688  190.073
 162.482  119.859  277.086
 90.8433  71.1511  229.319
 301.669  93.0644  106.007
 107.749  40.2246  274.775
 168.835  64.0405  77.9302
 329.543  25.3419  316.923
 340.733  15.3526  55.3203
 144.577  128.511  241.607
 232.902  129.778  97.3628
 233.117  106.239  27.6006
 353.001  79.6023  266.152
 105.609  31.8557  30.3613
 307.401  173.983  167.635
 78.1842  31.8165  211.818
 169.855  130.443  151.458
  104.07  159.452  52.0614
 51.7206  94.8242  85.3889
 253.788  30.3957  176.745
 174.062  130.739  343.853
 95.0785  108.442  39.7797
 242.175  93.9961  186.432
 24.9907  48.4214  81.0205
 240.941  132.483  342.314
 83.7008  25.8385  65.8716
 78.2098  112.765  236.557
 346.468   75.709  40.5158
  327.39  122.344  206.104
 353.939  148.609  292.467
 305.484  29.7927  217.621
 201.293  116.827  308.164
 352.089  139.983  57.5605
 324.385  115.421  265.465
 38.9793   163.57  258.242
 185.533  86.4558  192.045
 204.259   120.21  113.396
 235.986  15.6133   286.53
 124.268   125.03  207.942
   319.3  120.273  179.557
 332.093  116.591  185.588
 9.24774  55.5152  179.852
 25.8646  100.305  80.0614
 173.472  88.6394  143.354
 29.4935  89.2464  101.131
 297.839  150.208  286.741
 344.556  59.1364  126.355
 341.792   84.455   56.652
 250.066  29.4821  97.8869
 266.496  65.4047  42.7845
 108.918  152.891  190.021
 243.641  61.7483   122.48
 324.783  159.767  214.362
 11.0487  117.732   232.74
 196.396  63.9298  345.543
 336.547  136.086  281.159
  151.98  17.5452   289.25
 349.976  62.6478  28.1993
 353.273  61.0462  154.436
 18.7085   85.637  139.194
 177.084  54.6024  267.946
 229.793  35.1794  337.566
 309.798  17.6658    180.7
 16.4321  75.6379  318.136
 21.3714  68.7054  125.313
 270.434  110.731  286.869
 52.0652  95.1877  218.076
 219.872  53.4685  125.467
 184.561  55.4533  115.197
 74.7545  79.8149  355.586
 40.5587  52.7112  258.121
 90.5264  40.5983  3.10782
 39.5594  51.5805  229.385
 359.657  9.94224  40.4823
 163.771  81.5322  308.884
 316.593  90.1547  230.664
 115.523  158.764  36.9239
 190.801  53.0626   107.56
 258.406  39.7061  275.555
 60.9267  83.0835  111.932
 55.7323  126.641  277.079
 180.924  85.4339  332.955
 24.6582  86.0484   334.51
 325.916  133.548  196.676
 208.811  107.611  93.8077
 263.648  156.323  313.658
 120.512  73.7756  266.701
 143.308   18.154   80.412
 222.025  89.8667  266.616
 148.963  56.6194  150.355
 242.096  138.669  108.675
 328.048  96.1128  32.9119
 319.738  84.1109  284.195
 48.6607  92.8415   314.95
  267.03  114.583  39.1401
 91.6324  80.7068  104.203
 132.839  81.3837  266.857
 191.307  30.0821  117.101
 236.792  54.1766  142.554
 128.608  144.253  191.799
 190.148  57.8324  189.278
 110.781  71.2147  276.854
 229.235   32.623  340.021
 3.42045  118.042  28.1074
 96.6594  95.5092  317.828
 120.876  7.72588  274.969
 33.2435  123.502  271.753
  342.92  92.4302  246.065
 322.168  115.394   35.868
  341.74  72.5201  12.1311
 64.3158  34.1755   97.165
 86.5233  49.0957   203.22
 227.086  5.56367  323.624
 205.774  64.6897  36.1526
 290.258  123.492  85.9513
 46.2356  122.803    108.2
 210.502  55.0495  34.0433
 68.7655  84.2336  194.012
  125.41  44.2523   177.52
 241.987  106.934  268.812
 243.453  95.8032  293.851
 353.481  60.8868  22.0833
 136.772  95.0117  345.305
 111.893  94.4363  20.2137
 327.722  145.331  284.335
 101.091  170.533  104.304
 84.8648  69.1375  170.925
 305.547  129.287  128.272
 177.693  96.6366  103.152
 312.012   52.361  307.299
 182.591  61.4247   237.83
 332.928  71.5582  118.292
 3.11408  26.6512  188.397
 14.5777   135.31  314.837
 286.255  67.0053  236.605
 209.198  56.8265  341.842
 146.743  143.058  222.264
 14.8268  135.047  15.2166
 158.472   106.17  99.0527
 109.969  93.2342  23.0642
 270.165  45.2649  244.112
 5.08579  61.2627  232.705
 260.139  114.619  334.385
 51.6127  64.0554   86.818
 286.853  83.9257  127.693
 239.769  82.9403  117.426
 167.145  24.4398  194.687
 141.818   105.89   273.29
 275.849  141.972  294.798
 43.1646  112.007  217.288
 140.396  90.2817   184.62
 78.1255  46.5474  359.303
 249.942  87.5604  149.736
 88.0186  92.7279  129.087
 287.962  124.758  68.1646
 109.619  131.378  248.707
 309.157  26.8156  273.929
 254.529  54.4326  140.112
 296.433  96.3369   9.1073
  40.987  130.968  175.078
 225.557  92.6664  19.4132
  83.735  34.4873   166.23
 23.5907  102.458  260.759
 329.753  105.802   228.96
 306.263  131.963  66.4212
   300.9  81.5238  108.808
 25.0028  107.992  128.934
 74.3334  151.816  142.467
 123.769   163.35  340.405
 106.089  77.4009  151.931
  215.13  5.94063  286.474
 348.898  131.951  161.275
 84.3158  70.2914   125.41
 161.828  45.8693  340.865
 85.9113  93.9745  64.8822
 358.013   130.03  253.229
 286.266  95.0991  283.522
 304.199  106.039  302.795
 281.828  96.4358  211.747
 105.533  94.1175  248.017
  348.57  105.111   189.81
 355.078  139.336  30.2219
 73.1792  133.338  305.977
 246.369  34.8003  328.879
 158.189  123.389  64.2368
 89.4141  71.8026  321.028
 154.511  39.7098  188.319
 266.954   109.47  75.9203
 24.7736   94.637  310.783
  324.41  45.3051  105.127
 132.971  39.6981  334.753
 191.314  83.9757  334.568
 318.685  51.4144  137.346
 200.904  65.5274  13.1969
 70.1305  98.7646  220.318
 167.895  149.026  214.723
 259.583  140.141  44.7373
 191.176  101.112  336.059
 140.907  163.334  21.4069
 266.964  115.218  216.103
 143.382  69.4266   154.67
 103.095  83.6897  289.174
 281.796  106.403  274.714
 85.4147  167.048  314.561
 354.916  65.5527  342.156
 244.866  50.2799  55.0909
 205.913  154.246  136.728
 15.4724  105.365  355.816
 56.0492  171.624  119.075
 188.883  38.0149  187.056
 325.345  47.3783  43.3026
 44.5367   157.26   283.01
 117.273  56.4955  301.484
 30.9125  29.5398  75.9091
 124.925    136.4  254.238
 36.4718  155.328   158.64
 224.538  107.545  103.675
 354.083  162.138  203.078
 233.099  107.971  211.261
 260.256  83.1605  183.887
 106.686  15.1278  245.594
 172.739  53.0755  171.402
 2.09634   72.855  308.876
 173.276  50.2201  114.915
 329.925  103.343  166.724
 261.309  84.3799  111.324
  194.59  71.8909  222.465
 332.128  54.7219  276.109
  347.45  114.437  291.681
 15.0013  140.247  263.952
 267.643  126.285  321.543
 296.404  6.56269  1.21277
 42.6448  76.1574  129.457
 221.462  61.8953  334.605
 39.3387  42.2349  182.198
 241.592  71.4789    90.39
 189.878   164.12  56.7111
 301.779  57.6426  69.1206
 72.7093  63.1061   67.946
 141.535  82.9837   123.29
 245.525  46.6517  106.949
 333.649  65.2594  334.185
 134.085  17.0651  140.618
 317.303  76.7035  229.814
 56.4121  51.6266  330.671
 200.517  67.5729  112.159
 342.531  17.1287  206.351
 13.1606  145.836  127.895
 148.979  10.3135  45.0587
 188.851  128.184  353.721
 55.8064  84.8805  135.678
 57.4771  51.0254   15.627
  336.44  33.2729  55.8515
  233.77   94.017   130.07
 42.0131   73.788  332.744
 234.843   114.88  105.623
 166.541  159.583  239.305
 281.498    32.41  100.923
 94.0662  108.581  41.6144
  170.43  84.6182  308.428
 83.3891  81.2898  92.5955
 53.1715  89.0597  60.1835
 81.4983  114.688  186.083
 339.373  119.304  92.9287
 52.7549  95.9347  241.063
 182.697  40.8228   54.037
 187.397  20.0328   167.78
  189.44  154.053  63.4698
 147.203  81.7726  306.345
 56.7508  123.321  306.215
 241.409  125.222  356.493
 351.095   79.556  305.631
 294.486  86.0833  15.4213
 315.164  68.6312  194.064
 51.5703  56.4132  238.232
 311.836  63.5427  259.334
 230.367   83.024  220.505
 241.735  69.7791  315.105
 291.014  109.087   277.18
 296.036  18.0562  352.779
 93.1178   42.234  74.2643
 235.415  48.8797  356.113
 310.483  26.3508  108.332
 206.873  118.621   358.67
 227.638  73.6081  205.213
 108.372   149.37  139.929
 138.737  94.5958  177.393
 179.581  138.531  66.8745
 77.7476  154.367  67.4525
  126.86   39.696  311.434
 243.563  80.7565  233.476
 332.289  123.028  359.731
 341.044  64.2441  90.2672
 150.652  29.6688  357.599
 358.291  98.7952  282.733
 316.611  98.0174  194.284
 180.414  76.2698  136.777
 216.998  69.9482  323.446
 7.48203  114.322  143.819
 311.053  115.347  16.1534
 55.6831  158.695  13.9554
 272.025  103.983  137.508
 355.688  66.4119  351.119
 250.686  138.017  72.5558
 22.9826  148.379  238.175
 218.053  145.129  256.458
 355.538    75.63  5.21088
 113.808  76.4323  159.151
 86.8087  108.943  107.149
 67.9079   70.517  225.164
 165.454   105.34  122.174
 76.9803  15.9579  297.555
 110.135  88.6617  112.374
 147.611  107.127   256.88
 135.968  67.7699  24.6354
 320.945  75.1944  5.85419
 348.334  6.79267  277.459
 105.331  18.0943  242.514
 50.7436  58.1996  44.3351
 356.857  40.7775  277.464
 284.501  12.7422  35.6402
 63.1797  47.1726  161.311
 53.1566  25.8877  246.668
 2.60508  107.354  284.854
 51.5065  86.0692  95.9025
 24.5215  104.384   19.406
 272.278  74.7193  286.123
 238.921  4.75229  90.6574
 30.6754  82.7597  80.9574
 122.891  156.362  141.277
 122.127  56.2388  5.37428
 180.264  135.555  71.8481
 29.2234   125.72  135.265
 195.228  107.013  215.489
 117.407  110.026  269.588
 39.4216   80.439  58.5798
 45.7874   104.59  138.611
 145.292  21.9189  17.1442
   122.6  21.1769  267.267
 107.489  99.0291  221.226
 312.616  103.849  357.478
 342.499  75.4292    288.7
 171.437   127.06  309.491
 196.207  51.6676  245.322
 70.3311  60.8233  67.8566
 198.011  118.985  158.343
  58.874  120.765  156.065
 345.796  49.4236  243.702
   57.95  118.981  252.814
 181.242  139.049  182.403
 215.427  64.6688  300.413
  295.97  49.4055  63.9921
 138.856  21.4478  98.9083
  272.33  79.0882   227.19
 260.225  74.1397  144.777
 351.253  21.4059  244.302
 236.612  82.3452  329.659
 246.348    150.5  160.855
 264.442  153.874  263.769
 88.9627  45.5232  103.595
 356.499   40.111  270.311
 340.302  26.8342  148.287
 199.302   32.148  8.48251
 333.128  103.922  84.5332
 304.568  42.0303   21.311
 21.0298   81.243  139.993
 195.311  128.655  164.318
 141.068  9.67057  74.5858
 241.587   38.292  194.365
 350.876  163.322  130.983
 77.5592  98.8403  54.4737
 99.4285  48.1253  181.756
  351.68  72.4047  59.8247
 99.3679  99.2128  248.572
 174.234  59.9665  266.186
 279.245  149.758  79.0014
 104.279  106.823  260.473
 306.714  23.7709  338.162
 340.474  28.4003  80.2935
 214.428  96.4977  294.881
 239.118  147.149  296.408
 96.8702  105.151  269.021
 16.5274  154.589  291.704
  313.01  101.805  336.616
 87.0837  94.3109  29.4875
  238.83  76.8868  330.153
 313.886  106.733  333.252
 57.0167  54.0416  259.563
 222.039  9.09427  50.7917
 282.856  37.5941   118.75
 230.636  138.349  233.029
 120.406  95.1316  34.2012
 181.858  161.334  230.121
 92.7636  17.7411  221.606
  137.45  67.7933  107.975
  234.65  136.899  16.2975
 5.48084   118.24  87.7441
 39.6475  24.2645  19.1532
 108.508  75.0381  83.9171
  105.78  80.6601  243.885
 250.987  138.464  112.309
 16.3889  69.1292  12.0861
 168.202  84.3063  272.261
 162.581  86.7387  54.8741
 185.885  65.7776  332.612
 147.296  123.061  126.785
 259.521  45.8635  267.296
 258.198  89.7857  350.144
 46.3821   77.439  195.874
  224.01  83.0623  124.223
 37.0003  27.8025  291.231
 297.186  139.394  122.187
 313.153  63.8817  323.892
  338.34  31.5068  282.345
 41.9129  95.6087  74.7678
 120.136  56.3717  27.8257
 26.6214  121.351  155.045
 161.657  113.369   267.83
 233.062  30.5087  61.3745
 9.73292  93.9254  271.492
 271.178  122.473  139.953
 109.098  146.899  18.1602
 148.642  95.8076  160.505
 277.576  95.4064   2.9499
 329.675  40.3735  82.0652
 147.478  20.9192  157.415
 16.4316  105.858  288.155
 233.119  14.7162  268.835
 34.7673  146.311  59.6136
 155.368  146.317  245.949
 140.097  26.1627  69.9474
 335.529  65.6203   310.08
 262.232  69.9878   24.666
 241.819  92.4118  349.512
 49.3525  136.019  92.5201
 313.464  62.6992  315.674
 20.8002  167.905  29.6894
 96.5288  48.2864  83.9137
 247.687  38.4041  180.883
 334.207   135.32   342.75
 139.635  141.464  186.767
 191.341  160.627  257.877
 147.725  122.418  231.903
 205.205  43.2869  184.499
 184.585  113.619  38.3022
 209.075  41.5379  124.403
 355.041  71.6242  261.907
 346.631  83.8379  230.132
 105.845  35.1226  306.745
 7.20195  89.8092   330.75
 108.764  21.0285  162.846
 311.264  97.8542  140.713
 233.158  111.524   81.186
 285.637  143.833  331.581
 216.422  53.4516  232.059
 256.214  46.2854  132.202
 318.934  76.3337  318.586
 180.777  145.534  226.847
 161.956  117.563  289.964
 236.135   124.85  268.289
 261.494  111.718  166.865
 63.2392  115.355  118.311
 359.474  96.5434  188.105
 48.2807  24.8252  159.274
 242.525  103.744  314.404
 335.205  151.301    2.626
 152.953  34.7619  336.666
 145.991  85.2054  68.1715
 79.7337  115.731   324.95
 341.947  87.1953  167.153
 211.438   21.418  320.932
 56.0118  66.4043  41.5729
 44.5455  26.6451  206.531
 281.687  120.962  176.682
 109.698  83.0378  202.714
 259.462    86.92  358.142
 42.5905  44.8623  324.781
 47.4207  104.925  193.805
 356.915  28.4031  35.6728
 61.0549  166.121  153.385
 254.098  79.7672  61.8408
 221.895  85.6596  311.957
  226.01  127.235  335.717
 7.19705  153.086  275.289
 320.496  134.794  157.791
  29.856  167.085  301.915
 318.016  78.4411  180.732
 47.9564    83.69   254.19
 258.038  78.8748  12.1247
 7.87871  123.418  146.166
  37.046  49.5162  192.369
 293.532  114.649  99.4858
 213.009   149.94  75.4768
 92.2276  118.126  173.737
  5.8504  37.9702  90.6818
 312.544  108.324  236.179
 86.0087  135.049  263.394
 349.117  74.5826  45.5205
 188.092    73.73  186.798
 139.095    36.33  298.274
 288.828  105.042  152.388
 322.162  62.3081  43.3475
 21.5541  91.5612  268.101
0.829038  27.3107  204.814
 265.232  37.9215   332.44
 168.659  131.908  267.762
 78.9917  45.6764  262.749
 246.712  47.8645  16.0741
 358.694  93.3241  288.892
 333.013  41.8469  210.041
 236.843   47.391  241.145
 273.109  114.538  133.249
 190.581  153.938  140.895
 122.568  151.197  53.7297
 14.7701  128.099    351.9
 222.458  37.4853   28.561
 242.278  80.7466   98.415
 60.5352  41.2954  63.2686
  219.76  96.3918  179.606
 295.925  53.3645  49.3867
 105.234  111.446  264.853
 75.0963  161.826  98.4377
 265.266  142.799  78.3262
 355.981  111.981  153.909
 251.277  134.283  90.6686
 20.2342  100.925  140.104
 288.331  52.0815  232.262
 290.104  99.7453  188.822
  146.44  83.5507  289.681
 290.794  68.0959  282.729
 330.481  43.9703  331.124
 163.694  46.8013  104.177
 235.831  101.653  201.126
 101.786  155.173   114.29
 10.1092  124.715  202.987
  307.634   134.721   279.017
  56.6857    20.109   256.916
  93.3907   10.0832   168.859
  241.409   113.151   128.601
  81.3447   153.182   48.6324
  297.348   22.6858   40.3631
  116.675   98.2164   173.747
  175.819   124.659   333.324
  274.941   112.104   81.4148
  265.563   29.6559   32.2089
  228.969   18.9637   182.546
  89.6907   145.193   108.348
  264.354   21.3651   278.985
  122.222   76.9973    2.6549
  108.996    52.949    90.409
  45.7711   28.6643   239.476
  3.65051   147.546    70.581
  332.974   25.7707   357.703
  327.602   121.049   272.226
  137.573   124.441   118.248
  252.501   141.354   194.838
  242.043   85.5178   172.205
  45.9627   119.538   78.0371
  72.3489   47.8606   285.661
  325.018   143.417   229.757
  321.061   54.0953   275.245
  135.965   82.9547   266.331
  90.0694   177.137   45.7792
  216.973   86.1977   246.249
  225.162   125.142   269.022
  7.08584   80.0284    128.91
  295.104   94.3488   68.6217
   186.46   67.8387    206.78
  327.396   120.617   94.4459
   42.705   28.9699   141.023
  340.614   68.0243   115.575
  333.736   30.5643   97.2515
  34.1298   99.4471     1.691
  149.493   51.1075   112.627
   116.23   96.8863   237.993
  304.651   58.3351   182.492
  341.262   169.256   316.128
  262.519   8.08684   27.3993
  246.186   148.199   347.182
  230.908    131.36   47.8484
  113.718    88.373   214.901
  263.573   56.0738   136.314
  56.7534   106.405   143.327
  273.625   114.412   283.772
  33.0876   134.097   193.799
  348.355   35.8505   163.223
  219.228   117.026   5.12277
  322.183   108.435   114.569
  69.8928   154.184    98.285
  355.701    126.21   144.689
  86.8734   87.2848   82.7967
  80.4315   121.696   246.036
  144.719    79.394    131.22
  281.126   51.2426   69.3588
  302.116   103.129   43.4059
   147.42   55.5452   234.624
  144.864   64.5317   112.347
   277.83   1.83599   25.2999
  89.6849   163.618   233.985
  311.667   71.4381   305.603
  245.587   86.2257   36.4787
  351.861   23.8733    123.25
  66.7886   67.0031   76.1869
