// Jest Snapshot v1, https://goo.gl/fbAQLP

exports[`<WeatherForecast> should match snapshot 1`] = `
<div
  className="weatherForecast"
>
  <div
    className="cityInfo"
  />
  <div
    className="weatherForecastBar"
  />
</div>
`;
