[
  {
    "name": "Jonathan Howatt",
    "position": "Professor of Chemistry",
    "photo": "https://educab.jollyany.co/images/mubariz-mehdizadeh-364026-unsplash.jpg",
    "phoneNumber": "+1234567890",
    "email": "john.doe@example.com",
    "facebook": "john.doe.facebook",
    "instagram": "john.doe.instagram",
    "telegram": "john_doe_telegram"
  },
  {
    "name": "Ahin Xian",
    "position": "Professor of Mathematics",
    "photo": "https://educab.jollyany.co/images/luis-villasmil-1222180-unsplash.jpg",
    "phoneNumber": "+1234567890",
    "email": "john.doe@example.com",
    "facebook": "john.doe.facebook",
    "instagram": "john.doe.instagram",
    "telegram": "john_doe_telegram"
  },
  {
    "name": "Phillip Doe",
    "position": "Professor of Geograph",
    "photo": "https://educab.jollyany.co/images/2020/11/19/marius-ciocirlan-398931-unsplash.jpg",
    "phoneNumber": "+1234567890",
    "email": "john.doe@example.com",
    "facebook": "john.doe.facebook",
    "instagram": "john.doe.instagram",
    "telegram": "john_doe_telegram"
  },
  {
    "name": "Alisa Katherine",
    "position": "Professor of Physics",
    "photo": "https://educab.jollyany.co/images/daria-tumanova-311044-unsplash.jpg",
    "phoneNumber": "+1234567890",
    "email": "john.doe@example.com",
    "facebook": "john.doe.facebook",
    "instagram": "john.doe.instagram",
    "telegram": "john_doe_telegram"
  },
  {
    "name": "Jonathan Howatt2",
    "position": "Professor of Chemistry",
    "photo": "https://educab.jollyany.co/images/mubariz-mehdizadeh-364026-unsplash.jpg",
    "phoneNumber": "+1234567890",
    "email": "john.doe@example.com",
    "facebook": "john.doe.facebook",
    "instagram": "john.doe.instagram",
    "telegram": "john_doe_telegram"
  },
  {
    "name": "Ahin Xian2",
    "position": "Professor of Mathematics",
    "photo": "https://educab.jollyany.co/images/luis-villasmil-1222180-unsplash.jpg",
    "phoneNumber": "+1234567890",
    "email": "john.doe@example.com",
    "facebook": "john.doe.facebook",
    "instagram": "john.doe.instagram",
    "telegram": "john_doe_telegram"
  },
  {
    "name": "Phillip Doe2",
    "position": "Professor of Geograph",
    "photo": "https://educab.jollyany.co/images/2020/11/19/marius-ciocirlan-398931-unsplash.jpg",
    "phoneNumber": "+1234567890",
    "email": "john.doe@example.com",
    "facebook": "john.doe.facebook",
    "instagram": "john.doe.instagram",
    "telegram": "john_doe_telegram"
  },
  {
    "name": "Alisa Katherine2",
    "position": "Professor of Physics",
    "photo": "https://educab.jollyany.co/images/daria-tumanova-311044-unsplash.jpg",
    "phoneNumber": "+1234567890",
    "email": "john.doe@example.com",
    "facebook": "john.doe.facebook",
    "instagram": "john.doe.instagram",
    "telegram": "john_doe_telegram"
  },
  {
    "name": "Jonathan Howatt3",
    "position": "Professor of Chemistry",
    "photo": "https://educab.jollyany.co/images/mubariz-mehdizadeh-364026-unsplash.jpg",
    "phoneNumber": "+1234567890",
    "email": "john.doe@example.com",
    "facebook": "john.doe.facebook",
    "instagram": "john.doe.instagram",
    "telegram": "john_doe_telegram"
  },
  {
    "name": "Ahin Xian3",
    "position": "Professor of Mathematics",
    "photo": "https://educab.jollyany.co/images/luis-villasmil-1222180-unsplash.jpg",
    "phoneNumber": "+1234567890",
    "email": "john.doe@example.com",
    "facebook": "john.doe.facebook",
    "instagram": "john.doe.instagram",
    "telegram": "john_doe_telegram"
  },
  {
    "name": "Phillip Doe3",
    "position": "Professor of Geograph",
    "photo": "https://educab.jollyany.co/images/2020/11/19/marius-ciocirlan-398931-unsplash.jpg",
    "phoneNumber": "+1234567890",
    "email": "john.doe@example.com",
    "facebook": "john.doe.facebook",
    "instagram": "john.doe.instagram",
    "telegram": "john_doe_telegram"
  },
  {
    "name": "Alisa Katherine3",
    "position": "Professor of Physics",
    "photo": "https://educab.jollyany.co/images/daria-tumanova-311044-unsplash.jpg",
    "phoneNumber": "+1234567890",
    "email": "john.doe@example.com",
    "facebook": "john.doe.facebook",
    "instagram": "john.doe.instagram",
    "telegram": "john_doe_telegram"
  }
]
