﻿"284.75818299410633","150.92916209795322","287.1728015921966","89.95634380139802"
"296.5407165170413","131.35838201868603","287.1728015921966","89.95634380139802"
"296.5407165170413","131.35838201868603","279.2778684381853","141.89578050758405"
"284.75818299410633","150.92916209795322","286.22049253586437","167.01692280016448"
"286.22049253586437","167.01692280016448","289.7607814498812","271.3852910270468"
"293.8135158248812","151.59426683570905","298.6234787611933","91.85480485882675"
"304.64052791483914","129.578689664428","298.6234787611933","91.85480485882675"
"304.64052791483914","129.578689664428","303.5745899579678","150.39997658534355"
"293.8135158248812","151.59426683570905","296.0747077451115","171.63881893046414"
"296.0747077451115","171.63881893046414","289.8594727990223","270.59690241228066"
"287.1728015921966","89.95634380139802","298.6234787611933","91.85480485882675"
"284.75818299410633","150.92916209795322","293.8135158248812","151.59426683570905"