﻿"nose","0.9202451705932617","330.83295260721246","163.96273072002924"
"leftEye","0.7546992897987366","336.48125304580896","161.8512617263645"
"rightEye","0.9358937740325928","326.8856222587719","160.64297027290445"
"leftEar","0.3457159399986267","336.1420641447368","162.18822337962962"
"rightEar","0.9407814741134644","318.27462536549706","162.50689114278748"
"leftShoulder","0.9749730825424194","342.945677997076","187.40280062134502"
"rightShoulder","0.9891608357429504","310.3227605689571","187.59251644736838"
"leftElbow","0.967502236366272","339.08793250487327","216.85851455896682"
"rightElbow","0.901970386505127","305.3645833333333","223.35754751461985"
"leftWrist","0.8758149743080139","354.24993146929825","189.38394706384014"
"rightWrist","0.7672921419143677","340.2441977339181","186.7293341861598"
"leftHip","0.9861246943473816","319.8244091130604","235.77081810428848"
"rightHip","0.9922671914100647","295.72831003289474","233.3258330287524"
"leftKnee","0.8178520798683167","346.93717257553607","240.65583881578948"
"rightKnee","0.800743579864502","292.42750974658867","242.76974445662768"
"leftAnkle","0.937324047088623","337.77583607456137","290.81452546296293"
"rightAnkle","0.9214164614677429","286.1936715704191","301.28693043372317"