﻿"317.7737991898148","195.98444353070175","340.12183235867445","130.2384297331871"
"352.36651742202724","167.04796387670564","340.12183235867445","130.2384297331871"
"352.36651742202724","167.04796387670564","361.751149792885","190.67457054093563"
"317.7737991898148","195.98444353070175","329.6713952850877","243.72925042641322"
"329.6713952850877","243.72925042641322","337.2653204191033","292.2523757309941"
"294.80961790326506","193.08654666179336","306.84408503898635","131.90918920565298"
"308.38581642909355","169.26274290326506","306.84408503898635","131.90918920565298"
"308.38581642909355","169.26274290326506","316.89944261695905","202.34732882553607"
"294.80961790326506","193.08654666179336","290.4848166423002","246.1108065302144"
"290.4848166423002","246.1108065302144","286.28245690180313","295.47465125487327"
"340.12183235867445","130.2384297331871","306.84408503898635","131.90918920565298"
"317.7737991898148","195.98444353070175","294.80961790326506","193.08654666179336"