﻿"nose","0.9670242071151733","281.4850031980994","64.91843775699013"
"leftEye","0.9422135949134827","285.9915571603161","59.47349503723501"
"rightEye","0.35841235518455505","282.2154262609649","58.54263751827483"
"leftEar","0.9348320364952087","302.19883612024853","63.954064441703196"
"rightEar","0.10945375263690948","292.7901418585526","65.08835463495979"
"leftShoulder","0.9463865160942078","301.6425595646016","90.2398003472222"
"rightShoulder","0.906749427318573","293.6237357513249","91.24195478115863"
"leftElbow","0.8681634068489075","288.158555058708","133.36734883269372"
"rightElbow","0.5188387632369995","282.5312921178271","133.48570706551533"
"leftWrist","0.8552698493003845","267.46540627284355","160.99550124497438"
"rightWrist","0.7920734882354736","275.2697147123995","160.8495879591557"
"leftHip","0.9766497015953064","300.10243912189327","151.59805030153507"
"rightHip","0.9029356241226196","289.3177054778874","148.6042045013249"
"leftKnee","0.5928478837013245","289.08689621596307","186.54963621619152"
"rightKnee","0.5669318437576294","292.4992611533717","185.10228207236838"
"leftAnkle","0.6718665957450867","293.2081612927175","271.0741901955409"
"rightAnkle","0.6456220149993896","288.65731222587715","270.9133572048611"