﻿"nose","0.9513483047485352","316.8027001096491","69.46584125243663"
"leftEye","0.9472185373306274","320.6893427144249","66.51289138645222"
"rightEye","0.45240092277526855","319.4436068469785","64.19137579191033"
"leftEar","0.9283906817436218","334.9795169346978","68.4564601608187"
"rightEar","0.19172292947769165","330.01016538742687","68.80649975633528"
"leftShoulder","0.9433316588401794","333.2431773879142","103.4641889010721"
"rightShoulder","0.9335418343544006","332.76704130116957","100.82351059941519"
"leftElbow","0.7961477637290955","339.8947673001949","157.4411397417154"
"rightElbow","0.8595754504203796","336.9485562865497","162.01546890229042"
"leftWrist","0.6712257862091064","341.51277716861597","192.8911580165692"
"rightWrist","0.8023630380630493","340.7335450170565","195.7059423732943"
"leftHip","0.8920422792434692","318.6954419468811","177.99058464303118"
"rightHip","0.9035648703575134","320.62039321393763","178.68756091617934"
"leftKnee","0.9011566638946533","286.3233468871832","256.57041910331384"
"rightKnee","0.8491773009300232","327.4972587719298","266.2643914473684"
"leftAnkle","0.8721389770507812","325.4783823708577","334.3735532407407"
"rightAnkle","0.8775841593742371","306.7248796905458","332.87303545321635"