﻿"332.35163103070175","183.04447642543857","338.93343384502924","102.7642048915692"
"342.0595379507797","157.9285453216374","338.93343384502924","102.7642048915692"
"342.0595379507797","157.9285453216374","340.4106892665692","190.92425073099412"
"332.35163103070175","183.04447642543857","302.73085328338203","260.7777473196881"
"302.73085328338203","260.7777473196881","340.8754035696881","320.526468079922"
"326.73649183723194","184.07894736842104","328.8666925560429","102.08287646198829"
"334.40146046539957","159.62538453338203","328.8666925560429","102.08287646198829"
"334.40146046539957","159.62538453338203","331.6634304946394","191.1043722587719"
"326.73649183723194","184.07894736842104","329.38665021929825","226.78446332846"
"329.38665021929825","226.78446332846","339.0124725877193","319.5367324561403"
"338.93343384502924","102.7642048915692","328.8666925560429","102.08287646198829"
"332.35163103070175","183.04447642543857","326.73649183723194","184.07894736842104"