﻿"nose","0.9781844615936279","320.1397645589668","70.88614004629628"
"leftEye","0.9736354351043701","323.2592059576023","67.9111842105263"
"rightEye","0.49455568194389343","317.905282955653","66.54116030092592"
"leftEar","0.9535683989524841","336.48209064327483","69.63918585526315"
"rightEar","0.15610381960868835","330.9062043128655","69.27191840277777"
"leftShoulder","0.9437042474746704","337.1484375","102.6436479653996"
"rightShoulder","0.9535703659057617","333.80859375","101.48985745614033"
"leftElbow","0.6475016474723816","343.94496984649123","151.9839447794834"
"rightElbow","0.725879430770874","340.6043646442495","149.1781836318226"
"leftWrist","0.4686073064804077","337.50460678606237","179.05197292275824"
"rightWrist","0.5200197696685791","335.2974993908382","180.18773605019493"
"leftHip","0.7753468751907349","325.8414427997076","180.46566611842104"
"rightHip","0.7390404939651489","326.42243086013644","181.06112177144246"
"leftKnee","0.6190119981765747","295.70936890838203","259.48579130116957"
"rightKnee","0.44837847352027893","334.66812104044834","214.51739156920075"
"leftAnkle","0.6751009225845337","324.10948160331384","335.5647310550682"
"rightAnkle","0.6352109909057617","335.09000365497076","335.0628959551657"