﻿"296.9497591431378","165.21349455180922","297.69331725717285","98.63100999977155"
"284.80229963336075","137.67876876027958","297.69331725717285","98.63100999977155"
"284.80229963336075","137.67876876027958","258.78395839044225","149.12444889894005"
"296.9497591431378","165.21349455180922","279.76125973707053","222.282043813962"
"279.76125973707053","222.282043813962","246.20007966694078","280.6679887381213"
"303.53322168539836","166.06174045138886","319.8022675095943","94.7572228504203"
"326.6348141675804","147.27403071888705","319.8022675095943","94.7572228504203"
"326.6348141675804","147.27403071888705","339.15926392315424","174.5200352362025"
"303.53322168539836","166.06174045138886","315.4659873560855","228.17400659036912"
"315.4659873560855","228.17400659036912","365.85832562362936","272.2414964820906"
"297.69331725717285","98.63100999977155","319.8022675095943","94.7572228504203"
"296.9497591431378","165.21349455180922","303.53322168539836","166.06174045138886"