﻿"nose","0.9742584824562073","309.5851037097953","73.4409265350877"
"leftEye","0.9425553679466248","316.0905519005848","70.87329053971735"
"rightEye","0.34999051690101624","313.9819764254386","68.87862831993175"
"leftEar","0.9245716333389282","327.66493055555554","75.39507949561403"
"rightEar","0.09153813868761063","330.23304245857696","72.7460061829922"
"leftShoulder","0.9688039422035217","332.7038407651072","109.77520026193955"
"rightShoulder","0.9443802833557129","324.7664245248538","102.98396000852824"
"leftElbow","0.8837170004844666","344.0625380726121","168.62567388523388"
"rightElbow","0.8897258043289185","338.17544621101365","173.45364278752436"
"leftWrist","0.8197605013847351","362.9293829191033","206.52812043128654"
"rightWrist","0.840166449546814","281.734302662037","198.20510477582843"
"leftHip","0.9678913950920105","324.63138096978554","200.62214455409355"
"rightHip","0.9666025638580322","321.19551809210526","199.9860273513645"
"leftKnee","0.8663085699081421","289.9703033625731","268.4147325779727"
"rightKnee","0.9116771817207336","347.2126279239766","279.59403173732943"
"leftAnkle","0.5159479379653931","254.0361347161306","331.8475115740741"
"rightAnkle","0.5999458432197571","375.00114217836256","340.1232029727095"