﻿"318.40077896564327","190.59008741471735","333.7445556164717","101.99399594907405"
"342.57180494639374","156.07638888888886","333.7445556164717","101.99399594907405"
"342.57180494639374","156.07638888888886","348.14563535575047","200.23585983187132"
"318.40077896564327","190.59008741471735","290.0496086135477","251.72872502436644"
"290.0496086135477","251.72872502436644","292.54424037524365","333.1863730506822"
"326.7823693347953","190.6206977948343","333.5409813596491","100.78473364400583"
"337.26280762670564","156.33117080896682","333.5409813596491","100.78473364400583"
"337.26280762670564","156.33117080896682","349.22236689814815","201.49857608430796"
"326.7823693347953","190.6206977948343","335.35141020955166","273.77276742202724"
"335.35141020955166","273.77276742202724","291.5081703825536","329.8995644493177"
"333.7445556164717","101.99399594907405","333.5409813596491","100.78473364400583"
"318.40077896564327","190.59008741471735","326.7823693347953","190.6206977948343"