﻿"295.03120288514253","157.73825840643275","294.99600951434576","93.62175478572732"
"284.044357210572","135.95704195792212","294.99600951434576","93.62175478572732"
"284.044357210572","135.95704195792212","260.7582850762975","155.12488292671782"
"295.03120288514253","157.73825840643275","274.07856545253105","222.87183616593563"
"274.07856545253105","222.87183616593563","272.0485218784265","276.7481039839181"
"298.420867027595","157.29041740908258","317.2566374840095","91.57441791735195"
"315.0780750296966","135.19153260348133","317.2566374840095","91.57441791735195"
"315.0780750296966","135.19153260348133","309.82002124451753","165.529235482913"
"298.420867027595","157.29041740908258","273.18379363121346","221.98639808342466"
"273.18379363121346","221.98639808342466","274.49360451503105","276.26903154696635"
"294.99600951434576","93.62175478572732","317.2566374840095","91.57441791735195"
"295.03120288514253","157.73825840643275","298.420867027595","157.29041740908258"