﻿"nose","0.9478052258491516","282.53901966831137","69.25860845554641"
"leftEye","0.9369834661483765","287.24054704632675","66.2762022854989"
"rightEye","0.29253527522087097","286.02721454107274","65.36240605582967"
"leftEar","0.9478811621665955","302.15450532255113","70.06934093453032"
"rightEar","0.08232799917459488","296.44750405473314","69.25794813368054"
"leftShoulder","0.9569265842437744","302.3276524237025","96.15066260622257"
"rightShoulder","0.8976613879203796","299.12230731451024","89.78928236933479"
"leftElbow","0.8544171452522278","299.45321780199197","136.90303334018637"
"rightElbow","0.6474438309669495","322.3898725900036","138.0601671006944"
"leftWrist","0.7320003509521484","261.59814310352704","145.99355954175803"
"rightWrist","0.87519770860672","340.2082476699561","170.7161886650219"
"leftHip","0.9618114829063416","296.64427997076024","165.9633346468384"
"rightHip","0.964320182800293","305.3213376050804","165.99295989811765"
"leftKnee","0.6841498017311096","259.8948874668768","228.7459524054276"
"rightKnee","0.908484697341919","323.09324030290566","225.34761484603433"
"leftAnkle","0.6386101841926575","357.52120882447","276.3044747692799"
"rightAnkle","0.6518967747688293","361.633514939693","276.2657477841739"