﻿"nose","0.9783862829208374","331.8131320053606","133.60370598806043"
"leftEye","0.9193441271781921","337.66816672758284","128.63856146442492"
"rightEye","0.9784554839134216","324.7289230019493","127.57161458333331"
"leftEar","0.4880867302417755","341.076008162768","132.28053042763156"
"rightEar","0.931339681148529","316.583801626462","132.53514102095517"
"leftShoulder","0.9821747541427612","348.98357547514615","162.17042443347952"
"rightShoulder","0.9977583289146423","309.9129469724659","163.09724506578948"
"leftElbow","0.9477736353874207","358.95049037524365","194.08899853801165"
"rightElbow","0.9338152408599854","313.14437895955166","203.91462597465886"
"leftWrist","0.9588215351104736","375.3804596125731","182.57580257066274"
"rightWrist","0.6893835663795471","365.31394675925924","177.7677646807992"
"leftHip","0.986254870891571","320.1471125730994","220.7022112573099"
"rightHip","0.99604731798172","297.63740405701753","217.82198008040933"
"leftKnee","0.9725678563117981","342.0234451145224","245.6768929702729"
"rightKnee","0.9694143533706665","298.97826434576024","246.38736598440545"
"leftAnkle","0.9347144365310669","337.81546966374265","292.691314875731"
"rightAnkle","0.9451818466186523","285.12956109892787","303.6057809454191"