﻿"323.22832906920075","189.57571881091616","338.9671661793372","122.90461668494152"
"347.590993542885","156.8259053667154","338.9671661793372","122.90461668494152"
"347.590993542885","156.8259053667154","348.0845288133528","191.0024518762183"
"323.22832906920075","189.57571881091616","336.75118786549706","239.92035209551653"
"336.75118786549706","239.92035209551653","337.1248324805068","289.41497624269005"
"296.17688154848923","185.8063398513645","305.3658206932261","122.69837734527289"
"302.5039595516569","157.423645376462","305.3658206932261","122.69837734527289"
"302.5039595516569","157.423645376462","303.0925240618908","193.01694992690057"
"296.17688154848923","185.8063398513645","292.61159082602336","243.84099354288497"
"292.61159082602336","243.84099354288497","286.8417626096491","289.1103572733918"
"338.9671661793372","122.90461668494152","305.3658206932261","122.69837734527289"
"323.22832906920075","189.57571881091616","296.17688154848923","185.8063398513645"