﻿"nose","0.8645508885383606","280.5883396438688","67.99700106793676"
"leftEye","0.8306299448013306","284.94773106268275","62.51561571980079"
"rightEye","0.26194295287132263","284.2785394679733","63.140726368329666"
"leftEar","0.9386367797851562","295.21511144805373","66.89872518617506"
"rightEar","0.14458726346492767","298.14363892315424","65.97887898049157"
"leftShoulder","0.9733942151069641","294.99600951434576","93.62175478572732"
"rightShoulder","0.8921101093292236","317.2566374840095","91.57441791735195"
"leftElbow","0.7568872570991516","284.044357210572","135.95704195792212"
"rightElbow","0.42027026414871216","315.0780750296966","135.19153260348133"
"leftWrist","0.709580659866333","260.7582850762975","155.12488292671782"
"rightWrist","0.28977692127227783","309.82002124451753","165.529235482913"
"leftHip","0.9452458620071411","295.03120288514253","157.73825840643275"
"rightHip","0.8875477910041809","298.420867027595","157.29041740908258"
"leftKnee","0.6411184072494507","274.07856545253105","222.87183616593563"
"rightKnee","0.6247137784957886","273.18379363121346","221.98639808342466"
"leftAnkle","0.5179667472839355","272.0485218784265","276.7481039839181"
"rightAnkle","0.5320059061050415","274.49360451503105","276.26903154696635"