﻿"nose","0.9401417970657349","282.2302210400676","71.85966982478982"
"leftEye","0.9381835460662842","285.6542576126188","66.93008155153507"
"rightEye","0.35315293073654175","284.1382656878198","67.74984437819808"
"leftEar","0.9493364095687866","298.99452611019734","71.00733706825656"
"rightEar","0.1146707832813263","329.63613766675803","176.344665170413"
"leftShoulder","0.9453028440475464","295.67066214935124","97.76429293448464"
"rightShoulder","0.9245160222053528","300.4904585275036","95.53806238007127"
"leftElbow","0.8230002522468567","279.6618009868421","134.01330423633954"
"rightElbow","0.5336188077926636","297.75283545778507","134.97649968019005"
"leftWrist","0.7836903929710388","264.73317285727336","150.7570857890168"
"rightWrist","0.7513602375984192","259.390990497076","152.838348924068"
"leftHip","0.9744059443473816","297.2777427985654","160.6960720486111"
"rightHip","0.92857426404953","282.19790096171414","162.96179698921782"
"leftKnee","0.8294748067855835","277.6936492027595","222.12092527869152"
"rightKnee","0.7559021711349487","263.3764255813688","222.33836748446635"
"leftAnkle","0.5242398381233215","289.2607393320541","207.70617033305916"
"rightAnkle","0.39140135049819946","278.65532769097223","207.4997572870979"