﻿"nose","0.6800751686096191","280.84174262152777","66.51427508794771"
"leftEye","0.6010968685150146","284.64457194010413","59.97185958059208"
"rightEye","0.14435386657714844","284.8793966728344","61.716804727476244"
"leftEar","0.7490169405937195","292.46715523346126","64.54485619974415"
"rightEar","0.13214810192584991","295.7558436700475","64.80987727293493"
"leftShoulder","0.8477833271026611","295.42786001461985","88.63707425301533"
"rightShoulder","0.773247480392456","298.35305018731725","87.75122570015532"
"leftElbow","0.47057271003723145","292.8370425575658","127.59394060101425"
"rightElbow","0.3295804560184479","311.2855074698465","116.19960494905882"
"leftWrist","0.6495657563209534","286.7006179184941","140.45097841853982"
"rightWrist","0.28821679949760437","286.09751204998173","139.28899039999084"
"leftHip","0.7732361555099487","293.83691263477704","128.56875414039655"
"rightHip","0.5890727043151855","291.4132279959338","127.55392866525034"
"leftKnee","0.3403758704662323","281.642730891356","162.53208807337353"
"rightKnee","0.22923016548156738","281.6170854178088","161.1250671029788"
"leftAnkle","0.1231619268655777","275.6429393389071","275.7575497989766"
"rightAnkle","0.23340119421482086","268.8031826800073","277.78441668951024"