﻿"300.10243912189327","151.59805030153507","301.6425595646016","90.2398003472222"
"288.158555058708","133.36734883269372","301.6425595646016","90.2398003472222"
"288.158555058708","133.36734883269372","267.46540627284355","160.99550124497438"
"300.10243912189327","151.59805030153507","289.08689621596307","186.54963621619152"
"289.08689621596307","186.54963621619152","293.2081612927175","271.0741901955409"
"289.3177054778874","148.6042045013249","293.6237357513249","91.24195478115863"
"282.5312921178271","133.48570706551533","293.6237357513249","91.24195478115863"
"282.5312921178271","133.48570706551533","275.2697147123995","160.8495879591557"
"289.3177054778874","148.6042045013249","292.4992611533717","185.10228207236838"
"292.4992611533717","185.10228207236838","288.65731222587715","270.9133572048611"
"301.6425595646016","90.2398003472222","293.6237357513249","91.24195478115863"
"300.10243912189327","151.59805030153507","289.3177054778874","148.6042045013249"