﻿"nose","0.9657080173492432","332.9384822733918","132.15201632553607"
"leftEye","0.8260753750801086","334.2213008650097","126.08752512792398"
"rightEye","0.9828888177871704","327.90802418372317","127.11700855872317"
"leftEar","0.40168923139572144","332.98352217348923","127.72459033869393"
"rightEar","0.954308271408081","318.4187682748538","128.21477521929825"
"leftShoulder","0.9875810146331787","340.0067769249512","156.4712018762183"
"rightShoulder","0.9980260133743286","310.23776346247564","154.18756853070175"
"leftElbow","0.9367262125015259","352.60412859405454","185.79434697855748"
"rightElbow","0.9267721772193909","304.2067951998051","194.2808464303119"
"leftWrist","0.8175297379493713","355.6672225268031","178.46967135721246"
"rightWrist","0.7539558410644531","316.34481984039957","206.57582541423"
"leftHip","0.9947940707206726","319.9921951145224","213.26263249269005"
"rightHip","0.9971955418586731","298.1257804885477","214.37538072612085"
"leftKnee","0.9740394949913025","341.0086577119883","246.03230080409355"
"rightKnee","0.9595866799354553","299.95707312987327","248.2444718567251"
"leftAnkle","0.9437347054481506","336.0594085038986","291.45452607212474"
"rightAnkle","0.9390135407447815","287.1661603009259","297.89447033382066"