@startuml
' hide the spot
hide circle

' avoid problems with angled crows feet
skinparam linetype ortho

entity "USER" as e01 {
  *ID : string <<generated>> <<PK>>
  --
  *USERNAME : text
  *EMAIL : text <<unique>>
  *PASSWORD : varchar
}

entity "DATA_SOURCE" as e02 {
  *ID : number <<generated>> <<PK>>
  *REF_ID : string <<unique>>
  --
  TYPE: varchar[30]
  CREATED_AT: DATETIME
  CREATED_BY: varchar[40]
  UPDATED_AT: DATETIME
  UPDATED_BY: varchar[40]
  DESC: text
}

entity "DATA_SOURCE_PARAMETERS" as e03 {
  *ID : number <<generated>> <<PK>>
  *REF_ID : string <<unique>>
  *DATA_SOURCE_ID : string <<FK>>
  --
  NAME : string << store_hash,store_name,access_token,password,secret_token,dataset_id >>
  VALUE : string << store_hash_value,store_name_value,access_token_value,password_value,secret_token_value,dataset_id_value>>
}

entity "MODEL" as e04 {
    *ID : string <<unique>> <<PK>>
    *REF_ID : string <<unique>>
    *DATA_SOURCE_ID : string <<FK>>
    --
    *NAME : string <<unique>>
    *TYPE : string
    CREATED_AT: DATETIME
    CREATED_BY: varchar[40]
    UPDATED_AT: DATETIME
    UPDATED_BY: varchar[40]

}
entity "MODEL_VERSION" as e05{
    *ID : number <<generated>> <<PK>>
    *REF_ID : string <<unique>>
    *MODEL_ID : string <<FK>>
    --
    DEPLOYMENT_NAME : string
    WORKFLOW : string
    VERSION : int
    CREATED_BY : string
    CREATED_AT : DATETIME
}
entity "MODEL_PARAMETERS" as e06{
    *ID : number <<generated>> <<PK>>
    *REF_ID : string <<unique>>
    *MODEL_VERSION_ID : number <<FK>>
    --
    *PARAMETER : String <<input_cloumns,target_column>>
    *VALUE : string <<input_cloumns_value, target_column_value>>
}
entity "FORECASTING_RESULT" as e07{
    ID : number <<generated>> <<PK>>
    MODEL_VERSION_ID : string <<FK>>
    TYPE : string <<ACTUAL,FORECAST>>
    SKU : string
    DATE : DATETIME
    YHAT : Float

}
e02 ||..o{ e03
e04 ||..o{ e05
e05 ||..o{ e06
e02 ||..o{ e04
e05 ||..o{ e07
@enduml