[
  {
    "category": "/Jobs",
    "name": "Untitled1",
    "modificationTimestamp": "2022/03/25 09:35:17"
  },
  {
    "category": "/Jobs",
    "name": "Untitled2",
    "modificationTimestamp": "2022/03/25 09:35:18"
  },
  {
    "category": "/T_NR",
    "name": "Js_NR",
    "modificationTimestamp": "2022/05/12 13:53:50"
  },
  {
    "category": "/Jobs",
    "name": "Js",
    "modificationTimestamp": "2022/03/25 09:35:27"
  },
  {
    "category": "/T_NR",
    "name": "newJob",
    "modificationTimestamp": "2022/05/04 08:57:48"
  },
  {
    "category": "/Jobs",
    "name": "cdb",
    "modificationTimestamp": "2022/03/25 09:35:19"
  },
  {
    "category": "/T_NR",
    "name": "Jx_NR_Lvl1",
    "modificationTimestamp": "2022/05/10 09:05:49"
  },
  {
    "category": "/Jobs/NewFolder1/NewFolder2/NewFolder3",
    "name": "Jx_db",
    "modificationTimestamp": "2022/05/09 07:25:47"
  },
  {
    "category": "/T_NR",
    "name": "Jx_NR_Lvl2",
    "modificationTimestamp": "2022/05/04 08:57:38"
  },
  {
    "category": "/T_NR",
    "name": "Jx_NR_Lvl3",
    "modificationTimestamp": "2022/05/04 08:57:42"
  },
  {
    "category": "/T_NR",
    "name": "Jx_NR_Lvl5",
    "modificationTimestamp": "2022/05/12 13:39:24"
  },
  {
    "category": "/T_NR",
    "name": "Jx_NR_Lvl4",
    "modificationTimestamp": "2022/05/04 13:24:01"
  },
  {
    "category": "/T_NR/jobs",
    "name": "Jx_NR_00_GetKeys",
    "modificationTimestamp": "2022/03/08 10:41:53"
  },
  {
    "category": "/T_NR/jobs",
    "name": "Jx_NR_Lvl1_0",
    "modificationTimestamp": "2022/05/09 15:36:54"
  },
  {
    "category": "/T_NR/routines",
    "name": "RtTnrSetKey",
    "modificationTimestamp": "2022/03/08 10:41:44"
  },
  {
    "category": "/T_NR/routines",
    "name": "RtTnrGetKeys",
    "modificationTimestamp": "2022/03/08 10:41:43"
  },
  {
    "category": "/T_NR/stages",
    "name": "StTnrRdStats",
    "modificationTimestamp": "2022/03/08 10:41:42"
  },
  {
    "category": "/T_NR/stages",
    "name": "StTnrWrStats",
    "modificationTimestamp": "2022/03/08 10:41:43"
  },
  {
    "category": "/T_NR/params",
    "name": "Ps_NR_Db",
    "modificationTimestamp": "2022/05/04 08:57:35"
  },
  {
    "category": "/T_NR/params",
    "name": "test",
    "modificationTimestamp": "2022/05/04 08:57:35"
  }
]