{
  "isSystem": false,
  "shortDescription": "[TNR] Level 3 : Deep table comparison",
  "modificationTimestamp": "2022/05/04 08:57:42",
  "modifiedByUser": "isadmin",
  "creationTimestamp": "2022/03/08 10:41:50",
  "createdByUser": "isadmin",
  "category": "/T_NR",
  "name": "Jx_NR_Lvl3",
  "jobType": 3,
  "webServiceEnabled": false,
  "RID": "c2e76d84.43058877.001nuq8uu.dlm20p8.s172ug.bqil4d0090ook4d424c34",
  "itemRID": "c2e76d84.78be1842.001nuq8uu.v2bs7dk.vtdf5m.o5c1pfs3j47jgqkulg0k4",
  "parentRID": "c2e76d84.3c3729dd.001nuq8uq.h8tap44.ph55gb.ir5tebdqqs9v8g2n8itnm",
  "project": "dstage2",
  "server": "IS-EN-CONDUCTOR-0.EN-COND",
  "domain": "localhost:9446",
  "type": "job"
}