{
  "name": "Js_NR",
  "category": "//T_NR",
  "type": "2",
  "sequenceOptions": [
    "logjoberrors",
    "logjobreports",
    "checkpoints"
  ],
  "parameters": [
    {
      "parameter": "Ps_NR_Db",
      "prompt": "Ps_NR_Db parameters",
      "default": "(As pre-defined)"
    },
    {
      "parameter": "table",
      "prompt": "table"
    },
    {
      "parameter": "level",
      "prompt": "level",
      "default": "2"
    }
  ],
  "metrics": {
    "stages": 10,
    "links": 11,
    "documentation": 0,
    "size": 11.1,
    "complexity": 13
  },
  "stages": [
    {
      "name": "Ja_Level1",
      "type": "JSJobActivity",
      "job": "Jx_NR_Lvl1",
      "invocation": "#Ps_NR_Db#_#table#",
      "runMode": "Reset/Run",
      "noCheckPoint": "1",
      "params": [
        {
          "parameter": "Ps_NR_Db",
          "value": "Ps_NR_Db"
        },
        {
          "parameter": "table",
          "value": "table"
        }
      ],
      "inputs": [
        {
          "name": "L_1",
          "_id": "V0S0P1"
        }
      ],
      "outputs": [
        {
          "name": "DSLink14",
          "_id": "V0S16P1",
          "trigger": "\"Execution finsihed with warnings\""
        }
      ]
    },
    {
      "name": "Nested_Condition_4",
      "type": "JSCondition",
      "outputs": [
        {
          "name": "L_1",
          "_id": "V0S0P1",
          "trigger": "level=\"1\" or level>=4"
        },
        {
          "name": "L_2",
          "_id": "V0S19P2",
          "trigger": "level=\"2\"  "
        },
        {
          "name": "L_3",
          "_id": "V0S25P2",
          "trigger": "level=\"3\""
        }
      ]
    },
    {
      "name": "Sequencer_25",
      "type": "JSSequencer",
      "mode": "Any",
      "inputs": [
        {
          "name": "L_3",
          "_id": "V0S25P2"
        },
        {
          "name": "DSLink26",
          "_id": "V0S25P4"
        }
      ],
      "outputs": [
        {
          "name": "DSLink29",
          "_id": "V2S0P3"
        }
      ]
    },
    {
      "name": "Nested_Condition_24",
      "type": "JSCondition",
      "inputs": [
        {
          "name": "DSLink23",
          "_id": "V0S24P1"
        }
      ],
      "outputs": [
        {
          "name": "DSLink26",
          "_id": "V0S25P4",
          "trigger": "level>=5"
        }
      ]
    },
    {
      "name": "Ja_Level2",
      "type": "JSJobActivity",
      "job": "Jx_NR_Lvl2",
      "invocation": "#Ps_NR_Db#_#table#",
      "runMode": "Reset/Run",
      "params": [
        {
          "parameter": "table",
          "value": "table"
        },
        {
          "parameter": "keys",
          "value": "\"\""
        },
        {
          "parameter": "Md_Before",
          "value": "\"nowarn\""
        },
        {
          "parameter": "Md_After",
          "value": "\"nowarn\""
        },
        {
          "parameter": "Ps_NR_Db",
          "value": "Ps_NR_Db"
        }
      ],
      "inputs": [
        {
          "name": "DSLink21",
          "_id": "V1S0P3"
        }
      ],
      "outputs": [
        {
          "name": "DSLink23",
          "_id": "V0S24P1",
          "trigger": "\"Executed OK\""
        }
      ]
    },
    {
      "name": "Sequencer_19",
      "type": "JSSequencer",
      "mode": "Any",
      "inputs": [
        {
          "name": "DSLink18",
          "_id": "V0S19P1"
        },
        {
          "name": "L_2",
          "_id": "V0S19P2"
        }
      ],
      "outputs": [
        {
          "name": "DSLink21",
          "_id": "V1S0P3"
        }
      ]
    },
    {
      "name": "Nested_Condition_16",
      "type": "JSCondition",
      "inputs": [
        {
          "name": "DSLink14",
          "_id": "V0S16P1"
        }
      ],
      "outputs": [
        {
          "name": "DSLink18",
          "_id": "V0S19P1",
          "trigger": " level>=5"
        }
      ]
    },
    {
      "name": "Copy_of_Ja_Level2",
      "type": "JSJobActivity",
      "job": "Jx_NR_Lvl3",
      "invocation": "#Ps_NR_Db#_#table#",
      "runMode": "Reset/Run",
      "params": [
        {
          "parameter": "Md_Before",
          "value": "\"nowarn\""
        },
        {
          "parameter": "Md_After",
          "value": "\"nowarn\""
        },
        {
          "parameter": "keys",
          "value": "\"\""
        },
        {
          "parameter": "Ps_NR_Db",
          "value": "Ps_NR_Db"
        },
        {
          "parameter": "table",
          "value": "table"
        }
      ],
      "inputs": [
        {
          "name": "DSLink29",
          "_id": "V2S0P3"
        }
      ],
      "outputs": [
        {
          "name": "DSLink32",
          "_id": "V3S0P2"
        }
      ]
    },
    {
      "name": "Copy_2_of_Ja_Level2",
      "type": "JSJobActivity",
      "job": "Jx_NR_Lvl4",
      "invocation": "#Ps_NR_Db#_#table#",
      "runMode": "Reset/Run",
      "params": [
        {
          "parameter": "Ps_NR_Db",
          "value": "Ps_NR_Db"
        },
        {
          "parameter": "table",
          "value": "table"
        }
      ],
      "inputs": [
        {
          "name": "DSLink32",
          "_id": "V3S0P2"
        }
      ],
      "outputs": [
        {
          "name": "DSLink33",
          "_id": "V4S0P2",
          "trigger": "\"Executed OK\""
        }
      ]
    },
    {
      "name": "Copy_3_of_Ja_Level2",
      "type": "JSJobActivity",
      "job": "Jx_NR_Lvl5",
      "invocation": "#Ps_NR_Db#_#table#",
      "runMode": "Reset/Run",
      "params": [
        {
          "parameter": "Ps_NR_Db",
          "value": "Ps_NR_Db"
        },
        {
          "parameter": "table",
          "value": "table"
        }
      ],
      "inputs": [
        {
          "name": "DSLink33",
          "_id": "V4S0P2"
        }
      ]
    }
  ],
  "inputs": [
    {
      "name": "Nested_Condition_4",
      "type": "JSCondition",
      "detail": "JSCondition"
    }
  ],
  "outputs": [
    {
      "name": "Copy_3_of_Ja_Level2",
      "type": "JSJobActivity",
      "detail": "Jx_NR_Lvl5"
    }
  ]
}