{
  "isSystem": false,
  "shortDescription": "[TNR] Level 1 : Statistics comparison",
  "modificationTimestamp": "2022/05/25 07:34:34",
  "modifiedByUser": "isadmin",
  "creationTimestamp": "2022/01/17 14:13:01",
  "createdByUser": "isadmin",
  "category": "/T_NR",
  "name": "Jx_NR_Lvl1",
  "jobType": 3,
  "webServiceEnabled": false,
  "RID": "c2e76d84.43058877.001nsq32a.4c01b0j.bk870c.fr9r1rpg6th9m0sevveor",
  "itemRID": "c2e76d84.78be1842.001nsq32a.jjhinhr.cd66jg.l2d0auuo2vd671p8dmmmg",
  "parentRID": "c2e76d84.3c3729dd.001nsq327.pbcfuuv.kpacno.mn6ojlpuilh1elhh9hjji",
  "project": "dstage1",
  "server": "IS-EN-CONDUCTOR-0.EN-COND",
  "domain": "localhost:9446",
  "type": "job"
}