{
  "isSystem": false,
  "shortDescription": "Generate satistics for 2 tables",
  "modificationTimestamp": "2022/05/13 13:59:57",
  "modifiedByUser": "isadmin",
  "creationTimestamp": "2022/05/13 12:18:05",
  "createdByUser": "isadmin",
  "category": "/T_NR/jobs",
  "name": "Jx_NR_Lvl1_0",
  "jobType": 3,
  "webServiceEnabled": false,
  "RID": "c2e76d84.43058877.001o1faqp.4ih7460.ffm7ck.71r131e21irdmhtd0hpfv",
  "itemRID": "c2e76d84.78be1842.001o1faqp.6i9pmg4.33lq7k.v5nstv722l4pshsolt6tc",
  "parentRID": "c2e76d84.3c3729dd.001o1faqo.tcqimo8.ehvqce.smaln87vh5qgq3tipomcd",
  "project": "dstage3",
  "server": "IS-EN-CONDUCTOR-0.EN-COND",
  "domain": "localhost:9446",
  "type": "job"
}