{
  "isSystem": false,
  "shortDescription": "Sets the environnement variable Keys and to the job user status",
  "modificationTimestamp": "2022/01/17 14:12:58",
  "modifiedByUser": "isadmin",
  "creationTimestamp": "2022/01/17 14:12:58",
  "createdByUser": "isadmin",
  "category": "/T_NR/routines",
  "name": "RtTnrSetKey",
  "jobType": 0,
  "routineType": 0,
  "RID": "c2e76d84.c5ff0135.001nsq328.sh0g4v7.br8tl0.1rt43ntuf2l6fi0rlgrt9",
  "itemRID": "c2e76d84.78be1842.001nsq328.t9uu8tr.nsgc91.lsj9j2l27uapg1v9lba0p",
  "parentRID": "c2e76d84.3c3729dd.001nsq328.frqnp4f.usgqjr.jh9gpnapnnu63cjcd7g2h",
  "project": "dstage1",
  "server": "IS-EN-CONDUCTOR-0.EN-COND",
  "domain": "localhost:9446",
  "type": "routine"
}