{
  "isSystem": false,
  "shortDescription": "Extract primary keys of  a table",
  "modificationTimestamp": "2022/04/20 15:02:50",
  "modifiedByUser": "isadmin",
  "creationTimestamp": "2022/01/17 14:13:11",
  "createdByUser": "isadmin",
  "category": "/T_NR/jobs",
  "name": "Jx_NR_00_GetKeys",
  "jobType": 3,
  "webServiceEnabled": false,
  "RID": "c2e76d84.43058877.001nsq32f.3i4d6sb.olqmn5.00fuuu46h2uducknlvv3h",
  "itemRID": "c2e76d84.78be1842.001nsq32f.ac3crpv.2or9ho.aq1p5nkqmsbm0fp0phr1l",
  "parentRID": "c2e76d84.3c3729dd.001nsq32f.1v2a06b.jdgipo.1ossudkgp6ak52lvl27m8",
  "project": "dstage1",
  "server": "IS-EN-CONDUCTOR-0.EN-COND",
  "domain": "localhost:9446",
  "type": "job"
}