{
  "isSystem": false,
  "shortDescription": "Retrieve keys from a table",
  "modificationTimestamp": "2022/05/13 13:59:55",
  "modifiedByUser": "isadmin",
  "creationTimestamp": "2022/05/13 12:17:58",
  "createdByUser": "isadmin",
  "category": "/T_NR/routines",
  "name": "RtTnrGetKeys",
  "jobType": 0,
  "routineType": 1,
  "RID": "c2e76d84.c5ff0135.001o1faql.qdhcsnk.t6dibv.0ntktqntof64k765pf62k",
  "itemRID": "c2e76d84.78be1842.001o1faql.qu1b2sk.mcehmd.1oena6j7gg2i0clrd7o4c",
  "parentRID": "c2e76d84.3c3729dd.001o1faql.pukp8e8.kkos40.amdhsplg825a1m7pgpn0k",
  "project": "dstage3",
  "server": "IS-EN-CONDUCTOR-0.EN-COND",
  "domain": "localhost:9446",
  "type": "routine"
}