[
  {
    "metrics": {
      "size": 134.9,
      "proportion": 10.38,
      "complexity": 15.77,
      "cost": 13.82,
      "documentation": 14.96,
      "atomicity": 3.93,
      "granularity": 7
    },
    "assets": {
      "assets": {
        "job": 14,
        "paramset": 2,
        "routine": 2,
        "stage": 2
      },
      "job": {
        "0": 0,
        "2": 3,
        "3": 11
      },
      "routine": {
        "0": 2,
        "2": 0,
        "3": 0
      },
      "stage": {
        "0": 0,
        "2": 0,
        "3": 2
      },
      "container": {
        "0": 0,
        "2": 0,
        "3": 0
      }
    },
    "stages": {
      "0": {},
      "2": {
        "JSJobActivity": 7,
        "JSCondition": 3,
        "JSSequencer": 2
      },
      "3": {
        "JavaStagePX": 1,
        "PxPeek": 5,
        "OracleConnectorPX": 1,
        "PxCopy": 5,
        "PxDataSet": 4,
        "PxRowGenerator": 3,
        "PxModify": 22,
        "JDBCConnectorPX": 7,
        "PxSVTransformer": 1,
        "StTnrWrStats": 2,
        "PxFunnel": 3,
        "StTnrRdStats": 6,
        "PxSort": 6,
        "PxCompare": 3,
        "PxFilter": 5,
        "PxPromoteSubRec": 6,
        "PxSequentialFile": 5,
        "PxGeneric": 12,
        "PxSample": 1,
        "PxLookup": 2,
        "PxColumnGenerator": 4,
        "CTransformerStage": 3,
        "PxCombineRecords": 1,
        "PxSplitSubRec": 2,
        "PxChecksum": 1,
        "PxAggregator": 1
      }
    }
  }
]