{
  "name": "Jx_NR_Lvl1_0",
  "category": "//T_NR//jobs",
  "type": "3",
  "description": "Generate satistics for 2 tables",
  "multiInstance": true,
  "parameters": [
    {
      "parameter": "Ps_NR_Db",
      "prompt": "Ps_NR_Db parameters",
      "default": "(As pre-defined)"
    },
    {
      "parameter": "table",
      "prompt": "table"
    }
  ],
  "metrics": {
    "stages": 6,
    "links": 5,
    "documentation": 40.9,
    "complexity": 5,
    "cost": 6,
    "size": 6.83,
    "atomicity": 0
  },
  "stages": [
    {
      "name": "jdbc_db1",
      "type": "JDBCConnectorPX",
      "preserve": "0",
      "mode": "seq",
      "server": "#Ps_NR_Db.dbConnectionString_1#",
      "table": "#Ps_NR_Db.dbSchema_1#.#table#",
      "rwmode": "0",
      "ArraySize": "1",
      "RecordCount": "2000",
      "Classpath": "$(DSHOME)/../../ASBNode/lib/java/iis-shared.jar",
      "fullProperties": [
        {
          "name": "VariantName",
          "value": "1.0"
        },
        {
          "name": "VariantLibrary",
          "value": "\"java:com/ibm/is/cc/jdbc/CC_JDBCConnectorLibrary,$(DSHOME)/../DSComponents/bin/ccjdbc.jar;$(DSHOME)\""
        },
        {
          "name": "VariantVersion",
          "value": "1.0"
        },
        {
          "name": "SupportedVariants",
          "value": "V1;1.0::\"java:com/ibm/is/cc/jdbc/CC_JDBCConnectorLibrary,$(DSHOME)/../DSComponents/bin/ccjdbc.jar;$(DSHOME)\""
        },
        {
          "name": "SupportedVariantsLibraries",
          "value": "\"java:com/ibm/is/cc/jdbc/CC_JDBCConnectorLibrary,$(DSHOME)/../DSComponents/bin/ccjdbc.jar;$(DSHOME)\""
        },
        {
          "name": "SupportedVariantsVersions",
          "value": "1.0"
        },
        {
          "name": "Orientation",
          "value": "link"
        },
        {
          "name": "RejectFromLink",
          "value": "-1"
        },
        {
          "name": "RejectThreshold",
          "value": "0"
        },
        {
          "name": "RejectNumber",
          "value": "0"
        },
        {
          "name": "RejectUsesPercentage",
          "value": "false"
        },
        {
          "name": "ConnectorName",
          "value": "JDBCConnector"
        },
        {
          "name": "Engine",
          "value": "EE"
        },
        {
          "name": "Context",
          "value": "source"
        },
        {
          "name": "ConnectionString",
          "value": "/Connection/URL"
        },
        {
          "name": "Username",
          "value": "/Connection/Username"
        },
        {
          "name": "Password",
          "value": "/Connection/Password"
        },
        {
          "name": "Attributes",
          "value": "/Connection/Attributes"
        },
        {
          "name": "XMLProperties",
          "value": "<?xml version='1.0' encoding='UTF-16'?><Properties version='1.1'><Common><Context type='int'>1</Context><Variant type='string'>1.0</Variant><DescriptorVersion type='string'>1.0</DescriptorVersion><PartitionType type='int'>-1</PartitionType><RCP type='int'>1</RCP></Common><Connection><URL modified='1' type='string'><![CDATA[#Ps_NR_Db.dbConnectionString_1#]]></URL><Username modified='1' type='string'><![CDATA[#Ps_NR_Db.dbUser_1#]]></Username><Password modified='1' type='string'><![CDATA[#Ps_NR_Db.dbPassword_1#]]></Password><Attributes modified='1' type='string'><![CDATA[]]></Attributes></Connection><Usage><ReadMode type='int'><![CDATA[0]]></ReadMode><GenerateSQL modified='1' type='bool'><![CDATA[1]]></GenerateSQL><TableName modified='1' type='string'><![CDATA[#Ps_NR_Db.dbSchema_1#.#table#]]></TableName><EnableQuotedIDs modified='1' type='bool'><![CDATA[0]]></EnableQuotedIDs><SQL></SQL><Transaction><RecordCount type='int'><![CDATA[2000]]></RecordCount><IsolationLevel type='int'><![CDATA[0]]></IsolationLevel><AutocommitMode type='int'><![CDATA[0]]></AutocommitMode><EndOfWave type='int'><![CDATA[0]]></EndOfWave><BeginEnd collapsed='1' type='bool'><![CDATA[0]]></BeginEnd></Transaction><Session><ArraySize type='int'><![CDATA[1]]></ArraySize><FetchSize type='int'><![CDATA[0]]></FetchSize><ReportSchemaMismatch type='bool'><![CDATA[0]]></ReportSchemaMismatch><DefaultLengthForColumns type='int'><![CDATA[200]]></DefaultLengthForColumns><DefaultLengthForLongColumns modified='1' type='int'><![CDATA[2000000]]></DefaultLengthForLongColumns><GenerateAllColumnsAsUnicode type='bool'><![CDATA[0]]></GenerateAllColumnsAsUnicode><CharacterSetForNonUnicodeColumns collapsed='1' type='int'><![CDATA[0]]></CharacterSetForNonUnicodeColumns><KeepConductorConnectionAlive type='bool'><![CDATA[1]]></KeepConductorConnectionAlive></Session><BeforeAfter collapsed='1' modified='1' type='bool'><![CDATA[0]]></BeforeAfter><Java><ConnectorClasspath type='string'><![CDATA[$(DSHOME)/../DSComponents/bin/ccjdbc.jar;$(DSHOME)]]></ConnectorClasspath><Classpath type='string'><![CDATA[$(DSHOME)/../../ASBNode/lib/java/iis-shared.jar]]></Classpath><HeapSize type='int'><![CDATA[256]]></HeapSize><ConnectorOtherOptions type='string'><![CDATA[-Dcom.ibm.is.cc.options=noisfjars]]></ConnectorOtherOptions></Java><LimitRows collapsed='1' modified='1' type='bool'><![CDATA[0]]></LimitRows></Usage></Properties >"
        }
      ],
      "outputs": [
        {
          "name": "In_db1",
          "_id": "V0S0P1"
        }
      ]
    },
    {
      "name": "jdbc_db2",
      "type": "JDBCConnectorPX",
      "preserve": "0",
      "mode": "seq",
      "server": "#Ps_NR_Db.dbConnectionString_2#",
      "table": "#Ps_NR_Db.dbSchema_2#.#table#",
      "rwmode": "0",
      "ArraySize": "1",
      "RecordCount": "2000",
      "Classpath": "$(DSHOME)/../../ASBNode/lib/java/iis-shared.jar",
      "fullProperties": [
        {
          "name": "VariantName",
          "value": "1.0"
        },
        {
          "name": "VariantLibrary",
          "value": "\"java:com/ibm/is/cc/jdbc/CC_JDBCConnectorLibrary,$(DSHOME)/../DSComponents/bin/ccjdbc.jar;$(DSHOME)\""
        },
        {
          "name": "VariantVersion",
          "value": "1.0"
        },
        {
          "name": "SupportedVariants",
          "value": "V1;1.0::\"java:com/ibm/is/cc/jdbc/CC_JDBCConnectorLibrary,$(DSHOME)/../DSComponents/bin/ccjdbc.jar;$(DSHOME)\""
        },
        {
          "name": "SupportedVariantsLibraries",
          "value": "\"java:com/ibm/is/cc/jdbc/CC_JDBCConnectorLibrary,$(DSHOME)/../DSComponents/bin/ccjdbc.jar;$(DSHOME)\""
        },
        {
          "name": "SupportedVariantsVersions",
          "value": "1.0"
        },
        {
          "name": "Orientation",
          "value": "link"
        },
        {
          "name": "RejectFromLink",
          "value": "-1"
        },
        {
          "name": "RejectThreshold",
          "value": "0"
        },
        {
          "name": "RejectNumber",
          "value": "0"
        },
        {
          "name": "RejectUsesPercentage",
          "value": "false"
        },
        {
          "name": "ConnectorName",
          "value": "JDBCConnector"
        },
        {
          "name": "Engine",
          "value": "EE"
        },
        {
          "name": "Context",
          "value": "source"
        },
        {
          "name": "ConnectionString",
          "value": "/Connection/URL"
        },
        {
          "name": "Username",
          "value": "/Connection/Username"
        },
        {
          "name": "Password",
          "value": "/Connection/Password"
        },
        {
          "name": "Attributes",
          "value": "/Connection/Attributes"
        },
        {
          "name": "XMLProperties",
          "value": "<?xml version='1.0' encoding='UTF-16'?><Properties version='1.1'><Common><Context type='int'>1</Context><Variant type='string'>1.0</Variant><DescriptorVersion type='string'>1.0</DescriptorVersion><PartitionType type='int'>-1</PartitionType><RCP type='int'>1</RCP></Common><Connection><URL modified='1' type='string'><![CDATA[#Ps_NR_Db.dbConnectionString_2#]]></URL><Username modified='1' type='string'><![CDATA[#Ps_NR_Db.dbUser_2#]]></Username><Password modified='1' type='string'><![CDATA[#Ps_NR_Db.dbPassword_2#]]></Password><Attributes modified='1' type='string'><![CDATA[]]></Attributes></Connection><Usage><ReadMode type='int'><![CDATA[0]]></ReadMode><GenerateSQL modified='1' type='bool'><![CDATA[1]]></GenerateSQL><TableName modified='1' type='string'><![CDATA[#Ps_NR_Db.dbSchema_2#.#table#]]></TableName><EnableQuotedIDs modified='1' type='bool'><![CDATA[0]]></EnableQuotedIDs><SQL></SQL><Transaction><RecordCount type='int'><![CDATA[2000]]></RecordCount><IsolationLevel type='int'><![CDATA[0]]></IsolationLevel><AutocommitMode type='int'><![CDATA[0]]></AutocommitMode><EndOfWave type='int'><![CDATA[0]]></EndOfWave><BeginEnd collapsed='1' type='bool'><![CDATA[0]]></BeginEnd></Transaction><Session><ArraySize type='int'><![CDATA[1]]></ArraySize><FetchSize type='int'><![CDATA[0]]></FetchSize><ReportSchemaMismatch type='bool'><![CDATA[0]]></ReportSchemaMismatch><DefaultLengthForColumns type='int'><![CDATA[200]]></DefaultLengthForColumns><DefaultLengthForLongColumns modified='1' type='int'><![CDATA[2000000]]></DefaultLengthForLongColumns><GenerateAllColumnsAsUnicode type='bool'><![CDATA[0]]></GenerateAllColumnsAsUnicode><CharacterSetForNonUnicodeColumns collapsed='1' type='int'><![CDATA[0]]></CharacterSetForNonUnicodeColumns><KeepConductorConnectionAlive type='bool'><![CDATA[1]]></KeepConductorConnectionAlive></Session><BeforeAfter collapsed='1' modified='1' type='bool'><![CDATA[0]]></BeforeAfter><Java><ConnectorClasspath type='string'><![CDATA[$(DSHOME)/../DSComponents/bin/ccjdbc.jar;$(DSHOME)]]></ConnectorClasspath><Classpath type='string'><![CDATA[$(DSHOME)/../../ASBNode/lib/java/iis-shared.jar]]></Classpath><HeapSize type='int'><![CDATA[256]]></HeapSize><ConnectorOtherOptions type='string'><![CDATA[-Dcom.ibm.is.cc.options=noisfjars]]></ConnectorOtherOptions></Java><LimitRows collapsed='1' modified='1' type='bool'><![CDATA[0]]></LimitRows></Usage></Properties >"
        }
      ],
      "outputs": [
        {
          "name": "In_db2",
          "_id": "V0S1P1"
        }
      ]
    },
    {
      "name": "StTnrWrStats_1",
      "type": "StTnrWrStats",
      "fullProperties": [
        {
          "name": "r",
          "value": "#DSProjectDirectory#/#Ps_NR_Db#_#table#_1.stats"
        },
        {
          "name": "d",
          "value": "|#DSJobName#.#DSJobInvocationId#|#DSStageName#|#DSJobStartTimestamp#"
        }
      ],
      "inputs": [
        {
          "name": "In_db1",
          "_id": "V0S0P1",
          "linkType": "1",
          "RCP": "1",
          "Part": "roundrobin",
          "SortAdv": "-nonStable",
          "sort": "auto",
          "pPart": {
            "roundrobin": [
              0
            ]
          }
        }
      ],
      "outputs": [
        {
          "name": "Out_1",
          "_id": "V0S6P1"
        }
      ]
    },
    {
      "name": "StTnrWrStats_2",
      "type": "StTnrWrStats",
      "fullProperties": [
        {
          "name": "r",
          "value": "#DSProjectDirectory#/#Ps_NR_Db#_#table#_2.stats"
        },
        {
          "name": "d",
          "value": "|#DSJobName#.#DSJobInvocationId#|#DSStageName#|#DSJobStartTimestamp#"
        }
      ],
      "inputs": [
        {
          "name": "In_db2",
          "_id": "V0S1P1",
          "linkType": "1",
          "RCP": "1",
          "Part": "roundrobin",
          "SortAdv": "-nonStable",
          "sort": "auto",
          "pPart": {
            "roundrobin": [
              0
            ]
          }
        }
      ],
      "outputs": [
        {
          "name": "Out_2",
          "_id": "V0S6P2"
        }
      ]
    },
    {
      "name": "Fu_null",
      "type": "PxFunnel",
      "operator": "funnel",
      "fullProperties": [
        {
          "name": "operator",
          "value": "funnel"
        }
      ],
      "inputs": [
        {
          "name": "Out_1",
          "_id": "V0S6P1",
          "linkType": "1",
          "RCP": "1",
          "Part": "same",
          "SortAdv": "-nonStable",
          "sort": "auto",
          "pPart": {
            "roundrobin": [
              0
            ]
          }
        },
        {
          "name": "Out_2",
          "_id": "V0S6P2",
          "linkType": "1",
          "RCP": "1",
          "Part": "same",
          "SortAdv": "-nonStable",
          "sort": "auto",
          "pPart": {
            "roundrobin": [
              0
            ]
          }
        }
      ],
      "outputs": [
        {
          "name": "Out_null",
          "_id": "V0S13P1",
          "columns": [
            {
              "name": "test",
              "type": "integer"
            }
          ]
        }
      ]
    },
    {
      "name": "Copy_13",
      "type": "PxCopy",
      "inputs": [
        {
          "name": "Out_null",
          "_id": "V0S13P1",
          "linkType": "1",
          "RCP": "1",
          "Part": "same",
          "SortAdv": "-nonStable",
          "sort": "auto",
          "pPart": {
            "roundrobin": [
              0
            ]
          }
        }
      ]
    }
  ],
  "inputs": [
    {
      "name": "jdbc_db1",
      "type": "JDBCConnectorPX",
      "detail": {
        "server": "#Ps_NR_Db.dbConnectionString_1#",
        "tables": [
          "#Ps_NR_Db.dbSchema_1#.#table#"
        ]
      }
    },
    {
      "name": "jdbc_db2",
      "type": "JDBCConnectorPX",
      "detail": {
        "server": "#Ps_NR_Db.dbConnectionString_2#",
        "tables": [
          "#Ps_NR_Db.dbSchema_2#.#table#"
        ]
      }
    }
  ],
  "longDescription": "NSITBIM - 20200616 - Fix - Connection parameters where not correct on stage jdbc_db2\r\n\r\n\r\nNSITBIM - 20200506 - Init\r\n\r\nSelect all fields for 2 tables to compare and generate statistics for each numeric field of each table.\r\n\r\nThis job is a used as a dependency for the Level 1 job [Jx_NR_Lvl1](../../Jx_NR_Lvl1)\r\n\r\nIt uses a custom stage implementation of the statistics operator\r\n\r\n\r\n## Dependencies\r\n\r\n* [Stage StTnrWrStats](../../stages/StTnrWrStats)"
}