List all accelerometers in this file in any order,,,,,,,,,,,,,,,,,
(no blank lines-comma delimited-import starts row 4),,,,,,,,,,,,,,,,,
Model ,Serial #,Sens(V/g)(V/N),Calibration (V/g),.5 Hz %Dev.,1 Hz %Dev.,2 Hz %Dev.,5 Hz %Dev.,7 Hz %Dev.,15 Hz %Dev.,20 Hz %Dev.,30 Hz %Dev.,50 Hz %Dev.,70 Hz %Dev.,100 Hz %Dev.,200 Hz %Dev.,300 Hz %Dev.,450 Hz %Dev.
393B31,39207,10,9.89,,,,,,,,,,,,,,
393B31,39208,10,9.9,,,,,,,,,,,,,,
393B31,39210,10,9.53,1.6,1.4,1,0.5,0.3,-0.1,-0.3,-0.4,-0.5,-0.6,-0.4,1.5,,
393B31,39211,10,10.16,,,,,,,,,,,,,,
393B31,39212,10,9.81,,,,,,,,,,,,,,
393B04,39389,1,1.005,,,,,,,,,,,,,,
393B04,39391,1,1.017,,,,,,,,,,,,,,
393B04,39392,1,1.003,,,,,,,,,,,,,,
393B04,39393,1,1.008,,,,,,,,,,,,,,
393B04,39399,1,0.999,,,,,,,,,,,,,,
393B04,39401,1,1.007,,,,,,,,,,,,,,
393B04,39402,1,1.01,,,,,,,,,,,,,,
393B04,39403,1,1.007,,,,,,,,,,,,,,
393B04,39509,1,1.008,,,,,,,,,,,,,,
393B04,39510,1,1.01,,,,,,,,,,,,,,
393B04,47584,1,0.996,3.6,3.3,2.9,2.2,1.9,1.3,,0.9,0.4,,,,-1.7,-2.9
393B31,39206,10,9.97,,,,,,,,,,,,,,
393B31,42801,10,10.12,,,,,,,,,,,,,,
393B31,42800,10,9.8,,,,,,,,,,,,,,
393B31,42799,10,10.02,,,,,,,,,,,,,,
393B31,42802,10,9.82,,,,,,,,,,,,,,
393B31,42798,10,9.84,,,,,,,,,,,,,,
393B31,42757,10,9.84,,,,,,,,,,,,,,
208C02,43768,0.011241,0.01076,,,,,,,,,,,,,,
208C02,43769,0.011241,0.0112,,,,,,,,,,,,,,
208C02,43770,0.011241,0.01115,,,,,,,,,,,,,,
208C02,43771,0.011241,0.01086,,,,,,,,,,,,,,
393B31,51582,10,10.23,1.4,1.3,1,0.4,0.2,-0.3,-0.5,-0.8,-0.9,-0.9,-0.8,1.2,,
393B31,51556,10,9.74,1.4,1.2,0.9,0.3,0.2,-0.3,-0.5,-0.7,-0.8,-0.8,-0.7,1.1,,
393B31,51550,10,9.72,1.4,1.2,0.9,0.4,0.2,-0.2,-0.4,-0.6,-0.8,-0.8,-0.7,0.9,,
393B31,51574,10,9.61,1.7,1.4,1.1,0.4,0.2,-0.3,-0.5,-0.7,-0.8,-0.7,-0.2,3.5,,
393B31,51573,10,9.68,1.5,1.4,1,0.4,0.2,-0.3,-0.5,-0.8,-0.9,-1,-0.9,0.7,,
393B31,51585,10,10.17,1,1.1,0.8,0.3,0.1,-0.3,-0.5,-0.7,-0.8,-0.8,-0.6,1.4,,
393B31,51549,10,9.67,1.4,1.2,0.9,0.4,0.2,-0.2,-0.4,-0.6,-0.7,-0.7,-0.4,1.9,,
393B31,51548,10,9.64,1.3,1.1,0.9,0.4,0.2,-0.2,-0.4,-0.5,-0.7,-0.7,-0.5,1.5,,
393B31,51553,10,9.72,1.5,1.2,0.9,0.4,0.2,-0.3,-0.4,-0.7,-0.8,-0.8,-0.7,1,,
393B31,51581,10,9.89,0.6,0.8,0.6,0.2,0.1,-0.3,-0.5,-0.6,-0.7,-0.7,-0.4,1.8,,
393B31,51555,10,9.76,1.3,1.1,0.8,0.3,0.2,-0.2,-0.4,-0.6,-0.7,-0.7,-0.6,1.2,,
393B31,51572,10,9.7,1.2,1.3,1,0.4,0.2,-0.2,-0.5,-0.7,-0.9,-1,-0.9,0.7,,
393B31,51558,10,10,1.4,1.2,0.8,0.3,0.1,-0.3,-0.5,-0.7,-0.8,-0.8,-0.6,1.2,,
393B31,51559,10,9.79,1.3,1.2,0.8,0.3,0.1,-0.3,-0.5,-0.7,-0.8,-0.8,-0.7,1,,
393B31,51575,10,9.74,1.2,1.3,0.9,0.4,0.2,-0.2,-0.4,-0.6,-0.8,-0.8,-0.7,1,,
393B31,51551,10,9.58,1.5,1.3,0.9,0.4,0.2,-0.2,-0.5,-0.7,-0.8,-0.9,-0.8,0.7,,
393B31,51816,10,9.9,1.1,1.1,0.8,0.3,0.1,-0.3,-0.4,-0.6,-0.7,-0.7,-0.5,1.3,,
393B32,51817,10,9.87,1,1.1,0.7,0.3,0.1,-0.3,-0.4,-0.6,-0.7,-0.7,-0.5,1.2,,
393B33,51818,10,9.94,1.2,1.1,0.8,0.2,0.1,-0.3,-0.5,-0.7,-0.8,-0.9,-0.7,0.9,,
393B34,51872,10,9.82,1.3,1.2,0.9,0.3,0.2,-0.3,-0.4,-0.6,-0.8,-0.8,-0.6,1.2,,
393B35,51868,10,9.68,1.1,1.1,0.8,0.3,0.1,-0.2,-0.4,-0.6,-0.7,-0.7,-0.6,1.1,,
393B36,51869,10,9.82,1.3,1.1,0.8,0.3,0.2,-0.2,-0.4,-0.6,-0.7,-0.7,-0.6,1.1,,
393B37,51870,10,9.96,1.3,1.2,0.9,0.4,0.2,-0.3,-0.4,-0.7,-0.8,-0.8,-0.6,1.4,,
393B38,51878,10,9.81,1.3,1.2,0.9,0.4,0.2,-0.3,-0.4,-0.7,-0.8,-0.9,-0.7,0.9,,
393B39,51879,10,9.85,1.5,1.3,0.9,0.4,0.2,-0.3,-0.5,-0.7,-0.8,-0.9,-0.8,0.8,,
393B40,51881,10,9.96,1.4,1.2,0.9,0.4,0.2,-0.3,-0.5,-0.7,-0.8,-0.9,-0.7,0.8,,
393B41,51882,10,9.7,1.5,1.2,0.9,0.3,0.2,-0.3,-0.5,-0.7,-0.8,-0.9,-0.7,1,,
393B42,51873,10,9.85,1.5,1.3,0.9,0.4,0.2,-0.3,-0.5,-0.7,-0.9,-0.9,-0.8,0.6,,
393B43,51874,10,9.56,1.5,1.2,0.9,0.3,0.2,-0.3,-0.4,-0.7,-0.8,-0.8,-0.7,1.1,,
393B44,51875,10,9.8,1.4,1.2,0.9,0.3,0.2,-0.3,-0.5,-0.7,-0.8,-0.8,-0.6,1.3,,
393B45,51876,10,9.62,1.2,1.2,0.9,0.4,0.2,-0.2,-0.4,-0.6,-0.7,-0.7,-0.6,0.9,,
393B46,51877,10,9.75,1.4,1.2,0.9,0.3,0.1,-0.3,-0.5,-0.7,-0.8,-0.8,-0.7,1,,
393B47,51963,10,9.94,1.5,1.3,0.9,0.4,0.2,-0.2,-0.4,-0.7,-0.8,-0.8,-0.7,1.1,,
393B48,51964,10,9.87,1.5,1.3,0.9,0.3,0.2,-0.3,-0.5,-0.7,-0.9,-1,-0.9,0.7,,
393B49,51965,10,9.99,1.6,1.3,1,0.4,0.2,-0.3,-0.5,-0.8,-0.9,-1,-1,0.3,,
393B50,51966,10,9.78,1.5,1.2,0.9,0.4,0.2,-0.3,-0.4,-0.7,-0.8,-0.9,-0.7,0.9,,
393B51,51967,10,9.97,1.5,1.3,0.9,0.4,0.2,-0.3,-0.5,-0.7,-0.9,-0.9,-0.8,0.9,,
393B51,56263,10,10,,,,,,,,,,,,,,
393B51,56071,10,10,,,,,,,,,,,,,,
393B51,56052,10,10,,,,,,,,,,,,,,
393B51,56059,10,10,,,,,,,,,,,,,,
393B51,56069,10,10,,,,,,,,,,,,,,
393B51,56058,10,10,,,,,,,,,,,,,,
393B51,56072,10,10,,,,,,,,,,,,,,
393B51,56264,10,10,,,,,,,,,,,,,,
393B51,56051,10,10,,,,,,,,,,,,,,