[symbol2]
bbox -355 128 3 256
port -340 194 100 0 SLNK symbol 1 -352 192 0
port -16 208 100 1792 FLNK symbol 2 0 192 0
uniq 27
[tools]
[attributes]
[layers]
<symbol>
l 100 0 0 -252 185 GEA Interface
r 0 -288 128 -64 256
v 0 -352 192
-288 192
_
v 0 -64 192
0 192
_
[comments]
