[schematic2]
uniq 27
[tools]
[detail]
w 1776 819 100 0 n#1 eloads.eloads#86.FLNK 1728 816 1824 816 1824 416 2112 416 2112 560 2192 560 egenSub.egenSub#102.SLNK
w 1264 771 100 0 n#2 egenSub.egenSub#89.VALG 1120 768 1408 768 1408 672 2112 672 2112 656 2192 656 egenSub.egenSub#102.INPJ
w 1248 835 100 0 n#3 egenSub.egenSub#89.VALF 1120 832 1376 832 1376 640 1856 640 1856 720 2192 720 egenSub.egenSub#102.INPI
w 1280 419 100 0 n#4 egenSub.egenSub#89.FLNK 1120 416 1440 416 1440 768 1504 768 eloads.eloads#86.SLNK
w 1232 963 100 0 n#5 egenSub.egenSub#89.VALD 1120 960 1344 960 1344 608 1888 608 1888 784 2192 784 egenSub.egenSub#102.INPH
w 1216 899 100 0 n#6 egenSub.egenSub#89.VALE 1120 896 1312 896 1312 576 1920 576 1920 848 2192 848 egenSub.egenSub#102.INPG
w 1312 1091 100 0 n#7 egenSub.egenSub#89.VALB 1120 1088 1504 1088 eloads.eloads#86.UPL
w 1283 816 100 0 n#7 junction 1280 1088 1280 544 1952 544 1952 912 2192 912 egenSub.egenSub#102.INPF
w 640 883 100 0 n#8 hwin.hwin#231.in 608 880 672 880 672 928 832 928 egenSub.egenSub#89.INPD
w 608 2211 100 0 n#9 egenSub.UpDownTrigger.VALA 512 2208 704 2208 704 864 832 864 egenSub.egenSub#89.INPE
w 672 1475 100 0 n#10 egenSub.UpDownTrigger.FLNK 512 1472 832 1472 832 1856 928 1856 eseqs.eseqs#161.SLNK
w 1251 832 100 0 n#11 junction 1248 1152 1248 512 1984 512 1984 976 2192 976 egenSub.egenSub#102.INPE
w 1312 1155 100 0 n#11 egenSub.egenSub#89.VALA 1120 1152 1504 1152 eloads.eloads#86.DNL
w 640 1187 100 0 n#12 hwin.hwin#99.in 608 1184 672 1184 672 1120 832 1120 egenSub.egenSub#89.INPA
w 2536 1107 100 0 n#13 egenSub.egenSub#102.OUTC 2480 1104 2592 1104 hwout.hwout#165.outp
w 2536 1171 100 0 n#14 egenSub.egenSub#102.OUTB 2480 1168 2592 1168 hwout.hwout#131.outp
w 2536 1235 100 0 n#15 egenSub.egenSub#102.OUTA 2480 1232 2592 1232 hwout.hwout#139.outp
w 1920 1075 100 0 n#16 eloads.eloads#86.MSG 1728 1072 2112 1072 2112 1040 2192 1040 egenSub.egenSub#102.INPD
w 1960 1107 100 0 n#17 eloads.eloads#86.VAL 1728 1104 2192 1104 egenSub.egenSub#102.INPC
w 1168 1027 100 0 n#18 egenSub.egenSub#89.VALC 1120 1024 1216 1024 1216 480 2016 480 2016 1168 2192 1168 egenSub.egenSub#102.INPB
w 1584 451 100 0 n#19 egenSub.egenSub#89.VAL 1120 448 2048 448 2048 1232 2192 1232 egenSub.egenSub#102.INPA
w 1752 1043 100 0 n#20 eloads.eloads#86.OUT 1728 1040 1776 1040 hwout.hwout#87.outp
w 720 1059 100 0 n#21 ebis.ebis#104.VAL 608 1056 832 1056 egenSub.egenSub#89.INPB
w 1280 2147 100 0 n#22 eseqs.eseqs#161.LNK2 1248 2144 1312 2144 1312 1312 256 1312 256 448 832 448 egenSub.egenSub#89.SLNK
w 1392 2179 100 0 n#23 eseqs.eseqs#161.LNK1 1248 2176 1536 2176 eaos.eaos#115.SLNK
w 803 2240 100 0 n#24 hwin.hwin#112.in 800 2304 800 2176 928 2176 eseqs.eseqs#161.DOL1
w 1880 2147 100 0 n#25 eaos.eaos#115.OUT 1792 2144 1968 2144 hwout.hwout#157.outp
w 610 778 -100 0 n#26 hwin.hwin#236.in 608 776 688 776 688 800 832 800 egenSub.egenSub#89.INPF
[cell use]
use bc200tr -96 -104 -100 0 frame
xform 0 1584 1200
use hwin 440 1144 100 0 hwin#99
xform 0 512 1184
p 419 1176 100 0 -1 val(in):$(card)
use hwin 632 2264 100 0 hwin#112
xform 0 704 2304
p 611 2296 100 0 -1 val(in):$(BUSY)
use hwin 440 840 100 0 hwin#231
xform 0 512 880
p 384 830 100 0 -1 val(in):$(top)savePath
use egenSub 2216 472 100 0 egenSub#102
xform 0 2336 896
p 2288 1246 100 0 1 FTA:LONG
p 2304 464 100 1024 1 name:$(top)UpDownEnd
p 2224 430 100 0 1 SNAM:UpDownEnd
p 2272 878 100 0 1 FTVA:STRING
p 2272 846 100 0 1 FTVB:LONG
p 2272 814 100 0 1 FTVC:STRING
p 2288 1214 100 0 1 FTB:STRING
p 2288 1182 100 0 1 FTC:LONG
p 2288 1150 100 0 1 FTD:STRING
p 2288 1118 100 0 1 FTE:STRING
p 2288 1086 100 0 1 FTF:STRING
p 2288 1054 100 0 1 FTG:STRING
p 2288 1022 100 0 1 FTH:STRING
p 2288 990 100 0 1 FTI:STRING
p 2288 958 100 0 1 FTJ:LONG
use egenSub 856 360 100 0 egenSub#89
xform 0 976 784
p 912 766 100 0 1 FTVA:STRING
p 912 734 100 0 1 FTVB:STRING
p 944 352 100 1024 1 name:$(top)UpDownStart
p 848 318 100 0 1 SNAM:UpDownStart
p 912 574 100 0 0 FTJ:DOUBLE
p 912 702 100 0 1 FTVC:STRING
p 912 1118 100 0 1 FTB:STRING
p 912 318 100 0 0 SCAN:Passive
p 912 286 100 0 0 EVNT:0
p 912 1150 100 0 1 FTA:DOUBLE
p 912 670 100 0 1 FTVD:STRING
p 912 1086 100 0 1 FTC:DOUBLE
p 912 1054 100 0 1 FTD:STRING
p 912 1022 100 0 1 FTE:STRING
p 912 638 100 0 1 FTVE:STRING
p 912 990 100 0 1 FTF:STRING
p 912 606 100 0 1 FTVF:STRING
p 912 574 100 0 1 FTVG:LONG
use egenSub 336 1385 100 0 UpDownTrigger
xform 0 368 1840
p 336 1408 100 1024 0 name:
p 288 2270 100 0 1 SNAM:UpDownTrigger
p 304 2190 100 0 0 FTA:DOUBLE
p 304 2126 100 0 1 FTVA:STRING
p 304 2094 100 0 0 FTVB:DOUBLE
p 304 2190 100 0 1 FTJ:STRING
p 252 1385 100 0 -1 PV:$(top)
use hwout 2616 1064 100 0 hwout#165
xform 0 2688 1104
p 2800 1102 100 0 -1 val(outp):pmacSir .PP
use hwout 2616 1192 100 0 hwout#139
xform 0 2688 1232
p 2800 1230 100 0 -1 val(outp):pmacC.IMSS
use hwout 2616 1128 100 0 hwout#131
xform 0 2688 1168
p 2800 1166 100 0 -1 val(outp):pmacC.IVAL .PP
use hwout 1800 1000 100 0 hwout#87
xform 0 1872 1040
p 1808 990 100 0 -1 val(outp):#C$(card) S0 @
use hwout 1992 2104 100 0 hwout#157
xform 0 2064 2144
p 1888 2094 100 0 -1 val(outp):pmacC.IVAL .PP
use eseqs 952 1768 100 0 eseqs#161
xform 0 1088 2016
p 1040 1760 100 1024 1 name:$(top)UpDownSeq
p 1040 2238 100 0 1 DLY2:0.25
p 1264 2176 75 1024 -1 pproc(LNK1):PP
p 1264 2144 75 1024 -1 pproc(LNK2):PP
p 1264 2112 75 1024 -1 pproc(LNK3):NPP
p 1040 2206 100 0 1 SELM:All
use eaos 1560 2088 100 0 eaos#115
xform 0 1664 2176
p 1280 2158 100 0 0 OMSL:supervisory
p 1648 2080 100 1024 1 name:$(top)UpDownAo
use ebis 376 1000 100 0 ebis#104
xform 0 480 1072
p 464 992 100 1024 1 name:$(top)UpDownBi
p 432 926 100 0 1 ONAM:MOTION
p 432 958 100 0 1 ZNAM:PLC
use eloads 1528 680 100 0 eloads#86
xform 0 1616 960
p 1504 1230 100 0 1 DTYP:PMAC-VME ASCII
p 1608 672 100 1024 1 name:$(top)UpDownload
p 1536 638 100 0 0 SCAN:Passive
p 1536 606 100 0 0 EVNT:0
use estringouts 1703 1624 100 0 savePath
xform 0 1728 1720
p 1619 1624 100 0 -1 PV:$(top)
use estringouts 1703 1456 100 0 fileName
xform 0 1728 1552
p 1619 1456 100 0 -1 PV:$(top)
use hwin 440 736 100 0 hwin#236
xform 0 512 776
p 384 726 100 0 -1 val(in):$(top)fileName
[comments]
