[symbol2]
bbox 80 416 304 968
port 96 940 100 0 VALA symbol 1 80 940 0
port 96 910 100 0 VALB symbol 1 80 910 0
port 96 880 100 0 VALC symbol 1 80 880 0
port 96 850 100 0 VALD symbol 1 80 850 0
port 96 820 100 0 VALE symbol 1 80 820 0
port 96 790 100 0 VALF symbol 1 80 790 0
port 96 760 100 0 VALG symbol 1 80 760 0
port 96 730 100 0 VALH symbol 1 80 730 0
port 96 700 100 0 VALI symbol 1 80 700 0
port 96 670 100 0 VALJ symbol 1 80 670 0
port 96 640 100 0 VALK symbol 1 80 640 0
port 96 610 100 0 VALL symbol 1 80 610 0
port 96 580 100 0 VALM symbol 1 80 580 0
port 96 550 100 0 VALN symbol 1 80 550 0
port 96 520 100 0 VALO symbol 1 80 520 0
port 96 490 100 0 VALP symbol 1 80 490 0
port 130 430 100 0 SLNK symbol 1 80 430 0
uniq 1
[tools]
[attributes]
[layers]
<symbol>
l 150 0 0 142 592 gwSendInitComm
r 0 80 968 304 416
[comments]
