[symbol2]
bbox 96 288 1216 544
uniq 0
[tools]
[attributes]
[layers]
<symbol>
l 200 0 0 384 336 NICI
l 200 0 0 160 336 NIFS
l 200 0 0 384 464 GMOS
l 200 0 0 1088 464 F2
l 200 0 0 832 464 NIRS
l 200 0 0 160 464 NONE
l 200 0 0 608 464 NIRI
l 200 0 0 608 336 GSAOI
l 200 0 0 832 336 GPI
r 0 96 416 1216 544
r 0 96 288 1216 416
v 0 992 544
992 416
_
v 0 768 544
768 416
_
v 0 992 416
992 288
_
v 0 768 416
768 288
_
v 0 544 416
544 288
_
v 0 320 416
320 288
_
v 0 544 544
544 416
_
v 0 320 544
320 416
_
[comments]
