[symbol2]
bbox 80 416 304 928
port 96 870 100 0 VALA symbol 1 80 887 0
port 96 820 100 0 VALB symbol 1 80 820 0
port 96 770 100 0 VALC symbol 1 80 770 0
port 96 720 100 0 VALD symbol 1 80 720 0
port 96 670 100 0 VALE symbol 1 80 670 0
port 96 620 100 0 VALF symbol 1 80 620 0
port 96 570 100 0 VALG symbol 1 80 570 0
port 96 520 100 0 VALH symbol 1 80 520 0
port 130 460 100 0 SLNK symbol 1 80 460 0
uniq 1
[tools]
[attributes]
[layers]
<symbol>
l 150 0 0 112 592 gwSendComm
r 0 80 928 304 416
[comments]
