[symbol2]
bbox -128 96 192 1824
port 160 1632 100 1024 ODIR symbol 3 192 1632 0
port 160 288 100 1024 FLNK symbol 2 192 288 0
port -96 384 100 1024 T symbol 3 -128 384 0
port -96 448 100 1024 S symbol 3 -128 448 0
port -96 512 100 1024 R symbol 3 -128 512 0
port -96 576 100 1024 Q symbol 3 -128 576 0
port -96 640 100 1024 P symbol 3 -128 640 0
port -96 704 100 1024 O symbol 3 -128 704 0
port -96 768 100 1024 N symbol 3 -128 768 0
port -96 832 100 1024 M symbol 3 -128 832 0
port -96 896 100 1024 L symbol 3 -128 896 0
port -96 960 100 1024 K symbol 3 -128 960 0
port -96 1024 100 1024 J symbol 3 -128 1024 0
port -96 1088 100 1024 I symbol 3 -128 1088 0
port -96 1152 100 1024 H symbol 3 -128 1152 0
port -96 1216 100 1024 G symbol 3 -128 1216 0
port -96 1280 100 1024 F symbol 3 -128 1280 0
port -96 1344 100 1024 E symbol 3 -128 1344 0
port -96 1408 100 1024 D symbol 3 -128 1408 0
port -96 1472 100 1024 C symbol 3 -128 1472 0
port -96 1536 100 1024 B symbol 3 -128 1536 0
port -96 1600 100 1024 A symbol 3 -128 1600 0
port 160 352 100 1024 OUTT symbol 2 192 352 0
port 160 384 100 1024 VALT symbol 3 192 384 0
port 160 416 100 1024 OUTS symbol 2 192 416 0
port 160 448 100 1024 VALS symbol 3 192 448 0
port 160 480 100 1024 OUTR symbol 2 192 480 0
port 160 512 100 1024 VALR symbol 3 192 512 0
port 160 544 100 1024 OUTQ symbol 2 192 544 0
port 160 576 100 1024 VALQ symbol 3 192 576 0
port 160 608 100 1024 OUTP symbol 2 192 608 0
port 160 640 100 1024 VALP symbol 3 192 640 0
port 160 672 100 1024 OUTO symbol 2 192 672 0
port 160 704 100 1024 VALO symbol 3 192 704 0
port 160 736 100 1024 OUTN symbol 2 192 736 0
port 160 768 100 1024 VALN symbol 3 192 768 0
port 160 800 100 1024 OUTM symbol 2 192 800 0
port 160 832 100 1024 VALM symbol 3 192 832 0
port 160 864 100 1024 OUTL symbol 2 192 864 0
port 160 896 100 1024 VALL symbol 3 192 896 0
port 160 928 100 1024 OUTK symbol 2 192 928 0
port 160 960 100 1024 VALK symbol 3 192 960 0
port 160 992 100 1024 OUTJ symbol 2 192 992 0
port 160 1024 100 1024 VALJ symbol 3 192 1024 0
port 160 1056 100 1024 OUTI symbol 2 192 1056 0
port 160 1088 100 1024 VALI symbol 3 192 1088 0
port 160 1120 100 1024 OUTH symbol 2 192 1120 0
port 160 1152 100 1024 VALH symbol 3 192 1152 0
port 160 1184 100 1024 OUTG symbol 2 192 1184 0
port 160 1216 100 1024 VALG symbol 3 192 1216 0
port 160 1248 100 1024 OUTF symbol 2 192 1248 0
port 160 1280 100 1024 VALF symbol 3 192 1280 0
port 160 1312 100 1024 OUTE symbol 2 192 1312 0
port 160 1344 100 1024 VALE symbol 3 192 1344 0
port 160 1376 100 1024 OUTD symbol 2 192 1376 0
port 160 1408 100 1024 VALD symbol 3 192 1408 0
port 160 1440 100 1024 OUTC symbol 2 192 1440 0
port 160 1472 100 1024 VALC symbol 3 192 1472 0
port 160 1504 100 1024 OUTB symbol 2 192 1504 0
port 160 1536 100 1024 VALB symbol 3 192 1536 0
port 160 1568 100 1024 OUTA symbol 2 192 1568 0
port 160 1600 100 1024 VALA symbol 3 192 1600 0
port 160 1664 100 1024 OSIM symbol 3 192 1664 0
port 160 1696 100 1024 OCID symbol 3 192 1696 0
port 160 1760 100 1024 MESS symbol 3 192 1760 0
port 160 1728 100 1024 MARK symbol 3 192 1728 0
port 160 1792 100 1024 VAL symbol 3 192 1792 0
port 160 128 100 1024 SPLK symbol 2 192 128 0
port 160 160 100 1024 STLK symbol 2 192 160 0
port 160 192 100 1024 PLNK symbol 2 192 192 0
port 160 224 100 1024 CLNK symbol 2 192 224 0
port 160 256 100 1024 MLNK symbol 2 192 256 0
port -96 128 100 1024 SDIS symbol 1 -128 128 0
port -96 160 100 1024 SLNK symbol 1 -128 160 0
port -96 1696 100 1024 SIOL symbol 1 -128 1696 0
port -96 1728 100 1024 SIML symbol 1 -128 1728 0
port -96 1760 100 1024 ICID symbol 3 -128 1760 0
port -96 1792 100 1024 DIR symbol 3 -128 1792 0
port -96 352 100 1024 INPT symbol 1 -128 352 0
port -96 416 100 1024 INPS symbol 1 -128 416 0
port -96 480 100 1024 INPR symbol 1 -128 480 0
port -96 544 100 1024 INPQ symbol 1 -128 544 0
port -96 608 100 1024 INPP symbol 1 -128 608 0
port -96 672 100 1024 INPO symbol 1 -128 672 0
port -96 736 100 1024 INPN symbol 1 -128 736 0
port -96 800 100 1024 INPM symbol 1 -128 800 0
port -96 864 100 1024 INPL symbol 1 -128 864 0
port -96 928 100 1024 INPK symbol 1 -128 928 0
port -96 992 100 1024 INPJ symbol 1 -128 992 0
port -96 1056 100 1024 INPI symbol 1 -128 1056 0
port -96 1120 100 1024 INPH symbol 1 -128 1120 0
port -96 1184 100 1024 INPG symbol 1 -128 1184 0
port -96 1248 100 1024 INPF symbol 1 -128 1248 0
port -96 1312 100 1024 INPE symbol 1 -128 1312 0
port -96 1376 100 1024 INPD symbol 1 -128 1376 0
port -96 1440 100 1024 INPC symbol 1 -128 1440 0
port -96 1504 100 1024 INPB symbol 1 -128 1504 0
port -96 1568 100 1024 INPA symbol 1 -128 1568 0
uniq 21
[tools]
[attributes]
p -32 1728 100 0 0 CTYP:20
p -32 1696 100 0 0 DESC:Gemini CAD20 Record
p -32 1664 100 0 0 DISS:NO_ALARM
p -32 1632 100 0 0 DISV:1
p -32 1600 100 0 0 ERSV:NO_ALARM
p -32 1568 100 0 0 EVNT:0
p -32 1536 100 0 0 FTVA:STRING
p -32 1504 100 0 0 FTVB:STRING
p -32 1472 100 0 0 FTVC:STRING
p -32 1440 100 0 0 FTVD:STRING
p -32 1408 100 0 0 FTVE:STRING
p -32 1376 100 0 0 FTVF:STRING
p -32 1344 100 0 0 FTVG:STRING
p -32 1312 100 0 0 FTVH:STRING
p -32 1280 100 0 0 FTVI:STRING
p -32 1248 100 0 0 FTVJ:STRING
p -32 1216 100 0 0 FTVK:STRING
p -32 1184 100 0 0 FTVL:STRING
p -32 1152 100 0 0 FTVM:STRING
p -32 1120 100 0 0 FTVN:STRING
p -32 1088 100 0 0 FTVO:STRING
p -32 1056 100 0 0 FTVP:STRING
p -32 1024 100 0 0 FTVQ:STRING
p -32 992 100 0 0 FTVR:STRING
p -32 960 100 0 0 FTVS:STRING
p -32 928 100 0 0 FTVT:STRING
p -32 896 100 0 0 INAM:
p -32 864 100 0 0 PHAS:0
p -32 832 100 0 0 PINI:NO
p -32 800 100 0 0 PREC:0
p -32 768 100 0 0 PRIO:LOW
p -32 736 100 0 0 SCAN:Passive
p -32 704 100 0 0 SIMS:NO_ALARM
p -32 672 100 0 0 MFLG:THREE STATES
p -16 64 100 1024 0 name:$(top)$(I)
p -32 672 100 0 0 SNAM:
p 32 1760 100 256 -1 Type:cad
p -288 32 100 0 0 def(CLNK):0.0
p -288 0 100 0 0 def(FLNK):0.0
p -288 -32 100 0 0 def(INPA):
p -288 -64 100 0 0 def(INPB):
p -288 -96 100 0 0 def(INPC):
p -288 -128 100 0 0 def(INPD):
p -288 -160 100 0 0 def(INPE):
p -288 -192 100 0 0 def(INPF):
p -288 -224 100 0 0 def(INPG):
p -288 -256 100 0 0 def(INPH):
p -288 -288 100 0 0 def(INPI):
p -288 -320 100 0 0 def(INPJ):
p -288 -352 100 0 0 def(INPK):
p -288 -384 100 0 0 def(INPL):
p -288 -416 100 0 0 def(INPM):
p -288 -448 100 0 0 def(INPN):
p -288 -480 100 0 0 def(INPO):
p -288 -512 100 0 0 def(INPP):
p -288 -544 100 0 0 def(INPQ):
p -288 -576 100 0 0 def(INPR):
p -288 -608 100 0 0 def(INPS):
p -288 -640 100 0 0 def(INPT):
p -288 -672 100 0 0 def(MLNK):0.0
p -128 32 100 0 0 def(OUTA):
p -128 0 100 0 0 def(OUTB):
p -128 -32 100 0 0 def(OUTC):
p -128 -64 100 0 0 def(OUTD):
p -128 -96 100 0 0 def(OUTE):
p -128 -128 100 0 0 def(OUTF):
p -128 -160 100 0 0 def(OUTG):
p -128 -192 100 0 0 def(OUTH):
p -128 -224 100 0 0 def(OUTI):
p -128 -256 100 0 0 def(OUTJ):
p -128 -288 100 0 0 def(OUTK):
p -128 -320 100 0 0 def(OUTL):
p -128 -352 100 0 0 def(OUTM):
p -128 -384 100 0 0 def(OUTN):
p -128 -416 100 0 0 def(OUTO):
p -128 -448 100 0 0 def(OUTP):
p -128 -480 100 0 0 def(OUTQ):
p -128 -512 100 0 0 def(OUTR):
p -128 -544 100 0 0 def(OUTS):
p -128 -576 100 0 0 def(OUTT):
p -128 -608 100 0 0 def(PLNK):0.0
p -128 -640 100 0 0 def(SDIS):0.0
p -128 -672 100 0 0 def(SIML):0.0
p -128 -704 100 0 0 def(SIOL):0.0
p -128 -736 100 0 0 def(SPLK):0.0
p -128 -768 100 0 0 def(STLK):0.0
p 224 234 75 0 -1 palrm(CLNK):NMS
p -128 1568 75 1280 -1 palrm(INPA):NMS
p -128 1504 75 1280 -1 palrm(INPB):NMS
p -128 1440 75 1280 -1 palrm(INPC):NMS
p -128 1376 75 1280 -1 palrm(INPD):NMS
p -128 1312 75 1280 -1 palrm(INPE):NMS
p -128 1248 75 1280 -1 palrm(INPF):NMS
p -128 1184 75 1280 -1 palrm(INPG):NMS
p -128 1120 75 1280 -1 palrm(INPH):NMS
p -128 1056 75 1280 -1 palrm(INPI):NMS
p -128 992 75 1280 -1 palrm(INPJ):NMS
p -128 928 75 1280 -1 palrm(INPK):NMS
p -128 864 75 1280 -1 palrm(INPL):NMS
p -128 800 75 1280 -1 palrm(INPM):NMS
p -128 736 75 1280 -1 palrm(INPN):NMS
p -128 672 75 1280 -1 palrm(INPO):NMS
p -128 608 75 1280 -1 palrm(INPP):NMS
p -128 544 75 1280 -1 palrm(INPQ):NMS
p -128 480 75 1280 -1 palrm(INPR):NMS
p -128 416 75 1280 -1 palrm(INPS):NMS
p -128 352 75 1280 -1 palrm(INPT):NMS
p 224 266 75 0 -1 palrm(MLNK):NMS
p 224 1568 75 768 -1 palrm(OUTA):NMS
p 224 1504 75 768 -1 palrm(OUTB):NMS
p 224 1440 75 768 -1 palrm(OUTC):NMS
p 224 1376 75 768 -1 palrm(OUTD):NMS
p 224 1312 75 768 -1 palrm(OUTE):NMS
p 224 1248 75 768 -1 palrm(OUTF):NMS
p 224 1184 75 768 -1 palrm(OUTG):NMS
p 224 1120 75 768 -1 palrm(OUTH):NMS
p 224 1056 75 768 -1 palrm(OUTI):NMS
p 224 992 75 768 -1 palrm(OUTJ):NMS
p 224 928 75 768 -1 palrm(OUTK):NMS
p 224 864 75 768 -1 palrm(OUTL):NMS
p 224 800 75 768 -1 palrm(OUTM):NMS
p 224 736 75 768 -1 palrm(OUTN):NMS
p 224 672 75 768 -1 palrm(OUTO):NMS
p 224 608 75 768 -1 palrm(OUTP):NMS
p 224 544 75 768 -1 palrm(OUTQ):NMS
p 224 480 75 768 -1 palrm(OUTR):NMS
p 224 416 75 768 -1 palrm(OUTS):NMS
p 224 352 75 768 -1 palrm(OUTT):NMS
p 224 202 75 0 -1 palrm(PLNK):NMS
p -128 128 75 1280 -1 palrm(SDIS):NMS
p -128 1728 75 1280 -1 palrm(SIML):NMS
p -128 1696 75 1280 -1 palrm(SIOL):NMS
p 224 138 75 0 -1 palrm(SPLK):NMS
p 224 170 75 0 -1 palrm(STLK):NMS
p 192 234 75 0 -1 pproc(CLNK):NPP
p -160 1568 75 1280 -1 pproc(INPA):NPP
p -160 1504 75 1280 -1 pproc(INPB):NPP
p -160 1440 75 1280 -1 pproc(INPC):NPP
p -160 1376 75 1280 -1 pproc(INPD):NPP
p -160 1312 75 1280 -1 pproc(INPE):NPP
p -160 1248 75 1280 -1 pproc(INPF):NPP
p -160 1184 75 1280 -1 pproc(INPG):NPP
p -160 1120 75 1280 -1 pproc(INPH):NPP
p -160 1056 75 1280 -1 pproc(INPI):NPP
p -160 992 75 1280 -1 pproc(INPJ):NPP
p -160 928 75 1280 -1 pproc(INPK):NPP
p -160 864 75 1280 -1 pproc(INPL):NPP
p -160 800 75 1280 -1 pproc(INPM):NPP
p -160 736 75 1280 -1 pproc(INPN):NPP
p -160 672 75 1280 -1 pproc(INPO):NPP
p -160 608 75 1280 -1 pproc(INPP):NPP
p -160 544 75 1280 -1 pproc(INPQ):NPP
p -160 480 75 1280 -1 pproc(INPR):NPP
p -160 416 75 1280 -1 pproc(INPS):NPP
p -160 352 75 1280 -1 pproc(INPT):NPP
p 192 266 75 0 -1 pproc(MLNK):NPP
p 192 1568 75 768 -1 pproc(OUTA):NPP
p 192 1504 75 768 -1 pproc(OUTB):NPP
p 192 1440 75 768 -1 pproc(OUTC):NPP
p 192 1376 75 768 -1 pproc(OUTD):NPP
p 192 1312 75 768 -1 pproc(OUTE):NPP
p 192 1248 75 768 -1 pproc(OUTF):NPP
p 192 1184 75 768 -1 pproc(OUTG):NPP
p 192 1120 75 768 -1 pproc(OUTH):NPP
p 192 1056 75 768 -1 pproc(OUTI):NPP
p 192 992 75 768 -1 pproc(OUTJ):NPP
p 192 928 75 768 -1 pproc(OUTK):NPP
p 192 864 75 768 -1 pproc(OUTL):NPP
p 192 800 75 768 -1 pproc(OUTM):NPP
p 192 736 75 768 -1 pproc(OUTN):NPP
p 192 672 75 768 -1 pproc(OUTO):NPP
p 192 608 75 768 -1 pproc(OUTP):NPP
p 192 544 75 768 -1 pproc(OUTQ):NPP
p 192 480 75 768 -1 pproc(OUTR):NPP
p 192 416 75 768 -1 pproc(OUTS):NPP
p 192 352 75 768 -1 pproc(OUTT):NPP
p 192 202 75 0 -1 pproc(PLNK):NPP
p -160 128 75 1280 -1 pproc(SDIS):NPP
p -160 1728 75 1280 -1 pproc(SIML):NPP
p -160 1696 75 1280 -1 pproc(SIOL):NPP
p 192 138 75 0 -1 pproc(SPLK):NPP
p 192 170 75 0 -1 pproc(STLK):NPP
p -32 640 100 0 0 primitive:cad
p 32 32 100 0 0 typ(CLNK):path
p 32 0 100 0 0 typ(FLNK):path
p 32 -32 100 0 0 typ(INPA):path
p 32 -64 100 0 0 typ(INPB):path
p 32 -96 100 0 0 typ(INPC):path
p 32 -128 100 0 0 typ(INPD):path
p 32 -160 100 0 0 typ(INPE):path
p 32 -192 100 0 0 typ(INPF):path
p 32 -224 100 0 0 typ(INPG):path
p 32 -256 100 0 0 typ(INPH):path
p 32 -288 100 0 0 typ(INPI):path
p 32 -320 100 0 0 typ(INPJ):path
p 32 -352 100 0 0 typ(INPK):path
p 32 -384 100 0 0 typ(INPL):path
p 32 -416 100 0 0 typ(INPM):path
p 32 -448 100 0 0 typ(INPN):path
p 32 -480 100 0 0 typ(INPO):path
p 32 -512 100 0 0 typ(INPP):path
p 32 -544 100 0 0 typ(INPQ):path
p 32 -576 100 0 0 typ(INPR):path
p 32 -608 100 0 0 typ(INPS):path
p 32 -640 100 0 0 typ(INPT):path
p 32 -672 100 0 0 typ(MLNK):path
p 208 32 100 0 0 typ(OUTA):path
p 208 0 100 0 0 typ(OUTB):path
p 208 -32 100 0 0 typ(OUTC):path
p 208 -64 100 0 0 typ(OUTD):path
p 208 -96 100 0 0 typ(OUTE):path
p 208 -128 100 0 0 typ(OUTF):path
p 208 -160 100 0 0 typ(OUTG):path
p 208 -192 100 0 0 typ(OUTH):path
p 208 -224 100 0 0 typ(OUTI):path
p 208 -256 100 0 0 typ(OUTJ):path
p 208 -288 100 0 0 typ(OUTK):path
p 208 -320 100 0 0 typ(OUTL):path
p 208 -352 100 0 0 typ(OUTM):path
p 208 -384 100 0 0 typ(OUTN):path
p 208 -416 100 0 0 typ(OUTO):path
p 208 -448 100 0 0 typ(OUTP):path
p 208 -480 100 0 0 typ(OUTQ):path
p 208 -512 100 0 0 typ(OUTR):path
p 208 -544 100 0 0 typ(OUTS):path
p 208 -576 100 0 0 typ(OUTT):path
p 208 -608 100 0 0 typ(PLNK):path
p 208 -640 100 0 0 typ(SDIS):path
p 208 -672 100 0 0 typ(SIML):path
p 208 -704 100 0 0 typ(SIOL):path
p 208 -736 100 0 0 typ(SPLK):path
p 208 -768 100 0 0 typ(STLK):path
[layers]
<symbol>
r 0 -64 96 128 1824
v 0 128 1632
192 1632
_
v 0 128 288
192 288
_
v 0 -128 384
-64 384
_
v 0 -128 448
-64 448
_
v 0 -128 512
-64 512
_
v 0 -128 576
-64 576
_
v 0 -128 640
-64 640
_
v 0 -128 704
-64 704
_
v 0 -128 768
-64 768
_
v 0 -128 832
-64 832
_
v 0 -128 896
-64 896
_
v 0 -128 960
-64 960
_
v 0 -128 1024
-64 1024
_
v 0 -128 1088
-64 1088
_
v 0 -128 1152
-64 1152
_
v 0 -128 1216
-64 1216
_
v 0 -128 1280
-64 1280
_
v 0 -128 1344
-64 1344
_
v 0 -128 1408
-64 1408
_
v 0 -128 1472
-64 1472
_
v 0 -128 1536
-64 1536
_
v 0 -128 1600
-64 1600
_
v 0 128 352
192 352
_
v 0 128 384
192 384
_
v 0 128 416
192 416
_
v 0 128 448
192 448
_
v 0 128 480
192 480
_
v 0 128 512
192 512
_
v 0 128 544
192 544
_
v 0 128 576
192 576
_
v 0 128 608
192 608
_
v 0 128 640
192 640
_
v 0 128 672
192 672
_
v 0 128 704
192 704
_
v 0 128 736
192 736
_
v 0 128 768
192 768
_
v 0 128 800
192 800
_
v 0 128 832
192 832
_
v 0 128 864
192 864
_
v 0 128 896
192 896
_
v 0 128 928
192 928
_
v 0 128 960
192 960
_
v 0 128 992
192 992
_
v 0 128 1024
192 1024
_
v 0 128 1056
192 1056
_
v 0 128 1088
192 1088
_
v 0 128 1120
192 1120
_
v 0 128 1152
192 1152
_
v 0 128 1184
192 1184
_
v 0 128 1216
192 1216
_
v 0 128 1248
192 1248
_
v 0 128 1280
192 1280
_
v 0 128 1312
192 1312
_
v 0 128 1344
192 1344
_
v 0 128 1376
192 1376
_
v 0 128 1408
192 1408
_
v 0 128 1440
192 1440
_
v 0 128 1472
192 1472
_
v 0 128 1504
192 1504
_
v 0 128 1536
192 1536
_
v 0 128 1568
192 1568
_
v 0 128 1600
192 1600
_
v 0 128 1664
192 1664
_
v 0 128 1696
192 1696
_
v 0 128 1760
192 1760
_
v 0 128 1728
192 1728
_
v 0 128 1792
192 1792
_
v 0 128 128
192 128
_
v 0 128 160
192 160
_
v 0 128 192
192 192
_
v 0 128 224
192 224
_
v 0 128 256
192 256
_
v 0 -128 128
-64 128
_
v 0 -128 160
-64 160
_
v 0 -128 1696
-64 1696
_
v 0 -128 1728
-64 1728
_
v 0 -128 1760
-64 1760
_
v 0 -128 1792
-64 1792
_
v 0 -128 352
-64 352
_
v 0 -128 416
-64 416
_
v 0 -128 480
-64 480
_
v 0 -128 544
-64 544
_
v 0 -128 608
-64 608
_
v 0 -128 672
-64 672
_
v 0 -128 736
-64 736
_
v 0 -128 800
-64 800
_
v 0 -128 864
-64 864
_
v 0 -128 928
-64 928
_
v 0 -128 992
-64 992
_
v 0 -128 1056
-64 1056
_
v 0 -128 1120
-64 1120
_
v 0 -128 1184
-64 1184
_
v 0 -128 1248
-64 1248
_
v 0 -128 1312
-64 1312
_
v 0 -128 1376
-64 1376
_
v 0 -128 1440
-64 1440
_
v 0 -128 1504
-64 1504
_
v 0 -128 1568
-64 1568
_
[comments]
