[symbol2]
bbox -64 864 256 1824
port 224 1632 100 1024 ODIR symbol 3 256 1632 0
port -32 1152 100 1024 H symbol 3 -64 1152 0
port -32 1216 100 1024 G symbol 3 -64 1216 0
port -32 1280 100 1024 F symbol 3 -64 1280 0
port -32 1344 100 1024 E symbol 3 -64 1344 0
port -32 1408 100 1024 D symbol 3 -64 1408 0
port -32 1472 100 1024 C symbol 3 -64 1472 0
port -32 1536 100 1024 B symbol 3 -64 1536 0
port -32 1600 100 1024 A symbol 3 -64 1600 0
port 224 1120 100 1024 OUTH symbol 2 256 1120 0
port 224 1152 100 1024 VALH symbol 3 256 1152 0
port 224 1184 100 1024 OUTG symbol 2 256 1184 0
port 224 1216 100 1024 VALG symbol 3 256 1216 0
port 224 1248 100 1024 OUTF symbol 2 256 1248 0
port 224 1280 100 1024 VALF symbol 3 256 1280 0
port 224 1312 100 1024 OUTE symbol 2 256 1312 0
port 224 1344 100 1024 VALE symbol 3 256 1344 0
port 224 1376 100 1024 OUTD symbol 2 256 1376 0
port 224 1408 100 1024 VALD symbol 3 256 1408 0
port 224 1440 100 1024 OUTC symbol 2 256 1440 0
port 224 1472 100 1024 VALC symbol 3 256 1472 0
port 224 1504 100 1024 OUTB symbol 2 256 1504 0
port 224 1536 100 1024 VALB symbol 3 256 1536 0
port 224 1568 100 1024 OUTA symbol 2 256 1568 0
port 224 1600 100 1024 VALA symbol 3 256 1600 0
port 224 1664 100 1024 OSIM symbol 3 256 1664 0
port 224 1696 100 1024 OCID symbol 3 256 1696 0
port 224 1760 100 1024 MESS symbol 3 256 1760 0
port 224 1728 100 1024 MARK symbol 3 256 1728 0
port 224 1792 100 1024 VAL symbol 3 256 1792 0
port 224 896 100 1024 SPLK symbol 2 256 896 0
port 224 928 100 1024 STLK symbol 2 256 928 0
port 224 960 100 1024 PLNK symbol 2 256 960 0
port 224 992 100 1024 CLNK symbol 2 256 992 0
port 224 1024 100 1024 MLNK symbol 2 256 1024 0
port -32 896 100 1024 SDIS symbol 1 -64 896 0
port -32 928 100 1024 SLNK symbol 1 -64 928 0
port -32 1696 100 1024 SIOL symbol 1 -64 1696 0
port -32 1728 100 1024 SIML symbol 1 -64 1728 0
port -32 1760 100 1024 ICID symbol 3 -64 1760 0
port -32 1792 100 1024 DIR symbol 3 -64 1792 0
port -32 1120 100 1024 INPH symbol 1 -64 1120 0
port -32 1184 100 1024 INPG symbol 1 -64 1184 0
port -32 1248 100 1024 INPF symbol 1 -64 1248 0
port -32 1312 100 1024 INPE symbol 1 -64 1312 0
port -32 1376 100 1024 INPD symbol 1 -64 1376 0
port -32 1440 100 1024 INPC symbol 1 -64 1440 0
port -32 1504 100 1024 INPB symbol 1 -64 1504 0
port -32 1568 100 1024 INPA symbol 1 -64 1568 0
port 224 1056 100 1024 FLNK symbol 2 256 1056 0
uniq 0
[tools]
[attributes]
p 32 1728 100 0 0 CTYP:8
p 32 1696 100 0 0 DESC:Gemini CAD8 Record
p 32 1664 100 0 0 DISS:NO_ALARM
p 32 1632 100 0 0 DISV:1
p 32 1600 100 0 0 ERSV:NO_ALARM
p 32 1568 100 0 0 EVNT:0
p 32 1536 100 0 0 FTVA:STRING
p 32 1504 100 0 0 FTVB:STRING
p 32 1472 100 0 0 FTVC:STRING
p 32 1440 100 0 0 FTVD:STRING
p 32 1408 100 0 0 FTVE:STRING
p 32 1376 100 0 0 FTVF:STRING
p 32 1344 100 0 0 FTVG:STRING
p 32 1312 100 0 0 FTVH:STRING
p 32 1280 100 0 0 INAM:
p 32 1248 100 0 0 PHAS:0
p 32 1216 100 0 0 PINI:NO
p 32 1184 100 0 0 PREC:0
p 32 1152 100 0 0 PRIO:LOW
p 32 1120 100 0 0 SCAN:Passive
p 32 1088 100 0 0 SIMS:NO_ALARM
p 32 1056 100 0 0 MFLG:THREE STATES
p 48 832 100 1024 0 name:$(top)$(I)
p 32 1056 100 0 0 SNAM:
p 96 1760 100 256 -1 Type:cad
p -64 800 100 0 0 def(CLNK):0.0
p -64 768 100 0 0 def(FLNK):0.0
p -64 736 100 0 0 def(INPA):
p -64 704 100 0 0 def(INPB):
p -64 672 100 0 0 def(INPC):
p -64 640 100 0 0 def(INPD):
p -64 608 100 0 0 def(INPE):
p -64 576 100 0 0 def(INPF):
p -64 544 100 0 0 def(INPG):
p -64 512 100 0 0 def(INPH):
p -64 480 100 0 0 def(MLNK):0.0
p -64 448 100 0 0 def(OUTA):
p -64 416 100 0 0 def(OUTB):
p -64 384 100 0 0 def(OUTC):
p -64 352 100 0 0 def(OUTD):
p -64 320 100 0 0 def(OUTE):
p -64 288 100 0 0 def(OUTF):
p -64 256 100 0 0 def(OUTG):
p -64 224 100 0 0 def(OUTH):
p -64 192 100 0 0 def(PLNK):0.0
p -64 160 100 0 0 def(SDIS):0.0
p -64 128 100 0 0 def(SIML):0.0
p -64 96 100 0 0 def(SIOL):0.0
p -64 64 100 0 0 def(SPLK):0.0
p -64 32 100 0 0 def(STLK):0.0
p 288 1002 75 0 -1 palrm(CLNK):NMS
p -64 1568 75 1280 -1 palrm(INPA):NMS
p -64 1504 75 1280 -1 palrm(INPB):NMS
p -64 1440 75 1280 -1 palrm(INPC):NMS
p -64 1376 75 1280 -1 palrm(INPD):NMS
p -64 1312 75 1280 -1 palrm(INPE):NMS
p -64 1248 75 1280 -1 palrm(INPF):NMS
p -64 1184 75 1280 -1 palrm(INPG):NMS
p -64 1120 75 1280 -1 palrm(INPH):NMS
p 288 1034 75 0 -1 palrm(MLNK):NMS
p 288 1568 75 768 -1 palrm(OUTA):NMS
p 288 1504 75 768 -1 palrm(OUTB):NMS
p 288 1440 75 768 -1 palrm(OUTC):NMS
p 288 1376 75 768 -1 palrm(OUTD):NMS
p 288 1312 75 768 -1 palrm(OUTE):NMS
p 288 1248 75 768 -1 palrm(OUTF):NMS
p 288 1184 75 768 -1 palrm(OUTG):NMS
p 288 1120 75 768 -1 palrm(OUTH):NMS
p 288 970 75 0 -1 palrm(PLNK):NMS
p -64 896 75 1280 -1 palrm(SDIS):NMS
p -64 1728 75 1280 -1 palrm(SIML):NMS
p -64 1696 75 1280 -1 palrm(SIOL):NMS
p 288 906 75 0 -1 palrm(SPLK):NMS
p 288 938 75 0 -1 palrm(STLK):NMS
p 256 1002 75 0 -1 pproc(CLNK):NPP
p -96 1568 75 1280 -1 pproc(INPA):NPP
p -96 1504 75 1280 -1 pproc(INPB):NPP
p -96 1440 75 1280 -1 pproc(INPC):NPP
p -96 1376 75 1280 -1 pproc(INPD):NPP
p -96 1312 75 1280 -1 pproc(INPE):NPP
p -96 1248 75 1280 -1 pproc(INPF):NPP
p -96 1184 75 1280 -1 pproc(INPG):NPP
p -96 1120 75 1280 -1 pproc(INPH):NPP
p 256 1034 75 0 -1 pproc(MLNK):NPP
p 256 1568 75 768 -1 pproc(OUTA):NPP
p 256 1504 75 768 -1 pproc(OUTB):NPP
p 256 1440 75 768 -1 pproc(OUTC):NPP
p 256 1376 75 768 -1 pproc(OUTD):NPP
p 256 1312 75 768 -1 pproc(OUTE):NPP
p 256 1248 75 768 -1 pproc(OUTF):NPP
p 256 1184 75 768 -1 pproc(OUTG):NPP
p 256 1120 75 768 -1 pproc(OUTH):NPP
p 256 970 75 0 -1 pproc(PLNK):NPP
p -96 896 75 1280 -1 pproc(SDIS):NPP
p -96 1728 75 1280 -1 pproc(SIML):NPP
p -96 1696 75 1280 -1 pproc(SIOL):NPP
p 256 906 75 0 -1 pproc(SPLK):NPP
p 256 938 75 0 -1 pproc(STLK):NPP
p 32 896 100 0 0 primitive:cad
p 96 800 100 0 0 typ(CLNK):path
p 96 768 100 0 0 typ(FLNK):path
p 96 736 100 0 0 typ(INPA):path
p 96 704 100 0 0 typ(INPB):path
p 96 672 100 0 0 typ(INPC):path
p 96 640 100 0 0 typ(INPD):path
p 96 608 100 0 0 typ(INPE):path
p 96 576 100 0 0 typ(INPF):path
p 96 544 100 0 0 typ(INPG):path
p 96 512 100 0 0 typ(INPH):path
p 96 480 100 0 0 typ(MLNK):path
p 96 448 100 0 0 typ(OUTA):path
p 96 416 100 0 0 typ(OUTB):path
p 96 384 100 0 0 typ(OUTC):path
p 96 352 100 0 0 typ(OUTD):path
p 96 320 100 0 0 typ(OUTE):path
p 96 288 100 0 0 typ(OUTF):path
p 96 256 100 0 0 typ(OUTG):path
p 96 224 100 0 0 typ(OUTH):path
p 96 192 100 0 0 typ(PLNK):path
p 96 160 100 0 0 typ(SDIS):path
p 96 128 100 0 0 typ(SIML):path
p 96 96 100 0 0 typ(SIOL):path
p 96 64 100 0 0 typ(SPLK):path
p 96 32 100 0 0 typ(STLK):path
[layers]
<symbol>
r 0 0 864 192 1824
v 0 192 1632
256 1632
_
v 0 -64 1152
0 1152
_
v 0 -64 1216
0 1216
_
v 0 -64 1280
0 1280
_
v 0 -64 1344
0 1344
_
v 0 -64 1408
0 1408
_
v 0 -64 1472
0 1472
_
v 0 -64 1536
0 1536
_
v 0 -64 1600
0 1600
_
v 0 192 1120
256 1120
_
v 0 192 1152
256 1152
_
v 0 192 1184
256 1184
_
v 0 192 1216
256 1216
_
v 0 192 1248
256 1248
_
v 0 192 1280
256 1280
_
v 0 192 1312
256 1312
_
v 0 192 1344
256 1344
_
v 0 192 1376
256 1376
_
v 0 192 1408
256 1408
_
v 0 192 1440
256 1440
_
v 0 192 1472
256 1472
_
v 0 192 1504
256 1504
_
v 0 192 1536
256 1536
_
v 0 192 1568
256 1568
_
v 0 192 1600
256 1600
_
v 0 192 1664
256 1664
_
v 0 192 1696
256 1696
_
v 0 192 1760
256 1760
_
v 0 192 1728
256 1728
_
v 0 192 1792
256 1792
_
v 0 192 896
256 896
_
v 0 192 928
256 928
_
v 0 192 960
256 960
_
v 0 192 992
256 992
_
v 0 192 1024
256 1024
_
v 0 -64 896
0 896
_
v 0 -64 928
0 928
_
v 0 -64 1696
0 1696
_
v 0 -64 1728
0 1728
_
v 0 -64 1760
0 1760
_
v 0 -64 1792
0 1792
_
v 0 -64 1120
0 1120
_
v 0 -64 1184
0 1184
_
v 0 -64 1248
0 1248
_
v 0 -64 1312
0 1312
_
v 0 -64 1376
0 1376
_
v 0 -64 1440
0 1440
_
v 0 -64 1504
0 1504
_
v 0 -64 1568
0 1568
_
v 0 192 1056
256 1056
_
[comments]
