[symbol2]
bbox -32 -320 608 544
port 0 0 -100 1024 U6 symbol 1 -32 0 0
port 0 -64 -100 1024 U7 symbol 1 -32 -64 0
port 576 -32 -100 1024 U3 symbol 2 608 -32 0
port 576 32 -100 1024 U2 symbol 2 608 32 0
port 576 96 -100 1024 U1 symbol 2 608 96 0
port 576 160 -100 1024 U0 symbol 2 608 160 0
port 576 224 100 1024 OUT symbol 2 608 224 0
port 576 384 100 1024 FLNK symbol 2 608 384 0
port 0 192 100 1024 DOL symbol 1 -32 192 0
port 0 -128 100 1024 SLNK symbol 1 -32 -128 0
port 0 -192 100 1024 SDIS symbol 1 -32 -192 0
port 576 288 100 1024 VAL symbol 3 608 288 0
port 0 128 -100 1024 U4 symbol 1 -32 128 0
port 0 64 -100 1024 U5 symbol 1 -32 64 0
uniq 11
[tools]
[attributes]
p 96 -274 100 0 1 ADEL:0.000000000000000e+00
p 132 442 100 0 1 DESC:analog output record
p 320 302 100 0 1 DISS:NO_ALARM
p 96 -50 100 0 1 DISV:1
p 96 14 100 0 1 DRVH:0.0000000e+00
p 96 -18 100 0 1 DRVL:0.0000000e+00
p 239 490 100 0 -1 DTYP:Soft Channel
p 320 -18 100 0 1 EGU:volts
p 96 78 100 0 1 EGUF:0.0000000e+00
p 96 46 100 0 1 EGUL:0.0000000e+00
p 96 302 100 0 1 EVNT:0
p 320 142 100 0 1 HHSV:NO_ALARM
p 320 206 100 0 1 HIGH:0.0000000e+00
p 320 270 100 0 1 HIHI:0.0000000e+00
p 320 366 100 0 1 HOPR:0.0000000e+00
p 320 110 100 0 1 HSV:NO_ALARM
p 96 -242 100 0 1 HYST:0.000000000000000e+00
p 96 -178 100 0 1 IVOA:Continue normally
p 96 -210 100 0 1 IVOV:0.000000000000000e+00
p 96 142 100 0 1 LINR:NO CONVERSION
p 320 46 100 0 1 LLSV:NO_ALARM
p 320 238 100 0 1 LOLO:0.0000000e+00
p 320 334 100 0 1 LOPR:0.0000000e+00
p 320 174 100 0 1 LOW:0.0000000e+00
p 320 78 100 0 1 LSV:NO_ALARM
p 96 -306 100 0 1 MDEL:0.000000000000000e+00
p 96 206 100 0 1 OIF:Full
p 96 238 100 0 1 OMSL:supervisory
p 96 174 100 0 1 OROC:0.0000000e+00
p 96 334 100 0 1 PHAS:0
p 96 270 100 0 1 PINI:NO
p 96 110 100 0 1 PREC:0
p 320 14 100 0 1 PRIO:LOW
p 96 366 100 0 1 SCAN:Passive
p 96 -114 100 0 1 SIML:0.000000000000000e+00
p 80 -352 100 1024 0 name:$(top)$(I)
p 96 -146 100 0 1 SIMS:NO_ALARM
p 96 -82 100 0 1 SIOL:0.000000000000000e+00
p 281 513 100 0 -1 Type:ao
p 96 -196 100 0 0 def(DOL):0.000000000000000e+00
p 96 -82 100 0 0 def(FLNK):0.000000000000000e+00
p 96 -164 100 0 0 def(OUT):0.000000000000000e+00
p 96 -228 100 0 0 def(SDIS):0.000000000000000e+00
p -32 192 75 1280 -1 palrm(DOL):NMS
p 640 224 75 768 -1 palrm(OUT):NMS
p -32 -192 75 1280 -1 palrm(SDIS):NMS
p 608 160 75 768 0 palrm(U0):NMS
p 608 96 75 768 0 palrm(U1):NMS
p 608 32 75 768 0 palrm(U2):NMS
p 608 -32 75 768 0 palrm(U3):NMS
p -32 128 75 1280 0 palrm(U4):NMS
p -32 64 75 1280 0 palrm(U5):NMS
p -32 0 75 1280 0 palrm(U6):NMS
p -32 -64 75 1280 0 palrm(U7):NMS
p -64 192 75 1280 -1 pproc(DOL):NPP
p 608 224 75 768 -1 pproc(OUT):NPP
p -64 -192 75 1280 -1 pproc(SDIS):NPP
p 640 160 75 768 0 pproc(U0):NPP
p 640 96 75 768 0 pproc(U1):NPP
p 640 32 75 768 0 pproc(U2):NPP
p 640 -32 75 768 0 pproc(U3):NPP
p -64 128 75 1280 0 pproc(U4):NPP
p -64 64 75 1280 0 pproc(U5):NPP
p -64 0 75 1280 0 pproc(U6):NPP
p -64 -64 75 1280 0 pproc(U7):NPP
p 280 450 100 0 0 primitive:eao
p 96 -196 100 0 0 typ(DOL):path
p 96 -100 100 0 0 typ(FLNK):path
p 608 224 100 0 0 typ(OUT):path
p 96 -260 100 0 0 typ(SDIS):path
p 576 160 100 1024 -1 username(U0):FLD0
p 576 96 100 1024 -1 username(U1):FLD1
p 576 32 100 1024 -1 username(U2):FLD2
p 576 -32 100 1024 -1 username(U3):FLD3
p 0 128 100 1024 -1 username(U4):FLD4
p 0 64 100 1024 -1 username(U5):FLD5
p 0 0 100 1024 -1 username(U6):FLD6
p 0 -64 100 1024 -1 username(U7):FLD7
[layers]
<symbol>
r 0 32 -320 544 544
v 0 -32 0
32 0
_
v 0 -32 -64
32 -64
_
v 0 544 -32
608 -32
_
v 0 544 32
608 32
_
v 0 544 96
608 96
_
v 0 544 160
608 160
_
v 0 544 224
608 224
_
v 0 544 384
608 384
_
v 0 -32 192
32 192
_
v 0 32 416
544 416
_
v 0 -32 -128
32 -128
_
v 0 32 480
544 480
_
v 0 -32 -192
32 -192
_
v 0 544 288
608 288
_
v 0 -32 128
32 128
_
v 0 -32 64
32 64
_
[comments]
