[symbol2]
bbox 128 352 384 448
port 160 400 100 1024 SLNK symbol 1 128 400 0
port 352 384 100 1024 OUT symbol 2 384 384 0
port 352 416 100 1024 FLNK symbol 2 384 416 0
port 160 432 100 1024 DOL symbol 1 128 432 0
port 160 368 100 1024 SDIS symbol 1 128 368 0
port 333 363 100 1792 VAL symbol 2 352 352 0
uniq 5
[tools]
[attributes]
p 384 384 75 768 -1 pproc(OUT):NPP
p 416 384 75 768 -1 palrm(OUT):NMS
p 208 446 100 0 0 primitive:estringout
p 64 334 100 0 0 SCAN:Passive
p 64 302 100 0 0 PHAS:0
p 64 270 100 0 0 EVNT:0
p 205 488 100 0 0 DTYP:Soft Channel
p 64 238 100 0 0 PINI:NO
p 64 206 100 0 0 OMSL:supervisory
p 64 366 100 0 0 VAL:string
p 64 174 100 0 0 IVOA:Continue normally
p 64 142 100 0 0 IVOV:
p 205 395 100 0 -1 Type:stringout
p 288 238 100 0 0 DISV:1
p 288 302 100 0 0 DISS:NO_ALARM
p 288 270 100 0 0 PRIO:LOW
p 64 110 100 0 0 SIOL:0.000000000000000e+00
p 64 78 100 0 0 SIML:0.000000000000000e+00
p 240 320 100 1024 0 name:$(top)$(I)
p 64 46 100 0 0 SIMS:NO_ALARM
p 155 440 100 0 0 DESC:string output record
p 96 -82 100 0 0 def(FLNK):0.000000000000000e+00
p 96 -100 100 0 0 typ(FLNK):path
p 96 -132 100 0 0 typ(DOL):path
p 96 -164 100 0 0 def(DOL):
p 96 432 75 1280 -1 pproc(DOL):NPP
p 128 432 75 1280 -1 palrm(DOL):NMS
p 96 -165 100 0 0 typ(OUT):path
p 96 -166 100 0 0 def(OUT):0.000000000000000e+00
p 96 -198 100 0 0 def(SDIS):0.000000000000000e+00
p 96 -240 100 0 0 typ(SDIS):path
p 96 368 75 1280 -1 pproc(SDIS):NPP
p 128 368 75 1280 -1 palrm(SDIS):NMS
[layers]
<symbol>
v 0 192 448
192 352
288 352
320 384
320 416
288 448
192 448
_
v 0 128 400
192 400
_
v 0 320 384
384 384
_
v 0 320 416
384 416
_
v 0 128 432
192 432
_
v 0 128 368
192 368
_
v 0 288 352
352 352
_
[comments]
