[symbol2]
bbox 32 160 512 320
port 70 298 100 1792 STPL symbol 1 32 288 0
port 472 233 100 1792 VAL symbol 2 512 224 0
port 479 265 100 1792 FLNK symbol 2 512 256 0
port 76 271 100 1792 CVL symbol 1 32 256 0
port 70 234 100 1792 SLNK symbol 1 32 224 0
port 70 202 100 1792 SDIS symbol 1 32 192 0
uniq 7
[tools]
[attributes]
p 280 450 100 0 0 primitive:epid
p 96 366 100 0 0 SCAN:Passive
p 96 334 100 0 0 PHAS:0
p 96 302 100 0 0 EVNT:0
p 251 179 100 0 -1 Type:pid
p 96 270 100 0 0 PINI:NO
p 96 110 100 0 0 DISV:1
p 96 238 100 0 0 EGU:units
p 96 206 100 0 0 HOPR:0.0000000e+00
p 96 174 100 0 0 LOPR:0.0000000e+00
p 320 366 100 0 0 HIHI:0.0000000e+00
p 320 334 100 0 0 LOLO:0.0000000e+00
p 320 302 100 0 0 HIGH:0.0000000e+00
p 320 270 100 0 0 LOW:0.0000000e+00
p 320 238 100 0 0 HHSV:NO_ALARM
p 320 206 100 0 0 HSV:NO_ALARM
p 320 174 100 0 0 LSV:NO_ALARM
p 320 142 100 0 0 LLSV:NO_ALARM
p 96 -50 100 0 0 KD:0.0000000e+00
p 320 -50 100 0 0 ODEL:0.0000000e+00
p 96 78 100 0 0 SMSL:supervisory
p 320 78 100 0 0 PREC:0
p 320 46 100 0 0 HYST:0.0000000e+00
p 320 14 100 0 0 ADEL:0.0000000e+00
p 320 -18 100 0 0 MDEL:0.0000000e+00
p 96 142 100 0 0 DISS:NO_ALARM
p 320 110 100 0 0 PRIO:LOW
p 96 46 100 0 0 MDT:0.0000000e+00
p 96 14 100 0 0 KP:0.0000000e+00
p 96 -18 100 0 0 KI:0.0000000e+00
p 208 428 100 0 0 DESC:pid record
p 96 -82 100 0 0 def(FLNK):0.000000000000000e+00
p 96 -100 100 0 0 typ(FLNK):path
p 96 -132 100 0 0 typ(CVL):path
p 96 -164 100 0 0 def(CVL):0.000000000000000e+00
p 96 -164 100 0 0 pproc(CVL):NPP
p 96 -164 100 0 0 palrm(CVL):NMS
p 96 -196 100 0 0 def(SDIS):0.000000000000000e+00
p 96 -228 100 0 0 typ(SDIS):path
p 96 -228 100 0 0 pproc(SDIS):NPP
p 96 -228 100 0 0 palrm(SDIS):NMS
p 96 -260 100 0 0 def(STPL):0.000000000000000e+00
p 96 -292 100 0 0 typ(STPL):path
p 96 -292 100 0 0 pproc(STPL):NPP
p 96 -292 100 0 0 palrm(STPL):NMS
p 304 256 100 1024 0 name:$(top)$(I)
[layers]
<symbol>
a 0 192 288 192 304 360
l 100 0 0 201 249 -
l 100 0 0 156 271 +
r 0 96 320 448 160
r 0 256 240 352 208
r 0 256 304 352 272
v 0 128 288
176 288
_
v 0 176 288
168 280
_
v 0 176 288
168 296
_
v 0 208 288
256 288
_
v 0 256 288
248 280
_
v 0 256 288
248 296
_
v 0 192 272
192 224
256 224
_
v 0 192 272
184 264
_
v 0 192 272
200 264
_
v 0 384 288
384 224
352 224
_
v 0 352 224
360 216
_
v 0 352 224
360 232
_
v 0 352 288
416 288
_
v 0 416 288
408 280
_
v 0 416 288
408 296
_
v 0 203 299
181 277
_
v 0 182 300
202 276
_
v 0 32 288
96 288
_
v 0 32 192
96 192
_
v 0 32 224
96 224
_
v 0 32 256
96 256
_
v 0 448 256
512 256
_
v 0 448 224
512 224
_
[comments]
