[symbol2]
bbox -32 -256 288 448
port 248 79 100 1792 SIOL symbol 2 288 64 0
port 12 -145 100 1792 ABIT symbol 1 -32 -160 0
port 12 -113 100 1792 ALRM symbol 1 -32 -128 0
port 12 -81 100 1792 BF symbol 1 -32 -96 0
port 12 -49 100 1792 BE symbol 1 -32 -64 0
port 12 -17 100 1792 BD symbol 1 -32 -32 0
port 12 15 100 1792 BC symbol 1 -32 0 0
port 12 47 100 1792 BB symbol 1 -32 32 0
port 12 79 100 1792 BA symbol 1 -32 64 0
port 12 111 100 1792 B9 symbol 1 -32 96 0
port 12 143 100 1792 B8 symbol 1 -32 128 0
port 12 175 100 1792 B7 symbol 1 -32 160 0
port 12 207 100 1792 B6 symbol 1 -32 192 0
port 12 239 100 1792 B5 symbol 1 -32 224 0
port 12 271 100 1792 B4 symbol 1 -32 256 0
port 12 303 100 1792 B3 symbol 1 -32 288 0
port 12 335 100 1792 B2 symbol 1 -32 320 0
port 12 367 100 1792 B1 symbol 1 -32 352 0
port 12 399 100 1792 B0 symbol 1 -32 384 0
port 248 137 100 1792 OUT symbol 2 288 128 0
port 248 201 100 1792 VAL symbol 2 288 192 0
port 255 9 100 1792 FLNK symbol 2 288 0 0
port 6 -182 100 1792 SLNK symbol 1 -32 -192 0
port 6 -214 100 1792 SDIS symbol 1 -32 -224 0
port 12 431 100 1792 DOL symbol 1 -32 416 0
uniq 31
[tools]
[attributes]
p 96 46 100 0 0 ADEL:0
p 64 112 100 0 -1 DESC:mbboDirect
p 96 142 100 0 0 DISS:NO_ALARM
p 96 110 100 0 0 DISV:1
p 212 488 100 0 0 DTYP:Soft Channel
p 96 302 100 0 0 EVNT:0
p 96 -18 100 0 0 IVOA:Continue normally
p 320 46 100 0 0 IVOV:0
p 96 240 100 0 0 NOBT:0
p 96 16 100 0 0 OMSL:supervisory
p 96 334 100 0 0 PHAS:0
p 96 270 100 0 0 PINI:NO
p 320 110 100 0 0 PRIO:LOW
p 96 366 100 0 0 SCAN:Passive
p 96 -82 100 0 0 SIML:0.000000000000000e+00
p 96 -114 100 0 0 SIMS:NO_ALARM
p 96 -50 100 0 0 SIOL:0.000000000000000e+00
p 251 515 100 0 0 Type:mbbod
p 96 -164 100 0 0 def(DOL):0.000000000000000e+00
p 96 -82 100 0 0 def(FLNK):0.000000000000000e+00
p 96 -260 100 0 0 def(OUT):0.000000000000000e+00
p 96 -196 100 0 0 def(SDIS):0.000000000000000e+00
p 96 -228 100 0 0 palrm(SDIS):NMS
p 96 -228 100 0 0 pproc(SDIS):NPP
p 280 450 100 0 0 primitive:embbod
p 96 -132 100 0 0 typ(DOL):path
p 96 -100 100 0 0 typ(FLNK):path
p 96 -292 100 0 0 typ(OUT):path
p 96 -228 100 0 0 typ(SDIS):path
p 304 256 100 1024 0 name:$(top)$(I)
[layers]
<symbol>
v 0 32 448
32 -256
224 -64
224 256
32 448
_
v 0 224 64
288 64
_
v 0 -32 -160
32 -160
_
v 0 -32 -128
32 -128
_
v 0 -32 -96
32 -96
_
v 0 -32 -64
32 -64
_
v 0 -32 -32
32 -32
_
v 0 -32 0
32 0
_
v 0 -32 32
32 32
_
v 0 -32 64
32 64
_
v 0 -32 96
32 96
_
v 0 -32 128
32 128
_
v 0 -32 160
32 160
_
v 0 -32 192
32 192
_
v 0 -32 224
32 224
_
v 0 -32 256
32 256
_
v 0 -32 288
32 288
_
v 0 -32 320
32 320
_
v 0 -32 352
32 352
_
v 0 -32 384
32 384
_
v 0 224 128
288 128
_
v 0 -32 -224
32 -224
_
v 0 -32 -192
32 -192
_
v 0 224 0
288 0
_
v 0 224 192
288 192
_
v 0 -32 416
32 416
_
[comments]
