[symbol2]
bbox 352 160 608 416
port 384 384 100 1024 INP symbol 1 352 384 0
port 384 224 100 1024 SIML symbol 1 352 224 0
port 384 256 100 1024 SIOL symbol 1 352 256 0
port 576 288 -100 1024 U3 symbol 2 608 288 0
port 576 320 -100 1024 U2 symbol 2 608 320 0
port 384 288 -100 1024 U1 symbol 1 352 288 0
port 384 320 -100 1024 U0 symbol 1 352 320 0
port 384 192 100 1024 SDIS symbol 1 352 192 0
port 384 352 100 1024 SLNK symbol 1 352 352 0
port 576 384 100 1024 FLNK symbol 2 608 384 0
port 576 352 100 1024 VAL symbol 3 608 352 0
uniq 13
[tools]
[attributes]
p 96 -82 100 0 0 ADEL:0.000000000000000e+00
p 320 46 100 0 0 AOFF:0.0000000e+00
p 96 14 100 0 0 ASLO:1.0
p 141 441 100 0 0 DESC:analog input record
p 320 110 100 0 0 DISS:NO_ALARM
p 96 -18 100 0 0 DISV:1
p 238 488 100 0 0 DTYP:Soft Channel
p 96 110 100 0 0 EGU:volts
p 96 174 100 0 0 EGUF:0.0000000e+00
p 96 142 100 0 0 EGUL:0.0000000e+00
p 96 302 100 0 0 EVNT:0
p 320 238 100 0 0 HHSV:NO_ALARM
p 320 302 100 0 0 HIGH:0.0000000e+00
p 320 366 100 0 0 HIHI:0.0000000e+00
p 96 78 100 0 0 HOPR:0.0000000e+00
p 320 206 100 0 0 HSV:NO_ALARM
p 96 -50 100 0 0 HYST:0.000000000000000e+00
p 96 238 100 0 0 LINR:LINEAR
p 320 142 100 0 0 LLSV:NO_ALARM
p 320 334 100 0 0 LOLO:0.0000000e+00
p 96 46 100 0 0 LOPR:0.0000000e+00
p 320 270 100 0 0 LOW:0.0000000e+00
p 320 174 100 0 0 LSV:NO_ALARM
p 96 -114 100 0 0 MDEL:0.000000000000000e+00
p 96 334 100 0 0 PHAS:0
p 96 270 100 0 0 PINI:NO
p 96 206 100 0 0 PREC:0
p 320 78 100 0 0 PRIO:LOW
p 96 366 100 0 0 SCAN:Passive
p 96 -210 100 0 0 SIMS:NO_ALARM
p 464 128 100 1024 0 name:$(top)$(I)
p 320 14 100 0 0 SMOO:0.0000000e+00
p 470 296 100 0 -1 Type:ai
p 96 -82 100 0 0 def(FLNK):0.000000000000000e+00
p 96 -164 100 0 0 def(INP):0.000000000000000e+00
p 96 -196 100 0 0 def(SDIS):0.000000000000000e+00
p 96 -452 100 0 0 def(SIML):0.000000000000000e+00
p 96 -580 100 0 0 def(SIOL):0.000000000000000e+00
p 312 392 75 1280 -1 palrm(INP):NMS
p 312 200 75 1280 -1 palrm(SDIS):NMS
p 312 232 75 1280 -1 palrm(SIML):NMS
p 312 264 75 1280 -1 palrm(SIOL):NMS
p 280 392 75 1280 -1 pproc(INP):NPP
p 280 200 75 1280 -1 pproc(SDIS):NPP
p 280 232 75 1280 -1 pproc(SIML):NPP
p 280 264 75 1280 -1 pproc(SIOL):NPP
p 280 450 100 0 0 primitive:eai
p 96 -100 100 0 0 typ(FLNK):path
p 96 -132 100 0 0 typ(INP):path
p 96 -228 100 0 0 typ(SDIS):path
p 96 -484 100 0 0 typ(SIML):path
p 96 -612 100 0 0 typ(SIOL):path
p 360 320 100 1024 -1 username(U0):FLD0
p 360 288 100 1024 -1 username(U1):FLD1
p 552 320 100 1024 -1 username(U2):FLD2
p 552 288 100 1024 -1 username(U3):FLD3
[layers]
<symbol>
v 0 352 384
416 384
_
v 0 416 416
416 160
512 160
544 192
544 384
512 416
416 416
_
v 0 352 224
416 224
_
v 0 352 256
416 256
_
v 0 544 288
608 288
_
v 0 544 320
608 320
_
v 0 352 288
416 288
_
v 0 352 320
416 320
_
v 0 544 352
608 352
_
v 0 544 384
608 384
_
v 0 352 352
416 352
_
v 0 352 192
416 192
_
[comments]
