[symbol2]
bbox 128 512 352 576
port 164 538 100 1792 SLNK symbol 1 128 528 0
port 164 570 100 1792 DOL symbol 1 128 560 0
port 319 569 100 1792 FLNK symbol 2 352 560 0
port 312 537 100 1792 OUT symbol 2 352 528 0
uniq 2
[tools]
[attributes]
p 280 450 100 0 0 primitive:ao
p 96 366 100 0 0 SCAN:Passive
p 96 334 100 0 0 PHAS:0
p 96 302 100 0 0 EVNT:0
p 240 430 100 0 0 TYPE:cardType
p 96 270 100 0 0 PDOL:NO
p 96 238 100 0 0 OMSL:supervisiory
p 96 206 100 0 0 OIF:Full
p 96 174 100 0 0 OROC:0.000000
p 96 110 100 0 0 LINR:Linear
p 224 542 100 0 -1 Type:ao
p 96 -98 100 0 0 Node:nodename
p 96 78 100 0 0 PREC:0
p 96 46 100 0 0 EGUF:10.000000
p 96 14 100 0 0 EGUL:0.000000
p 96 -18 100 0 0 DRVH:10.000000
p 96 -50 100 0 0 DRVL:0.000000
p 320 366 100 0 0 HOPR:10.000000
p 320 334 100 0 0 LOPR:0.000000
p 320 302 100 0 0 FLNK:0.000000
p 320 270 100 0 0 HIHI:10.000000
p 320 238 100 0 0 LOLO:0.000000
p 320 206 100 0 0 HIGH:10.000000
p 320 174 100 0 0 LOW:0.000000
p 320 142 100 0 0 HHSV:NO ALARM
p 320 110 100 0 0 HSV:NO ALARM
p 320 78 100 0 0 LSV:NO ALARM
p 320 46 100 0 0 LLSV:NO ALARM
p 320 14 100 0 0 HYST:0.000000
p 320 -18 100 0 0 ADEL:0.000000
p 320 -50 100 0 0 MDEL:0.000000
p 96 -130 100 0 0 DESC:analog output record
p 500 270 100 0 0 IVOA:Continue normally
p 96 -82 100 0 0 def(FLNK):0.000000
p 96 -100 100 0 0 typ(FLNK):path
p 96 -132 100 0 0 typ(OUT):val
p 96 -164 100 0 0 def(OUT):#C0 B0
p 96 -196 100 0 0 typ(DOL):path
p 304 256 100 1024 0 name:$(top)$(I)
[layers]
<symbol>
v 0 128 528
192 528
_
v 0 192 576
192 512
256 512
288 528
288 560
256 576
192 576
_
v 0 128 560
192 560
_
v 0 288 560
352 560
_
v 0 288 528
352 528
_
[comments]
