[symbol2]
bbox -32 -160 672 480
port 0 320 100 1024 NVL symbol 1 -32 320 0
port 640 -32 -100 1024 U3 symbol 2 672 -32 0
port 640 32 -100 1024 U2 symbol 2 672 32 0
port 640 96 -100 1024 U1 symbol 2 672 96 0
port 640 160 -100 1024 U0 symbol 2 672 160 0
port 0 -96 100 1024 SLNK symbol 1 -32 -96 0
port 0 128 100 1024 INPF symbol 1 -32 128 0
port 0 160 100 1024 INPE symbol 1 -32 160 0
port 0 192 100 1024 INPD symbol 1 -32 192 0
port 0 224 100 1024 INPC symbol 1 -32 224 0
port 0 256 100 1024 INPB symbol 1 -32 256 0
port 0 288 100 1024 INPA symbol 1 -32 288 0
port 640 224 100 1024 VAL symbol 3 672 224 0
port 640 320 100 1024 FLNK symbol 2 672 320 0
port 0 96 100 1024 INPG symbol 1 -32 96 0
port 0 64 100 1024 INPH symbol 1 -32 64 0
port 0 32 100 1024 INPI symbol 1 -32 32 0
port 0 0 100 1024 INPJ symbol 1 -32 0 0
port 0 -32 100 1024 INPK symbol 1 -32 -32 0
port 0 -64 100 1024 INPL symbol 1 -32 -64 0
port 0 -128 100 1024 SDIS symbol 1 -32 -128 0
port 0 352 -100 1024 U7 symbol 1 -32 352 0
port 0 384 -100 1024 U6 symbol 1 -32 384 0
port 0 416 -100 1024 U5 symbol 1 -32 416 0
port 0 448 -100 1024 U4 symbol 1 -32 448 0
uniq 23
[tools]
[attributes]
p 272 446 100 0 0 primitive:esel
p 96 318 100 0 1 SCAN:Passive
p 96 286 100 0 1 PHAS:0
p 96 254 100 0 1 EVNT:0
p 256 427 100 0 -1 SELM:Specified
p 96 254 100 0 0 def(INPA):
p 96 255 100 0 0 typ(INPA):path
p -64 288 75 1280 -1 pproc(INPA):NPP
p -32 288 75 1280 -1 palrm(INPA):NMS
p 96 222 100 0 0 def(INPB):
p 96 223 100 0 0 typ(INPB):path
p -64 256 75 1280 -1 pproc(INPB):NPP
p -32 256 75 1280 -1 palrm(INPB):NMS
p 96 190 100 0 0 def(INPC):
p 96 191 100 0 0 typ(INPC):path
p -64 224 75 1280 -1 pproc(INPC):NPP
p -32 224 75 1280 -1 palrm(INPC):NMS
p 96 158 100 0 0 def(INPD):
p 96 159 100 0 0 typ(INPD):path
p -64 192 75 1280 -1 pproc(INPD):NPP
p -32 192 75 1280 -1 palrm(INPD):NMS
p 96 126 100 0 0 def(INPE):
p 96 127 100 0 0 typ(INPE):path
p -64 160 75 1280 -1 pproc(INPE):NPP
p -32 160 75 1280 -1 palrm(INPE):NMS
p 96 94 100 0 0 def(INPF):
p 96 95 100 0 0 typ(INPF):path
p -64 128 75 1280 -1 pproc(INPF):NPP
p -32 128 75 1280 -1 palrm(INPF):NMS
p 96 93 100 0 0 def(INPG):
p 96 92 100 0 0 typ(INPG):path
p -64 96 75 1280 -1 pproc(INPG):NPP
p -32 96 75 1280 -1 palrm(INPG):NMS
p 96 91 100 0 0 def(INPH):
p 96 90 100 0 0 typ(INPH):path
p -64 64 75 1280 -1 pproc(INPH):NPP
p -32 64 75 1280 -1 palrm(INPH):NMS
p 96 89 100 0 0 def(INPI):
p 96 88 100 0 0 typ(INPI):path
p -64 32 75 1280 -1 pproc(INPI):NPP
p -32 32 75 1280 -1 palrm(INPI):NMS
p 96 87 100 0 0 def(INPJ):
p 96 86 100 0 0 typ(INPJ):path
p -64 0 75 1280 -1 pproc(INPJ):NPP
p -32 0 75 1280 -1 palrm(INPJ):NMS
p 96 85 100 0 0 def(INPK):
p 96 84 100 0 0 typ(INPK):path
p -64 -32 75 1280 -1 pproc(INPK):NPP
p -32 -32 75 1280 -1 palrm(INPK):NMS
p 96 83 100 0 0 def(INPL):
p 96 82 100 0 0 typ(INPL):path
p -64 -64 75 1280 -1 pproc(INPL):NPP
p -32 -64 75 1280 -1 palrm(INPL):NMS
p 96 81 100 0 0 def(SDIS):0.0000000000000000e+00
p 96 80 100 0 0 typ(SDIS):path
p -64 -128 75 1280 -1 pproc(SDIS):NPP
p -32 -128 75 1280 -1 palrm(SDIS):NMS
p 96 222 100 0 1 PINI:NO
p 96 190 100 0 1 DISV:1
p 96 158 100 0 1 DISS:NO_ALARM
p 96 126 100 0 1 PRIO:LOW
p 352 318 100 0 1 HOPR:0.0000000e+00
p 352 286 100 0 1 LOPR:0.0000000e+00
p 80 -192 100 1024 0 name:$(top)$(I)
p 352 254 100 0 1 HIHI:0.0000000e+00
p 352 222 100 0 1 LOLO:0.0000000e+00
p 352 190 100 0 1 HIGH:0.0000000e+00
p 352 158 100 0 1 LOW:0.0000000e+00
p 352 126 100 0 1 HHSV:NO_ALARM
p 352 94 100 0 1 HSV:NO_ALARM
p 352 62 100 0 1 LSV:NO_ALARM
p 352 30 100 0 1 LLSV:NO_ALARM
p 96 -2 100 0 1 HYST:0.000000000000000e+00
p 96 -34 100 0 1 ADEL:0.000000000000000e+00
p 96 -66 100 0 1 MDEL:0.000000000000000e+00
p 177 374 100 0 1 DESC:selection record
p 297 453 100 0 -1 Type:sel
p 96 94 100 0 1 EGU:units
p 161 -187 100 0 0 def(FLNK):0.000000000000000e+00
p 161 -186 100 0 0 typ(FLNK):path
p 161 -185 100 0 0 def(NVL):0.000000000000000e+00
p 161 -184 100 0 0 typ(NVL):path
p -64 320 75 1280 -1 pproc(NVL):NPP
p -32 320 75 1280 -1 palrm(NVL):NMS
p 96 62 100 0 1 PREC:0
p 640 160 100 1024 -1 username(U0):FLD0
p 640 96 100 1024 -1 username(U1):FLD1
p 640 32 100 1024 -1 username(U2):FLD2
p 640 -32 100 1024 -1 username(U3):FLD3
p 0 448 100 1024 -1 username(U4):FLD4
p 0 416 100 1024 -1 username(U5):FLD5
p 0 384 100 1024 -1 username(U6):FLD6
p 0 352 100 1024 -1 username(U7):FLD7
p 672 -32 75 768 0 palrm(U3):NMS
p 704 -32 75 768 0 pproc(U3):NPP
p 672 32 75 768 0 palrm(U2):NMS
p 704 32 75 768 0 pproc(U2):NPP
p 672 96 75 768 0 palrm(U1):NMS
p 704 96 75 768 0 pproc(U1):NPP
p 672 160 75 768 0 palrm(U0):NMS
p 704 160 75 768 0 pproc(U0):NPP
p -32 352 75 1280 0 palrm(U7):NMS
p -64 352 75 1280 0 pproc(U7):NPP
p -32 384 75 1280 0 palrm(U6):NMS
p -64 384 75 1280 0 pproc(U6):NPP
p -32 416 75 1280 0 palrm(U5):NMS
p -64 416 75 1280 0 pproc(U5):NPP
p -32 448 75 1280 0 palrm(U4):NMS
p -64 448 75 1280 0 pproc(U4):NPP
[layers]
<symbol>
r 0 32 -160 608 480
v 0 -32 320
32 320
_
v 0 608 -32
672 -32
_
v 0 608 32
672 32
_
v 0 608 96
672 96
_
v 0 608 160
672 160
_
v 0 -32 -96
32 -96
_
v 0 -32 128
32 128
_
v 0 -32 160
32 160
_
v 0 -32 192
32 192
_
v 0 -32 224
32 224
_
v 0 -32 256
32 256
_
v 0 -32 288
32 288
_
v 0 608 224
672 224
_
v 0 608 320
672 320
_
v 0 32 416
608 416
_
v 0 32 352
608 352
_
v 0 -32 96
32 96
_
v 0 -32 64
32 64
_
v 0 -32 32
32 32
_
v 0 -32 0
32 0
_
v 0 -32 -32
32 -32
_
v 0 -32 -64
32 -64
_
v 0 -32 -128
32 -128
_
v 0 -32 352
32 352
_
v 0 -32 384
32 384
_
v 0 -32 416
32 416
_
v 0 -32 448
32 448
_
[comments]
