[symbol2]
bbox 256 32 512 160
port 479 73 100 1792 OUT symbol 2 512 64 0
port 294 74 100 1792 SDIS symbol 1 256 64 0
port 294 106 100 1792 SLNK symbol 1 256 96 0
port 300 143 100 1792 DOL symbol 1 256 128 0
port 479 137 100 1792 FLNK symbol 2 512 128 0
port 472 105 100 1792 VAL symbol 2 512 96 0
uniq 6
[tools]
[attributes]
p 280 450 100 0 0 primitive:elongout
p 96 366 100 0 0 SCAN:Passive
p 96 334 100 0 0 PHAS:0
p 96 302 100 0 0 EVNT:0
p 342 93 100 0 -1 Type:longout
p 212 488 100 0 0 DTYP:Soft Channel
p 96 270 100 0 0 PINI:NO
p 96 110 100 0 0 DISV:1
p 96 238 100 0 0 EGU:units
p 96 206 100 0 0 HOPR:0
p 96 174 100 0 0 LOPR:0
p 320 366 100 0 0 HIHI:0
p 320 334 100 0 0 LOLO:0
p 320 302 100 0 0 HIGH:0
p 320 270 100 0 0 LOW:0
p 320 238 100 0 0 HHSV:NO_ALARM
p 320 206 100 0 0 HSV:NO_ALARM
p 320 174 100 0 0 LSV:NO_ALARM
p 320 142 100 0 0 LLSV:NO_ALARM
p 96 14 100 0 0 OMSL:supervisory
p 96 -18 100 0 0 IVOA:Continue normally
p 320 46 100 0 0 IVOV:0
p 96 78 100 0 0 HYST:0
p 96 46 100 0 0 ADEL:0
p 320 78 100 0 0 MDEL:0
p 96 142 100 0 0 DISS:NO_ALARM
p 320 110 100 0 0 PRIO:LOW
p 96 -50 100 0 0 SIOL:0.000000000000000e+00
p 96 -82 100 0 0 SIML:0.000000000000000e+00
p 96 -114 100 0 0 SIMS:NO_ALARM
p 141 441 100 0 0 DESC:long output record
p 96 -82 100 0 0 def(FLNK):0.000000000000000e+00
p 96 -100 100 0 0 typ(FLNK):path
p 96 -132 100 0 0 typ(DOL):val
p 96 -164 100 0 0 def(DOL):0.000000000000000e+00
p 96 -196 100 0 0 def(SDIS):0.000000000000000e+00
p 96 -228 100 0 0 typ(SDIS):path
p 96 -228 100 0 0 pproc(SDIS):NPP
p 96 -228 100 0 0 palrm(SDIS):NMS
p 96 -260 100 0 0 def(OUT):0.000000000000000e+00
p 96 -292 100 0 0 typ(OUT):path
p 304 256 100 1024 0 name:$(top)$(I)
[layers]
<symbol>
v 0 320 160
320 32
416 32
448 64
448 128
416 160
320 160
_
v 0 448 64
512 64
_
v 0 448 96
512 96
_
v 0 448 128
512 128
_
v 0 256 128
320 128
_
v 0 256 96
320 96
_
v 0 256 64
320 64
_
[comments]
