[symbol2]
bbox 288 96 704 352
port 328 234 100 1792 SLNK symbol 1 288 224 0
port 667 234 100 1792 VAL1 symbol 2 704 224 0
port 670 266 100 1792 FLNK symbol 2 704 256 0
port 326 266 100 1792 INP symbol 1 288 256 0
port 328 202 100 1792 SDIS symbol 1 288 192 0
uniq 5
[tools]
[attributes]
p 384 256 100 0 1 ADDR:0x0000
p 544 192 100 0 1 AINC:1
p 384 224 100 0 1 AMOD:A16
p 147 443 100 0 0 DESC:vme record
p 320 366 100 0 0 DISS:NO_ALARM
p 320 206 100 0 0 DISV:1
p 384 192 100 0 1 DSIZ:D16
p 384 128 100 0 0 DTYPE:
p 96 302 100 0 0 EVNT:0
p 544 256 100 0 1 NMAX:32
p 544 224 100 0 1 NUSE:1
p 96 334 100 0 0 PHAS:0
p 96 270 100 0 0 PINI:NO
p 320 334 100 0 0 PRIO:LOW
p 384 160 100 0 1 RDWT:Read
p 544 160 100 0 1 SARR:0
p 96 366 100 0 0 SCAN:Passive
p 432 336 100 0 -1 Type:vme
p 96 -82 100 0 0 def(FLNK):0.000000000000000e+00
p 96 -164 100 0 0 def(INP):0.000000000000000e+00
p 96 -198 100 0 0 def(SDIS):0.000000000000000e+00
p 96 -240 100 0 0 palrm(SDIS):NMS
p 96 -240 100 0 0 pproc(SDIS):NPP
p 208 446 100 0 0 primitive:evme
p 96 -100 100 0 0 typ(FLNK):path
p 96 -132 100 0 0 typ(INP):path
p 96 -240 100 0 0 typ(SDIS):path
p 304 256 100 1024 0 name:$(top)$(I)
[layers]
<symbol>
r 0 352 96 640 352
v 0 352 320
640 320
_
v 0 288 224
352 224
_
v 0 640 224
704 224
_
v 0 640 256
704 256
_
v 0 288 256
352 256
_
v 0 288 192
352 192
_
[comments]
