[symbol2]
bbox 96 32 416 320
port 376 111 100 1792 B7 symbol 2 416 96 0
port 376 143 100 1792 B6 symbol 2 416 128 0
port 376 175 100 1792 B5 symbol 2 416 160 0
port 376 207 100 1792 B4 symbol 2 416 192 0
port 376 239 100 1792 B3 symbol 2 416 224 0
port 376 271 100 1792 B2 symbol 2 416 256 0
port 376 303 100 1792 B1 symbol 2 416 288 0
port 376 335 100 1792 B0 symbol 2 416 320 0
port 134 138 100 1792 SDIS symbol 1 96 128 0
port 134 202 100 1792 SLNK symbol 1 96 192 0
port 140 239 100 1792 INP symbol 1 96 224 0
port 383 73 100 1792 FLNK symbol 2 416 64 0
port 376 41 100 1792 VAL symbol 2 416 32 0
uniq 18
[tools]
[attributes]
p 96 46 100 0 0 ADEL:0
p 288 352 100 0 0 B0:0
p 288 320 100 0 0 B1:0
p 288 288 100 0 0 B2:0
p 288 256 100 0 0 B3:0
p 288 224 100 0 0 B4:0
p 288 192 100 0 0 B5:0
p 288 160 100 0 0 B6:0
p 288 128 100 0 0 B7:0
p 416 352 100 0 0 B8:0
p 416 320 100 0 0 B9:0
p 416 288 100 0 0 BA:0
p 416 256 100 0 0 BB:0
p 416 224 100 0 0 BC:0
p 416 192 100 0 0 BD:0
p 416 160 100 0 0 BE:0
p 416 128 100 0 0 BF:0
p 192 160 100 0 -1 DESC:mbbiDirect
p 320 48 100 0 0 DISS:NO_ALARM
p 96 80 100 0 0 DISV:1
p 212 488 100 0 0 DTYP:Soft Channel
p 96 302 100 0 0 EVNT:0
p 96 272 100 0 0 NOBT:0
p 96 334 100 0 0 PHAS:0
p 96 240 100 0 0 PINI:NO
p 320 80 100 0 0 PRIO:LOW
p 96 366 100 0 0 SCAN:Passive
p 96 -18 100 0 0 SIML:0.000000000000000e+00
p 96 -50 100 0 0 SIMS:NO_ALARM
p 96 14 100 0 0 SIOL:0.000000000000000e+00
p 251 515 100 0 0 Type:mbbiDirect
p 96 -82 100 0 0 def(FLNK):0.000000000000000e+00
p 96 -164 100 0 0 def(INP):0.000000000000000e+00
p 96 -196 100 0 0 def(SDIS):0.000000000000000e+00
p 96 -228 100 0 0 palrm(SDIS):NMS
p 96 -228 100 0 0 pproc(SDIS):NPP
p 272 -48 100 0 0 primitive:embbid
p 96 -100 100 0 0 typ(FLNK):path
p 96 -132 100 0 0 typ(INP):val
p 96 -228 100 0 0 typ(SDIS):path
p 304 256 100 1024 0 name:$(top)$(I)
[layers]
<symbol>
v 0 352 96
416 96
_
v 0 352 128
416 128
_
v 0 352 160
416 160
_
v 0 352 224
416 224
_
v 0 352 256
416 256
_
v 0 352 288
416 288
_
v 0 352 320
416 320
_
v 0 352 192
416 192
_
v 0 160 256
160 96
352 32
352 320
160 256
_
v 0 352 32
416 32
_
v 0 352 64
416 64
_
v 0 96 224
160 224
_
v 0 96 192
160 192
_
v 0 96 128
160 128
_
[comments]
