[symbol2]
bbox -32 -64 608 544
port 3 138 -100 1792 U7 symbol 1 -32 128 0
port 3 202 -100 1792 U6 symbol 1 -32 192 0
port 3 266 -100 1792 U5 symbol 1 -32 256 0
port 3 330 -100 1792 U4 symbol 1 -32 320 0
port 568 -23 -100 1792 U3 symbol 2 608 -32 0
port 568 41 -100 1792 U2 symbol 2 608 32 0
port 568 105 -100 1792 U1 symbol 2 608 96 0
port 568 169 -100 1792 U0 symbol 2 608 160 0
port 568 233 100 1792 OUT symbol 2 608 224 0
port 575 393 100 1792 FLNK symbol 2 608 384 0
port 3 394 100 1792 TORG symbol 1 -32 384 0
port 6 74 100 1792 SLNK symbol 1 -32 64 0
port 6 10 100 1792 SDIS symbol 1 -32 0 0
uniq 11
[tools]
[attributes]
p 280 450 100 0 0 primitive:etimer
p 64 366 100 0 1 SCAN:Passive
p 64 334 100 0 1 PHAS:0
p 64 302 100 0 1 EVNT:0
p 260 518 100 0 -1 Type:timer
p 64 270 100 0 1 PINI:NO
p 64 142 100 0 1 DISV:1
p 228 488 100 0 -1 DTYP:Mizar-8310
p 288 14 100 0 1 TIMU:milliseconds
p 64 110 100 0 1 DISV:0
p 64 -18 100 0 1 TSRC:external
p 64 78 100 0 1 PTST:low
p 64 46 100 0 1 TEVT:0
p 64 14 100 0 1 MAIN:YES
p 288 366 100 0 1 PDLY:0.0000000e+00
p 288 334 100 0 1 DUT1:0.0000000e+00
p 288 302 100 0 1 OPW1:0.0000000e+00
p 288 270 100 0 1 DUT2:0.0000000e+00
p 288 238 100 0 1 OPW2:0.0000000e+00
p 288 206 100 0 1 DUT3:0.0000000e+00
p 288 174 100 0 1 OPW3:0.0000000e+00
p 288 142 100 0 1 DUT4:0.0000000e+00
p 288 110 100 0 1 OPW4:0.0000000e+00
p 288 78 100 0 1 DUT5:0.0000000e+00
p 288 46 100 0 1 OPW5:0.0000000e+00
p 64 206 100 0 1 PREC:0
p 64 174 100 0 1 DISS:NO_ALARM
p 64 238 100 0 1 PRIO:LOW
p 215 441 100 0 -1 DESC:timer record
p 96 -82 100 0 0 def(FLNK):0.000000000000000e+00
p 96 -100 100 0 0 typ(FLNK):path
p 96 -132 100 0 0 typ(TORG):path
p 96 -164 100 0 0 def(TORG):0.000000000000000e+00
p 96 -164 100 0 0 pproc(TORG):NPP
p 96 -164 100 0 0 palrm(TORG):NMS
p 96 -196 100 0 0 def(SDIS):0.000000000000000e+00
p 96 -228 100 0 0 typ(SDIS):path
p 96 -228 100 0 0 pproc(SDIS):NPP
p 96 -228 100 0 0 palrm(SDIS):NMS
p 96 -324 100 0 0 def(OUT):#C0 S0
p 96 -358 100 0 0 typ(OUT):val
p 552 164 100 0 -1 username(U0):FLD0
p 551 102 100 0 -1 username(U1):FLD1
p 551 39 100 0 -1 username(U2):FLD2
p 551 -25 100 0 -1 username(U3):FLD3
p -18 325 100 0 -1 username(U4):FLD4
p -20 262 100 0 -1 username(U5):FLD5
p -20 196 100 0 -1 username(U6):FLD6
p -20 133 100 0 -1 username(U7):FLD7
p 304 256 100 1024 0 name:$(top)$(I)
[layers]
<symbol>
r 0 32 -64 544 544
v 0 -32 128
32 128
_
v 0 -32 192
32 192
_
v 0 -32 256
32 256
_
v 0 -32 320
32 320
_
v 0 32 480
544 480
_
v 0 -32 0
32 0
_
v 0 -32 64
32 64
_
v 0 32 416
544 416
_
v 0 -32 384
32 384
_
v 0 544 384
608 384
_
v 0 544 224
608 224
_
v 0 544 160
608 160
_
v 0 544 96
608 96
_
v 0 544 32
608 32
_
v 0 544 -32
608 -32
_
[comments]
