[symbol2]
bbox 0 160 224 224
port 40 184 100 1792 SLNK symbol 1 0 176 0
port 40 216 100 1792 INP symbol 1 0 208 0
port 190 216 100 1792 FLNK symbol 2 224 208 0
port 184 185 100 1792 VAL symbol 2 224 176 0
uniq 2
[tools]
[attributes]
p 208 446 100 0 0 primitive:bi
p 96 366 100 0 0 SCAN:Passive
p 96 334 100 0 0 PHAS:0
p 96 302 100 0 0 EVNT:0
p 168 426 100 0 0 TYPE:cardType
p 96 270 100 0 0 PINP:NO
p 96 238 100 0 0 ZNAM:enabled
p 96 206 100 0 0 ONAM:disabled
p 96 174 100 0 0 ZSV:NO ALARM
p 96 142 100 0 0 OSV:NO ALARM
p 96 110 100 0 0 COSV:NO ALARM
p 96 190 100 0 -1 Type:bi
p 96 78 100 0 0 Node:nodename
p 96 -18 100 0 0 DESC:binary input record
p 96 -82 100 0 0 def(FLNK):0.000000
p 96 -100 100 0 0 typ(FLNK):path
p 96 -132 100 0 0 typ(INP):val
p 96 -164 100 0 0 def(INP):#C0 B0
p 304 256 100 1024 0 name:$(top)$(I)
[layers]
<symbol>
v 0 0 176
64 176
_
v 0 0 208
64 208
_
v 0 160 208
224 208
_
v 0 160 176
224 176
_
v 0 64 224
64 160
128 160
160 176
160 208
128 224
64 224
_
[comments]
