[symbol2]
bbox -32 -480 608 544
port 6 202 -100 1792 U2 symbol 1 -32 192 0
port 6 266 -100 1792 U1 symbol 1 -32 256 0
port 6 330 -100 1792 U0 symbol 1 -32 320 0
port 6 394 100 1792 INP symbol 1 -32 384 0
port 575 393 100 1792 FLNK symbol 2 608 384 0
port 6 138 100 1792 SLNK symbol 1 -32 128 0
port 6 74 100 1792 SDIS symbol 1 -32 64 0
port 575 329 100 1792 CH1 symbol 2 608 320 0
port 551 69 100 0 MATH symbol 2 608 64 0
port 556 260 100 0 CH2 symbol 2 608 256 0
port 556 196 100 0 CH3 symbol 2 608 192 0
port 556 132 100 0 CH4 symbol 2 608 128 0
uniq 13
[tools]
[attributes]
p 280 450 100 0 0 primitive:eosc
p 96 366 100 0 1 SCAN:Passive
p 96 334 100 0 1 PHAS:0
p 96 302 100 0 1 EVNT:0
p 230 518 100 0 -1 Type:osc
p 96 270 100 0 1 PINI:NO
p 192 486 100 0 -1 DTYP:HP-1428a
p 96 174 100 0 1 DISV:1
p 96 110 100 0 1 SIOL:0.0000000e+00
p 96 78 100 0 1 SIML:0.0000000e+00
p 96 46 100 0 1 SIMS:NO_ALARM
p 96 206 100 0 1 PREC:0
p 96 142 100 0 1 DISS:NO_ALARM
p 96 238 100 0 1 PRIO:LOW
p 199 440 100 0 -1 DESC:osc record
p 96 -82 100 0 0 def(FLNK):0.000000000000000e+00
p 96 -100 100 0 0 typ(FLNK):path
p 96 -196 100 0 0 def(SDIS):0.000000000000000e+00
p 96 -228 100 0 0 typ(SDIS):path
p 96 -228 100 0 0 pproc(SDIS):NPP
p 96 -228 100 0 0 palrm(SDIS):NMS
p 96 -324 100 0 0 def(INP):0.000000000000000e+00
p 96 -358 100 0 0 typ(INP):val
p -16 326 100 0 -1 username(U0):FLD0
p -16 262 100 0 -1 username(U1):FLD1
p -16 198 100 0 -1 username(U2):FLD2
p 320 366 100 0 1 EGUV:Volt
p 320 334 100 0 1 EGUH:Second
p 320 286 100 0 1 COU1:Off
p 320 254 100 0 1 CEN1:0
p 320 222 100 0 1 OPR1:1
p 320 190 100 0 1 ATN1:1
p 320 142 100 0 1 COU2:Off
p 320 110 100 0 1 CEN2:0
p 320 78 100 0 1 OPR2:1
p 320 46 100 0 1 ATN2:1
p 320 -2 100 0 1 COU3:Off
p 320 -34 100 0 1 CEN3:0
p 320 -66 100 0 1 OPR3:1
p 320 -98 100 0 1 ATN3:1
p 320 -138 100 0 1 COU4:Off
p 320 -170 100 0 1 CEN4:0
p 320 -202 100 0 1 OPR4:1
p 320 -234 100 0 1 ATN4:1
p 96 -82 100 0 1 OPRH:1e-3
p 96 -114 100 0 1 TDLY:0
p 96 -146 100 0 1 TLEV:0
p 96 -178 100 0 1 TSLP:Positive
p 96 -210 100 0 1 TSOU:Chan 1
p 96 -242 100 0 1 TTIM:1
p 320 -290 100 0 1 CMTP:None
p 320 -322 100 0 1 CMS1:Chan 1
p 320 -354 100 0 1 CMS2:Chan 1
p 320 -386 100 0 1 MSOU:Chan 1
p 320 -418 100 0 1 M1TP:None
p 320 -450 100 0 1 M2TP:None
p 96 -322 100 0 1 VCV1:0
p 96 -354 100 0 1 VCV2:0
p 96 -386 100 0 1 HCV1:0
p 96 -418 100 0 1 HCV2:0
p 96 -2 100 0 1 NELM:500
p 96 -34 100 0 1 NTRC:1
p 304 256 100 1024 0 name:$(top)$(I)
[layers]
<symbol>
r 0 32 544 544 -480
v 0 -32 192
32 192
_
v 0 -32 256
32 256
_
v 0 -32 320
32 320
_
v 0 32 480
544 480
_
v 0 -32 384
32 384
_
v 0 -32 64
32 64
_
v 0 -32 128
32 128
_
v 0 32 416
544 416
_
v 0 544 384
608 384
_
v 0 544 256
608 256
_
v 0 544 192
608 192
_
v 0 544 128
608 128
_
v 0 544 64
608 64
_
v 0 544 320
608 320
_
[comments]
