[symbol2]
bbox -32 -96 608 480
port 12 79 -100 1792 U7 symbol 1 -32 64 0
port 12 143 -100 1792 U6 symbol 1 -32 128 0
port 12 207 -100 1792 U5 symbol 1 -32 192 0
port 12 271 -100 1792 U4 symbol 1 -32 256 0
port 6 394 100 1792 STPL symbol 1 -32 384 0
port 568 -23 -100 1792 U3 symbol 2 608 -32 0
port 568 41 -100 1792 U2 symbol 2 608 32 0
port 568 105 -100 1792 U1 symbol 2 608 96 0
port 568 169 -100 1792 U0 symbol 2 608 160 0
port 568 233 100 1792 VAL symbol 2 608 224 0
port 575 393 100 1792 FLNK symbol 2 608 384 0
port 12 335 100 1792 CVL symbol 1 -32 320 0
port 6 10 100 1792 SLNK symbol 1 -32 0 0
port 6 -54 100 1792 SDIS symbol 1 -32 -64 0
uniq 11
[tools]
[attributes]
p 280 450 100 0 0 primitive:epid
p 96 366 100 0 1 SCAN:Passive
p 96 334 100 0 1 PHAS:0
p 96 302 100 0 1 EVNT:0
p 269 456 100 0 -1 Type:pid
p 96 270 100 0 1 PINI:NO
p 96 110 100 0 1 DISV:1
p 96 238 100 0 1 EGU:units
p 320 366 100 0 1 HOPR:0.0000000e+00
p 320 334 100 0 1 LOPR:0.0000000e+00
p 320 302 100 0 1 HIHI:0.0000000e+00
p 320 270 100 0 1 LOLO:0.0000000e+00
p 320 238 100 0 1 HIGH:0.0000000e+00
p 320 206 100 0 1 LOW:0.0000000e+00
p 320 174 100 0 1 HHSV:NO_ALARM
p 320 142 100 0 1 HSV:NO_ALARM
p 320 110 100 0 1 LSV:NO_ALARM
p 320 78 100 0 1 LLSV:NO_ALARM
p 96 -50 100 0 1 KD:0.0000000e+00
p 320 -50 100 0 1 ODEL:0.0000000e+00
p 96 78 100 0 1 SMSL:supervisory
p 96 174 100 0 1 PREC:0
p 320 46 100 0 1 HYST:0.0000000e+00
p 320 14 100 0 1 ADEL:0.0000000e+00
p 320 -18 100 0 1 MDEL:0.0000000e+00
p 96 142 100 0 1 DISS:NO_ALARM
p 96 206 100 0 1 PRIO:LOW
p 96 46 100 0 1 MDT:0.0000000e+00
p 96 14 100 0 1 KP:0.0000000e+00
p 96 -18 100 0 1 KI:0.0000000e+00
p 208 428 100 0 1 DESC:pid record
p 96 -82 100 0 0 def(FLNK):0.000000000000000e+00
p 96 -100 100 0 0 typ(FLNK):path
p 96 -132 100 0 0 typ(CVL):path
p 96 -164 100 0 0 def(CVL):0.000000000000000e+00
p 96 -164 100 0 0 pproc(CVL):NPP
p 96 -164 100 0 0 palrm(CVL):NMS
p 96 -196 100 0 0 def(SDIS):0.000000000000000e+00
p 96 -228 100 0 0 typ(SDIS):path
p 96 -228 100 0 0 pproc(SDIS):NPP
p 96 -228 100 0 0 palrm(SDIS):NMS
p 96 -260 100 0 0 def(STPL):0.000000000000000e+00
p 96 -292 100 0 0 typ(STPL):path
p 96 -292 100 0 0 pproc(STPL):NPP
p 96 -292 100 0 0 palrm(STPL):NMS
p 552 164 100 0 -1 username(U0):FLD0
p 551 102 100 0 -1 username(U1):FLD1
p 551 39 100 0 -1 username(U2):FLD2
p 551 -25 100 0 -1 username(U3):FLD3
p -18 262 100 0 -1 username(U4):FLD4
p -19 198 100 0 -1 username(U5):FLD5
p -19 134 100 0 -1 username(U6):FLD6
p -18 71 100 0 -1 username(U7):FLD7
p 304 256 100 1024 0 name:$(top)$(I)
[layers]
<symbol>
r 0 32 -96 544 480
v 0 -32 64
32 64
_
v 0 -32 128
32 128
_
v 0 -32 192
32 192
_
v 0 -32 256
32 256
_
v 0 -32 384
32 384
_
v 0 -32 -64
32 -64
_
v 0 -32 0
32 0
_
v 0 32 416
544 416
_
v 0 -32 320
32 320
_
v 0 544 384
608 384
_
v 0 544 224
608 224
_
v 0 544 160
608 160
_
v 0 544 96
608 96
_
v 0 544 32
608 32
_
v 0 544 -32
608 -32
_
[comments]
