[symbol2]
bbox -32 -96 480 480
port 452 -23 -100 1792 U3 symbol 2 480 -32 0
port 452 41 -100 1792 U2 symbol 2 480 32 0
port 452 105 -100 1792 U1 symbol 2 480 96 0
port 452 169 -100 1792 U0 symbol 2 480 160 0
port 452 233 100 1792 VAL symbol 2 480 224 0
port 447 393 100 1792 FLNK symbol 2 480 384 0
port 4 202 100 1792 INP symbol 1 -32 192 0
port 4 -22 100 1792 SLNK symbol 1 -32 -32 0
uniq 6
[tools]
[attributes]
p 208 446 100 0 0 primitive:waveform
p 96 366 100 0 1 SCAN:Passive
p 96 334 100 0 1 PHAS:0
p 96 302 100 0 1 EVNT:0
p 168 426 100 0 -1 TYPE:cardType
p 96 270 100 0 1 PRCI:NO
p 96 238 100 0 1 EGU:volts
p 96 206 100 0 1 HOPR:0.000000
p 96 174 100 0 1 LOPR:0.000000
p 96 142 100 0 1 RATE:5 MHZ
p 96 110 100 0 1 PTSS:0
p 96 78 100 0 1 NELM:0
p 96 46 100 0 1 SELM:0
p 96 14 100 0 1 MCNT:0
p 166 449 100 0 -1 Type:waveform
p 96 -50 100 0 1 Node:nodename
p 96 -82 100 0 1 DESC:waveform record
p 96 -82 100 0 0 def(FLNK):0.000000
p 96 -100 100 0 0 typ(FLNK):path
p 96 -132 100 0 0 typ(INP):val
p 96 -164 100 0 0 def(INP):#C0 B0
p 424 164 100 0 -1 username(U0):FLD0
p 424 100 100 0 -1 username(U1):FLD1
p 424 37 100 0 -1 username(U2):FLD2
p 423 -27 100 0 -1 username(U3):FLD3
p 304 256 100 1024 0 name:$(top)$(I)
[layers]
<symbol>
r 0 32 -96 416 480
v 0 416 -32
480 -32
_
v 0 416 32
480 32
_
v 0 416 96
480 96
_
v 0 416 160
480 160
_
v 0 32 416
416 416
_
v 0 416 224
480 224
_
v 0 416 384
480 384
_
v 0 -32 192
32 192
_
v 0 -32 -32
32 -32
_
[comments]
