[symbol2]
bbox -1920 0 3360 3360
uniq 0
[tools]
[attributes]
p 1792 112 100 0 -1 ID:$Id: oslBorderD.sym,v 1.1.1.1 2004-05-07 09:23:49 cjm Exp $
p 2948 288 140 256 -1 Project:MCAO Beam Transfer Optics
p 1040 112 150 0 -1 Rev:$Revision: 1.1.1.1 $
p 2940 224 120 256 -1 Title:$EPICS Schematic Title$
p 2656 160 100 768 -1 author:$Author: cjm $
p 2656 128 100 768 -1 date:$Date: 2004-05-07 09:23:49 $
p 2800 96 100 0 0 primitive:oslBorderD
p 304 256 100 1024 0 name:$(top)$(I)
[layers]
<symbol>
l 160 0 0 2336 240 Copyright
l 160 0 0 2144 176 Observatory Sciences Ltd.
l 200 7 0 3240 156 D
l 100 2 0 3216 160 Size:
l 350 7 0 1952 208 MCAO BTO
l 300 7 0 -1506 48 1
l 300 7 0 -870 48 2
l 300 7 0 -234 48 3
l 300 7 0 402 48 4
l 300 7 0 1038 48 5
l 300 7 0 1674 48 6
l 300 7 0 2310 48 7
l 300 7 0 2946 48 8
l 300 7 0 3312 294 A
l 300 7 0 3312 690 B
l 300 7 0 3312 1086 C
l 300 7 0 3312 1482 D
l 300 7 0 3312 1878 E
l 300 7 0 3312 2274 F
l 300 7 0 3312 2670 G
l 300 7 0 3312 3066 H
l 300 7 0 2946 3312 8
l 300 7 0 2310 3312 7
l 300 7 0 1674 3312 6
l 300 7 0 1038 3312 5
l 300 7 0 402 3312 4
l 300 7 0 -234 3312 3
l 300 7 0 -870 3312 2
l 300 7 0 -1506 3312 1
l 300 7 0 -1872 3066 H
l 300 7 0 -1872 2670 G
l 300 7 0 -1872 2274 F
l 300 7 0 -1872 1878 E
l 300 7 0 -1872 1482 D
l 300 7 0 -1872 1086 C
l 300 7 0 -1872 690 B
l 300 7 0 -1872 294 A
r 0 -1824 96 3264 3264
r 0 2720 3184 3264 3264
v 0 2624 160
2832 160
_
v 0 1504 140
1504 180
_
v 0 1600 140
1600 180
_
v 0 1040 140
1040 180
_
v 0 2624 320
2624 128
_
v 0 2624 272
3264 272
_
v 0 2624 192
3264 192
_
v 0 3120 128
3120 192
_
v 0 2828 160
3120 160
_
v 0 1728 140
992 140
_
v 0 1728 180
992 180
992 96
_
v 0 1728 96
1728 320
3264 320
_
v 0 1728 128
3264 128
_
v 0 -1188 0
-1188 96
_
v 0 -552 0
-552 96
_
v 0 84 0
84 96
_
v 0 1356 0
1356 96
_
v 0 1992 0
1992 96
_
v 0 2628 0
2628 96
_
v 0 3264 492
3360 492
_
v 0 3264 888
3360 888
_
v 0 3264 1284
3360 1284
_
v 0 3264 2076
3360 2076
_
v 0 3264 2472
3360 2472
_
v 0 3264 2868
3360 2868
_
v 0 2628 3264
2628 3360
_
v 0 1992 3264
1992 3360
_
v 0 1356 3264
1356 3360
_
v 0 84 3264
84 3360
_
v 0 -552 3264
-552 3360
_
v 0 -1188 3264
-1188 3360
_
v 0 -1920 2868
-1824 2868
_
v 0 -1920 2472
-1824 2472
_
v 0 -1920 2076
-1824 2076
_
v 0 -1920 1284
-1824 1284
_
v 0 -1920 888
-1824 888
_
v 0 -1920 492
-1824 492
_
v 0 720 96
720 0
_
v 0 672 48
720 96
768 48
_
v 0 720 3264
720 3360
_
v 0 768 3312
720 3264
672 3312
_
v 0 3264 1680
3360 1680
_
v 0 3312 1632
3264 1680
3312 1728
_
v 0 -1824 1680
-1872 1632
_
v 0 -1920 1680
-1824 1680
-1872 1728
_
[comments]
