[symbol2]
bbox 192 288 448 416
port 416 320 100 1024 VAL symbol 3 448 320 0
port 416 384 100 1024 FLNK symbol 2 448 384 0
port 232 320 100 1024 SDIS symbol 1 192 320 0
port 232 352 100 1024 SLNK symbol 1 192 352 0
port 232 384 100 1024 INP symbol 1 192 384 0
uniq 8
[tools]
[attributes]
p 120 392 75 1280 -1 pproc(INP):NPP
p 152 392 75 1280 -1 palrm(INP):NMS
p 280 450 100 0 0 primitive:ewave
p 96 366 100 0 0 SCAN:Passive
p 96 334 100 0 0 PHAS:0
p 96 302 100 0 0 EVNT:0
p 263 303 100 0 -1 Type:waveform
p 96 270 100 0 0 PINI:NO
p 96 110 100 0 0 DISV:1
p 213 489 100 0 0 DTYP:Soft Channel
p 320 366 100 0 0 RARM:0
p 320 334 100 0 0 EGU:units
p 320 270 100 0 0 NELM:1
p 320 238 100 0 0 FTVL:STRING
p 320 206 100 0 0 SIOL:0.0000000e+00
p 320 302 100 0 0 SIML:0.0000000e+00
p 320 110 100 0 0 SIMS:NO_ALARM
p 320 174 100 0 0 HOPR:0.0000000e+00
p 320 142 100 0 0 LOPR:0.0000000e+00
p 96 206 100 0 0 PREC:0
p 96 142 100 0 0 DISS:NO_ALARM
p 96 238 100 0 0 PRIO:LOW
p 199 440 100 0 0 DESC:waveform record
p 96 -82 100 0 0 def(FLNK):0.000000000000000e+00
p 304 256 100 1024 0 name:$(top)$(I)
p 96 -100 100 0 0 typ(FLNK):path
p 96 -196 100 0 0 def(SDIS):0.000000000000000e+00
p 96 -228 100 0 0 typ(SDIS):path
p 120 328 75 1280 -1 pproc(SDIS):NPP
p 152 328 75 1280 -1 palrm(SDIS):NMS
p 96 -324 100 0 0 def(INP):0.000000000000000e+00
p 96 -358 100 0 0 typ(INP):path
[layers]
<symbol>
v 0 288 352
304 384
336 320
352 352
_
v 0 256 416
352 416
384 384
384 320
352 288
256 288
256 416
_
v 0 384 320
448 320
_
v 0 384 384
448 384
_
v 0 192 352
256 352
_
v 0 192 320
256 320
_
v 0 192 384
256 384
_
[comments]
