[symbol2]
bbox 0 0 1600 1200
uniq 0
[tools]
[attributes]
p 1324 132 100 1792 -1 page:
p 0 24 100 0 0 revision:2.2
p 0 0 100 0 0 model:frame
p 0 -24 100 0 0 id:frame
p 304 256 100 1024 0 name:$(top)$(I)
[layers]
<symbol>
l 100 7 0 1048 136 A
l 80 7 0 1048 152 Size:
l 100 0 0 1372 128 OF
l 100 0 0 1228 128 SHEET
r 0 807 1034 1504 1104
r 0 96 96 1504 1104
v 0 807 1069
1504 1069
_
v 0 860 1034
860 1069
_
v 0 1242 1034
1242 1069
_
v 0 1364 1034
1364 1069
_
v 0 800 96
800 288
1504 288
_
v 0 800 129
1024 129
_
v 0 800 165
1024 165
_
v 0 1024 96
1024 288
_
v 0 1024 122
1504 122
_
v 0 1024 165
1504 165
_
v 0 1024 235
1504 235
_
v 0 1067 122
1067 165
_
v 0 1137 96
1137 122
_
v 0 1193 122
1193 165
_
v 0 1306 96
1306 122
_
v 0 800 96
800 0
_
v 0 752 48
800 96
848 48
_
v 0 800 1104
800 1200
_
v 0 848 1152
800 1104
752 1152
_
v 0 1504 600
1600 600
_
v 0 1552 552
1504 600
1552 648
_
v 0 96 600
48 552
_
v 0 0 600
96 600
48 648
_
[comments]
