[symbol2]
bbox 384 -64 608 448
port 421 426 100 1792 DNV symbol 1 384 416 0
port 420 362 100 1792 UPV symbol 1 384 352 0
port 418 234 100 1792 SDNV symbol 1 384 224 0
port 419 171 100 1792 SUPV symbol 1 384 160 0
port 421 42 100 1792 SIML symbol 1 384 32 0
port 575 314 100 1792 MSG symbol 2 608 304 0
port 575 347 100 1792 VAL symbol 2 608 336 0
port 422 73 100 1792 SIOL symbol 1 384 64 0
port 422 201 100 1792 SDNL symbol 1 384 192 0
port 422 329 100 1792 UPL symbol 1 384 320 0
port 422 393 100 1792 DNL symbol 1 384 384 0
port 422 9 100 1792 SLNK symbol 1 384 0 0
port 422 -23 100 1792 SDIS symbol 1 384 -32 0
port 421 140 100 1792 SUPL symbol 1 384 128 0
port 576 60 100 1792 FLNK symbol 2 608 48 0
port 577 283 100 1792 OUT symbol 2 608 272 0
uniq 19
[tools]
[attributes]
p 227 363 100 0 0 DESC:PMAC Load Record
p 96 158 100 0 0 DISS:NO_ALARM
p 96 190 100 0 0 DISV:1
p 96 254 100 0 0 EVNT:0
p 96 286 100 0 0 PHAS:0
p 96 222 100 0 0 PINI:NO
p 96 174 100 0 0 PREC:0
p 96 126 100 0 0 PRIO:LOW
p 96 318 100 0 0 SCAN:Passive
p 488 -96 100 1024 0 name:$(top)$(I)
p 464 206 100 0 -1 Type:load
p 161 -187 100 0 0 def(FLNK):0.000000000000000e+00
p 161 -187 100 0 0 def(OUT):0.000000000000000e+00
p 96 254 100 0 0 def(DNL):0.000000000000000e+00
p 96 222 100 0 0 def(UPL):0.000000000000000e+00
p 96 158 100 0 0 def(SDNL):0.000000000000000e+00
p 96 126 100 0 0 def(SUPL):0.000000000000000e+00
p 96 94 100 0 0 def(SIOL):0.0000000000000000e+00
p 96 81 100 0 0 def(SIML):0.0000000000000000e+00
p 96 81 100 0 0 def(SDIS):0.0000000000000000e+00
p 640 282 75 0 -1 palrm(OUT):NMS
p 368 394 75 0 -1 palrm(DNL):NMS
p 368 330 75 0 -1 palrm(UPL):NMS
p 368 202 75 0 -1 palrm(SDNL):NMS
p 368 138 75 0 -1 palrm(SUPL):NMS
p 368 74 75 0 -1 palrm(SIOL):NMS
p 368 42 75 0 -1 palrm(SIML):NMS
p 368 -22 75 0 -1 palrm(SDIS):NMS
p 608 282 75 0 -1 pproc(OUT):NPP
p 336 394 75 0 -1 pproc(DNL):NPP
p 336 330 75 0 -1 pproc(UPL):NPP
p 336 202 75 0 -1 pproc(SDNL):NPP
p 336 138 75 0 -1 pproc(SUPL):NPP
p 336 74 75 0 -1 pproc(SIOL):NPP
p 336 42 75 0 -1 pproc(SIML):NPP
p 336 -22 75 0 -1 pproc(SDIS):NPP
p 272 446 100 0 0 primitive:eload
p 161 -186 100 0 0 typ(FLNK):path
p 161 -186 100 0 0 typ(OUT):path
p 96 255 100 0 0 typ(DNL):path
p 96 223 100 0 0 typ(UPL):path
p 96 159 100 0 0 typ(SDNL):path
p 96 127 100 0 0 typ(SUPL):path
p 96 95 100 0 0 typ(SIOL):path
p 96 95 100 0 0 typ(SIML):path
p 96 80 100 0 0 typ(SDIS):path
p 480 272 100 0 0 DTYP:PMAC-VME ASCII
[layers]
<symbol>
v 0 448 448
448 -64
544 32
544 352
448 448
_
v 0 384 416
448 416
_
v 0 384 352
448 352
_
v 0 384 224
448 224
_
v 0 384 160
448 160
_
v 0 384 32
448 32
_
v 0 544 304
608 304
_
v 0 544 336
608 336
_
v 0 384 64
448 64
_
v 0 384 192
448 192
_
v 0 384 320
448 320
_
v 0 384 384
448 384
_
v 0 384 0
448 0
_
v 0 384 -32
448 -32
_
v 0 384 128
448 128
_
v 0 544 48
608 48
_
v 0 544 272
608 272
_
[comments]
