[symbol2]
bbox 352 192 608 320
port 568 233 100 1792 OUT symbol 2 608 224 0
port 575 297 100 1792 FLNK symbol 2 608 288 0
port 389 297 100 1792 DOL symbol 1 352 288 0
port 389 265 100 1792 SLNK symbol 1 352 256 0
port 389 233 100 1792 SDIS symbol 1 352 224 0
port 568 265 100 1792 VAL symbol 2 608 256 0
uniq 8
[tools]
[attributes]
p 280 450 100 0 0 primitive:ao
p 96 366 100 0 0 SCAN:Passive
p 96 334 100 0 0 PHAS:0
p 96 302 100 0 0 EVNT:0
p 239 490 100 0 0 DTYP:Soft Channel
p 96 270 100 0 0 PINI:NO
p 96 238 100 0 0 OMSL:supervisory
p 96 206 100 0 0 OIF:Full
p 96 174 100 0 0 OROC:0.0000000e+00
p 96 142 100 0 0 LINR:NO CONVERSION
p 464 254 100 0 -1 Type:ao
p 96 -50 100 0 0 DISV:1
p 96 110 100 0 0 PREC:0
p 96 78 100 0 0 EGUF:0.0000000e+00
p 96 46 100 0 0 EGUL:0.0000000e+00
p 96 14 100 0 0 DRVH:0.0000000e+00
p 96 -18 100 0 0 DRVL:0.0000000e+00
p 320 366 100 0 0 HOPR:0.0000000e+00
p 320 334 100 0 0 LOPR:0.0000000e+00
p 320 302 100 0 0 DISS:NO_ALARM
p 320 270 100 0 0 HIHI:0.0000000e+00
p 320 238 100 0 0 LOLO:0.0000000e+00
p 320 206 100 0 0 HIGH:0.0000000e+00
p 320 174 100 0 0 LOW:0.0000000e+00
p 320 142 100 0 0 HHSV:NO_ALARM
p 320 110 100 0 0 HSV:NO_ALARM
p 320 78 100 0 0 LSV:NO_ALARM
p 320 46 100 0 0 LLSV:NO_ALARM
p 96 -242 100 0 0 HYST:0.000000000000000e+00
p 96 -274 100 0 0 ADEL:0.000000000000000e+00
p 96 -306 100 0 0 MDEL:0.000000000000000e+00
p 320 14 100 0 0 PRIO:LOW
p 320 -18 100 0 0 EGU:volts
p 96 -82 100 0 0 SIOL:0.000000000000000e+00
p 96 -114 100 0 0 SIML:0.000000000000000e+00
p 96 -146 100 0 0 SIMS:NO_ALARM
p 96 -178 100 0 0 IVOA:Continue normally
p 96 -210 100 0 0 IVOV:0.000000000000000e+00
p 132 442 100 0 0 DESC:analog output record
p 96 -82 100 0 0 def(FLNK):0.000000000000000e+00
p 96 -100 100 0 0 typ(FLNK):path
p 96 -132 100 0 0 typ(OUT):val
p 96 -164 100 0 0 def(OUT):0.000000000000000e+00
p 96 -196 100 0 0 typ(DOL):path
p 96 -196 100 0 0 def(DOL):0.000000000000000e+00
p 96 -196 100 0 0 pproc(DOL):NPP
p 96 -196 100 0 0 palrm(DOL):NMS
p 96 -228 100 0 0 def(SDIS):0.000000000000000e+00
p 96 -260 100 0 0 typ(SDIS):path
p 96 -260 100 0 0 pproc(SDIS):NPP
p 96 -260 100 0 0 palrm(SDIS):NMS
p 304 256 100 1024 0 name:$(top)$(I)
[layers]
<symbol>
v 0 544 224
608 224
_
v 0 544 288
608 288
_
v 0 352 288
416 288
_
v 0 352 256
416 256
_
v 0 352 224
416 224
_
v 0 544 256
608 256
_
v 0 416 320
416 192
512 192
544 224
544 288
512 320
416 320
_
[comments]
