[symbol2]
bbox 352 64 608 320
port 384 160 -100 1024 U2 symbol 1 352 160 0
port 384 128 100 1024 SIML symbol 1 352 128 0
port 576 224 100 1024 OUT symbol 2 608 224 0
port 576 288 100 1024 FLNK symbol 2 608 288 0
port 384 288 100 1024 DOL symbol 1 352 288 0
port 384 256 100 1024 SLNK symbol 1 352 256 0
port 384 96 100 1024 SDIS symbol 1 352 96 0
port 576 256 100 1024 VAL symbol 3 608 256 0
port 384 224 -100 1024 U0 symbol 1 352 224 0
port 384 192 -100 1024 U1 symbol 1 352 192 0
port 584 192 100 1024 SIOL symbol 2 608 192 0
port 576 160 -100 1024 U3 symbol 2 608 160 0
uniq 14
[tools]
[attributes]
p 96 -274 100 0 0 ADEL:0.000000000000000e+00
p 132 442 100 0 0 DESC:analog output record
p 320 302 100 0 0 DISS:NO_ALARM
p 96 -50 100 0 0 DISV:1
p 96 14 100 0 0 DRVH:0.0000000e+00
p 96 -18 100 0 0 DRVL:0.0000000e+00
p 239 490 100 0 0 DTYP:Soft Channel
p 320 -18 100 0 0 EGU:volts
p 96 78 100 0 0 EGUF:0.0000000e+00
p 96 46 100 0 0 EGUL:0.0000000e+00
p 96 302 100 0 0 EVNT:0
p 320 142 100 0 0 HHSV:NO_ALARM
p 320 206 100 0 0 HIGH:0.0000000e+00
p 320 270 100 0 0 HIHI:0.0000000e+00
p 320 366 100 0 0 HOPR:0.0000000e+00
p 320 110 100 0 0 HSV:NO_ALARM
p 96 -242 100 0 0 HYST:0.000000000000000e+00
p 96 -178 100 0 0 IVOA:Continue normally
p 96 -210 100 0 0 IVOV:0.000000000000000e+00
p 96 142 100 0 0 LINR:NO CONVERSION
p 320 46 100 0 0 LLSV:NO_ALARM
p 320 238 100 0 0 LOLO:0.0000000e+00
p 320 334 100 0 0 LOPR:0.0000000e+00
p 320 174 100 0 0 LOW:0.0000000e+00
p 320 78 100 0 0 LSV:NO_ALARM
p 96 -306 100 0 0 MDEL:0.000000000000000e+00
p 96 206 100 0 0 OIF:Full
p 96 238 100 0 0 OMSL:supervisory
p 96 174 100 0 0 OROC:0.0000000e+00
p 96 334 100 0 0 PHAS:0
p 96 270 100 0 0 PINI:NO
p 96 110 100 0 0 PREC:0
p 320 14 100 0 0 PRIO:LOW
p 96 366 100 0 0 SCAN:Passive
p 96 -146 100 0 0 SIMS:NO_ALARM
p 464 32 100 1024 0 name:$(top)$(I)
p 470 190 100 0 -1 Type:ao
p 96 -196 100 0 0 def(DOL):0.000000000000000e+00
p 96 -82 100 0 0 def(FLNK):0.000000000000000e+00
p 96 -164 100 0 0 def(OUT):0.000000000000000e+00
p 96 -228 100 0 0 def(SDIS):0.000000000000000e+00
p 96 -530 100 0 0 def(SIML):0.000000000000000e+00
p 96 -658 100 0 0 def(SIOL):0.000000000000000e+0
p 312 296 75 1280 -1 palrm(DOL):NMS
p 312 104 75 1280 -1 palrm(SDIS):NMS
p 312 136 75 1280 -1 palrm(SIML):NMS
p 280 296 75 1280 -1 pproc(DOL):NPP
p 280 104 75 1280 -1 pproc(SDIS):NPP
p 280 136 75 1280 -1 pproc(SIML):NPP
p 616 232 75  768 -1 pproc(OUT):NPP
p 648 232 75  768 -1 palrm(OUT):NMS
p 616 200 75  768 -1 pproc(SIOL):NPP
p 648 200 75  768 -1 palrm(SIOL):NMS
p 280 450 100 0 0 primitive:eao
p 96 -196 100 0 0 typ(DOL):path
p 96 -100 100 0 0 typ(FLNK):path
p 96 -132 100 0 0 typ(OUT):path
p 96 -260 100 0 0 typ(SDIS):path
p 96 -562 100 0 0 typ(SIML):path
p 96 -690 100 0 0 typ(SIOL):path
p 360 224 100 1024 -1 username(U0):FLD0
p 360 192 100 1024 -1 username(U1):FLD1
p 360 160 100 1024 -1 username(U2):FLD2
p 554 160 100 1024 -1 username(U3):FLD3
p 352 160 75 1280 0 palrm(U2):NMS
p 320 160 75 1280 0 pproc(U2):NPP
p 352 224 75 1280 0 palrm(U0):NMS
p 320 224 75 1280 0 pproc(U0):NPP
p 352 192 75 1280 0 palrm(U1):NMS
p 320 192 75 1280 0 pproc(U1):NPP
p 608 160 75 768 0 palrm(U3):NMS
p 640 160 75 768 0 pproc(U3):NPP
[layers]
<symbol>
v 0 352 160
416 160
_
v 0 352 128
416 128
_
v 0 416 320
416 64
512 64
544 96
544 288
512 320
416 320
_
v 0 544 224
608 224
_
v 0 544 288
608 288
_
v 0 352 288
416 288
_
v 0 352 256
416 256
_
v 0 352 96
416 96
_
v 0 544 256
608 256
_
v 0 352 224
416 224
_
v 0 352 192
416 192
_
v 0 544 192
608 192
_
v 0 544 160
608 160
_
[comments]
