[symbol2]
bbox 352 192 608 288
port 390 218 100 1792 SDIS symbol 1 352 208 0
port 390 250 100 1792 SLNK symbol 1 352 240 0
port 396 287 100 1792 INP symbol 1 352 272 0
port 575 265 100 1792 FLNK symbol 2 608 256 0
port 568 233 100 1792 VAL symbol 2 608 224 0
uniq 6
[tools]
[attributes]
p 280 450 100 0 0 primitive:elongin
p 96 366 100 0 0 SCAN:Passive
p 96 334 100 0 0 PHAS:0
p 96 302 100 0 0 EVNT:0
p 442 234 100 0 -1 Type:longin
p 212 488 100 0 0 DTYP:Soft Channel
p 96 270 100 0 0 PINI:NO
p 96 110 100 0 0 DISV:1
p 96 238 100 0 0 EGU:volts
p 96 206 100 0 0 HOPR:0
p 96 174 100 0 0 LOPR:0
p 320 366 100 0 0 HIHI:0
p 320 334 100 0 0 LOLO:0
p 320 302 100 0 0 HIGH:0
p 320 270 100 0 0 LOW:0
p 320 238 100 0 0 HHSV:NO_ALARM
p 320 206 100 0 0 HSV:NO_ALARM
p 320 174 100 0 0 LSV:NO_ALARM
p 320 142 100 0 0 LLSV:NO_ALARM
p 96 78 100 0 0 HYST:0
p 96 46 100 0 0 ADEL:0
p 96 14 100 0 0 MDEL:0
p 96 142 100 0 0 DISS:NO_ALARM
p 320 110 100 0 0 PRIO:LOW
p 96 -18 100 0 0 SIOL:0.000000000000000e+00
p 96 -50 100 0 0 SIML:0.000000000000000e+00
p 96 -82 100 0 0 SIMS:NO_ALARM
p 141 441 100 0 0 DESC:long input record
p 96 -82 100 0 0 def(FLNK):0.000000000000000e+00
p 96 -100 100 0 0 typ(FLNK):path
p 96 -132 100 0 0 typ(INP):val
p 96 -164 100 0 0 def(INP):0.000000000000000e+00
p 96 -196 100 0 0 def(SDIS):0.000000000000000e+00
p 96 -228 100 0 0 typ(SDIS):path
p 96 -228 100 0 0 pproc(SDIS):NPP
p 96 -228 100 0 0 palrm(SDIS):NMS
p 304 256 100 1024 0 name:$(top)$(I)
[layers]
<symbol>
v 0 416 288
416 192
512 192
544 224
544 256
512 288
416 288
_
v 0 544 224
608 224
_
v 0 544 256
608 256
_
v 0 352 272
416 272
_
v 0 352 240
416 240
_
v 0 352 208
416 208
_
[comments]
