[symbol2]
bbox 160 64 416 320
port 384 192 -100 1024 U3 symbol 2 416 192 0
port 384 224 -100 1024 U2 symbol 2 416 224 0
port 384 256 100 1024 VAL symbol 3 416 256 0
port 200 96 100 1024 SDIS symbol 1 160 96 0
port 200 160 100 1024 SIOL symbol 1 160 160 0
port 200 128 100 1024 SIML symbol 1 160 128 0
port 192 192 -100 1024 U1 symbol 1 160 192 0
port 200 256 100 1024 SLNK symbol 1 160 256 0
port 384 288 100 1024 FLNK symbol 2 416 288 0
port 192 224 -100 1024 U0 symbol 1 160 224 0
port 192 288 100 1024 INP symbol 1 160 288 0
uniq 15
[tools]
[attributes]
p 214 438 100 0 0 DESC:string input record
p 160 206 100 0 0 DISS:NO_ALARM
p 160 142 100 0 0 DISV:1
p 252 486 100 0 0 DTYP:Soft Channel
p 160 270 100 0 0 EVNT:0
p 160 302 100 0 0 PHAS:0
p 160 238 100 0 0 PINI:NO
p 160 174 100 0 0 PRIO:LOW
p 160 334 100 0 0 SCAN:Passive
p 160 46 100 0 0 SIMS:NO_ALARM
p 272 32 100 1024 0 name:$(top)$(I)
p 240 190 100 0 -1 Type:stringin
p 160 366 100 0 0 VAL:string
p 96 -82 100 0 0 def(FLNK):0.000000000000000e+00
p 96 -164 100 0 0 def(INP):0.000000000000000e+00
p 96 -198 100 0 0 def(SDIS):0.000000000000000e+00
p 96 -592 100 0 0 def(SIML):0.000000000000000e+00
p 96 -720 100 0 0 def(SIOL):0.000000000000000e+00
p 120 296 75 1280 -1 palrm(INP):NMS
p 120 104 75 1280 -1 palrm(SDIS):NMS
p 120 136 75 1280 -1 palrm(SIML):NMS
p 120 168 75 1280 -1 palrm(SIOL):NMS
p 160 224 75 1280 0 palrm(U0):NMS
p 160 192 75 1280 0 palrm(U1):NMS
p 416 224 75 768 0 palrm(U2):NMS
p 416 192 75 768 0 palrm(U3):NMS
p 88  296 75 1280 -1 pproc(INP):NPP
p 88  104 75 1280 -1 pproc(SDIS):NPP
p 88  136 75 1280 -1 pproc(SIML):NPP
p 88  168 75 1280 -1 pproc(SIOL):NPP
p 128 224 75 1280 0 pproc(U0):NPP
p 128 192 75 1280 0 pproc(U1):NPP
p 448 224 75 768 0 pproc(U2):NPP
p 448 192 75 768 0 pproc(U3):NPP
p 208 446 100 0 0 primitive:estringin
p 96 -100 100 0 0 typ(FLNK):path
p 96 -132 100 0 0 typ(INP):path
p 96 -240 100 0 0 typ(SDIS):path
p 96 -624 100 0 0 typ(SIML):path
p 96 -752 100 0 0 typ(SIOL):path
p 168 224 100 1024 -1 username(U0):FLD0
p 168 192 100 1024 -1 username(U1):FLD1
p 360 224 100 1024 -1 username(U2):FLD2
p 360 192 100 1024 -1 username(U3):FLD3
[layers]
<symbol>
v 0 352 192
416 192
_
v 0 352 224
416 224
_
v 0 352 256
416 256
_
v 0 224 320
224 64
320 64
352 96
352 288
320 320
224 320
_
v 0 160 96
224 96
_
v 0 160 160
224 160
_
v 0 160 128
224 128
_
v 0 160 192
224 192
_
v 0 160 256
224 256
_
v 0 352 288
416 288
_
v 0 160 224
224 224
_
v 0 160 288
224 288
_
[comments]
