[symbol2]
bbox 384 -32 672 448
port 424  32 100 1024 SLNK symbol 1 384 32 0
port 424 256 100 1024 INPF symbol 1 384 256 0
port 424 288 100 1024 INPE symbol 1 384 288 0
port 424 320 100 1024 INPD symbol 1 384 320 0
port 424 352 100 1024 INPC symbol 1 384 352 0
port 424 384 100 1024 INPB symbol 1 384 384 0
port 424 416 100 1024 INPA symbol 1 384 416 0
port 424 224 100 1024 INPG symbol 1 384 224 0
port 424 192 100 1024 INPH symbol 1 384 192 0
port 424 160 100 1024 INPI symbol 1 384 160 0
port 424 128 100 1024 INPJ symbol 1 384 128 0
port 424  96 100 1024 INPK symbol 1 384 96 0
port 424  64 100 1024 INPL symbol 1 384 64 0
port 424   0 100 1024 SDIS symbol 1 384 0 0
port 640 160 -100 1024 U1 symbol 2 672 160 0
port 640 192 -100 1024 U0 symbol 2 672 192 0
port 640 224 100 1024 VAL symbol 3 672 224 0
port 640 256 100 1024 FLNK symbol 2 672 256 0
uniq 18
[tools]
[attributes]
p 96 -34 100 0 0 ADEL:0.000000000000000e+00
p 291 424 100 0 0 CALC:A+B+C
p 177 374 100 0 0 DESC:calculation record
p 96 158 100 0 0 DISS:NO_ALARM
p 96 190 100 0 0 DISV:1
p 96 94 100 0 0 EGU:units
p 96 254 100 0 0 EVNT:0
p 352 126 100 0 0 HHSV:NO_ALARM
p 352 190 100 0 0 HIGH:0.0000000e+00
p 352 254 100 0 0 HIHI:0.0000000e+00
p 352 318 100 0 0 HOPR:0.0000000e+00
p 352 94 100 0 0 HSV:NO_ALARM
p 96 -2 100 0 0 HYST:0.000000000000000e+00
p 352 30 100 0 0 LLSV:NO_ALARM
p 352 222 100 0 0 LOLO:0.0000000e+00
p 352 286 100 0 0 LOPR:0.0000000e+00
p 352 158 100 0 0 LOW:0.0000000e+00
p 352 62 100 0 0 LSV:NO_ALARM
p 96 -66 100 0 0 MDEL:0.000000000000000e+00
p 96 286 100 0 0 PHAS:0
p 96 222 100 0 0 PINI:NO
p 96 62 100 0 0 PREC:0
p 96 126 100 0 0 PRIO:LOW
p 96 318 100 0 0 SCAN:Passive
p 512 206 100 0 -1 Type:calc
p 496 -64 100 1024 0 name:$(top)$(I)
p 161 -187 100 0 0 def(FLNK):0.000000000000000e+00
p 96 254 100 0 0 def(INPA):0.000000000000000e+00
p 96 222 100 0 0 def(INPB):0.000000000000000e+00
p 96 190 100 0 0 def(INPC):0.000000000000000e+00
p 96 158 100 0 0 def(INPD):0.000000000000000e+00
p 96 126 100 0 0 def(INPE):0.000000000000000e+00
p 96 94 100 0 0 def(INPF):0.000000000000000e+00
p 96 93 100 0 0 def(INPG):0.000000000000000e+00
p 96 91 100 0 0 def(INPH):0.000000000000000e+00
p 96 89 100 0 0 def(INPI):0.000000000000000e+00
p 96 87 100 0 0 def(INPJ):0.000000000000000e+00
p 96 85 100 0 0 def(INPK):0.000000000000000e+00
p 96 83 100 0 0 def(INPL):0.000000000000000e+00
p 96 81 100 0 0 def(SDIS):0.000000000000000e+00
p 312 424 75 1280 -1 pproc(INPA):NPP
p 312 392 75 1280 -1 pproc(INPB):NPP
p 312 360 75 1280 -1 pproc(INPC):NPP
p 312 328 75 1280 -1 pproc(INPD):NPP
p 312 296 75 1280 -1 pproc(INPE):NPP
p 312 264 75 1280 -1 pproc(INPF):NPP
p 312 232 75 1280 -1 pproc(INPG):NPP
p 312 200 75 1280 -1 pproc(INPH):NPP
p 312 168 75 1280 -1 pproc(INPI):NPP
p 312 136 75 1280 -1 pproc(INPJ):NPP
p 312 104 75 1280 -1 pproc(INPK):NPP
p 312  72 75 1280 -1 pproc(INPL):NPP
p 312   8 75 1280 -1 pproc(SDIS):NPP
p 344 424 75 1280 -1 palrm(INPA):NMS
p 344 392 75 1280 -1 palrm(INPB):NMS
p 344 360 75 1280 -1 palrm(INPC):NMS
p 344 328 75 1280 -1 palrm(INPD):NMS
p 344 296 75 1280 -1 palrm(INPE):NMS
p 344 264 75 1280 -1 palrm(INPF):NMS
p 344 232 75 1280 -1 palrm(INPG):NMS
p 344 200 75 1280 -1 palrm(INPH):NMS
p 344 168 75 1280 -1 palrm(INPI):NMS
p 344 136 75 1280 -1 palrm(INPJ):NMS
p 344 104 75 1280 -1 palrm(INPK):NMS
p 344  72 75 1280 -1 palrm(INPL):NMS
p 344   8 75 1280 -1 palrm(SDIS):NMS
p 272 446 100 0 0 primitive:ecalc
p 161 -186 100 0 0 typ(FLNK):path
p 96 255 100 0 0 typ(INPA):path
p 96 223 100 0 0 typ(INPB):path
p 96 191 100 0 0 typ(INPC):path
p 96 159 100 0 0 typ(INPD):path
p 96 127 100 0 0 typ(INPE):path
p 96 95 100 0 0 typ(INPF):path
p 96 92 100 0 0 typ(INPG):path
p 96 90 100 0 0 typ(INPH):path
p 96 88 100 0 0 typ(INPI):path
p 96 86 100 0 0 typ(INPJ):path
p 96 84 100 0 0 typ(INPK):path
p 96 82 100 0 0 typ(INPL):path
p 96 80 100 0 0 typ(SDIS):path
p 616 192 100 1024 -1 username(U0):FLD0
p 616 160 100 1024 -1 username(U1):FLD1
p 672 160 75 768 0 palrm(U1):NMS
p 704 160 75 768 0 pproc(U1):NPP
p 672 192 75 768 0 palrm(U0):NMS
p 704 192 75 768 0 pproc(U0):NPP
[layers]
<symbol>
v 0 608 160
672 160
_
v 0 608 192
672 192
_
v 0 384 32
448 32
_
v 0 384 256
448 256
_
v 0 384 288
448 288
_
v 0 384 320
448 320
_
v 0 384 352
448 352
_
v 0 384 384
448 384
_
v 0 384 416
448 416
_
v 0 608 224
672 224
_
v 0 608 256
672 256
_
v 0 384 224
448 224
_
v 0 384 192
448 192
_
v 0 384 160
448 160
_
v 0 384 128
448 128
_
v 0 384 96
448 96
_
v 0 384 64
448 64
_
v 0 384 0
448 0
_
v 0 448 448
608 288
608 128
448 -32
448 448
_
[comments]
