[symbol2]
bbox 0 0 3360 2560
uniq 0
[tools]
[attributes]
p 0 -24 100 0 0 id:frame
p 0 0 100 0 0 model:frame
p 3084 132 100 1792 -1 page:
p 0 24 100 0 0 revision:2.2
p 2077 184 150 0 -1 seta:author
p 2141 256 200 0 -1 setd:I8.2.2.2-1
p 2440 178 150 0 -1 setdat:$(date)
p 1888 121 150 0 -1 setf:filename.sch
p 1839 198 300 0 -1 setr:A
p 1888 496 250 0 -1 sets:ISAC Control System
p 1894 433 200 0 -1 sett0:EPICS Area Schematic
p 1894 359 200 0 -1 sett1:Off-line Ion Source - Vacuum System Devices
p 304 256 100 1024 0 name:$(top)$(I)
[layers]
<symbol>
l 300 7 0 48 392 A
l 300 7 0 48 984 B
l 300 7 0 48 1576 C
l 300 7 0 48 2168 D
l 300 7 0 492 2512 1
l 300 7 0 1284 2512 2
l 300 7 0 2076 2512 3
l 300 7 0 2868 2512 4
l 300 7 0 3312 2168 D
l 300 7 0 3312 1576 C
l 300 7 0 3312 984 B
l 300 7 0 3312 392 A
l 300 7 0 2868 48 4
l 300 7 0 2076 48 3
l 300 7 0 1284 48 2
l 300 7 0 492 48 1
l 180 0 0 2704 256 TRIUMF
l 120 0 0 2704 224 4004 Wesbrook Mall
l 120 0 0 2704 192 Vancouver, B.C.
l 120 0 0 2704 160 Canada
l 120 0 0 2704 128 V6T 2A3
l 100 0 0 2320 192 Date:
l 100 0 0 1936 192 Drawn by:
l 100 0 0 1808 128 File:
l 100 0 0 1936 288 Drawing #:
l 100 0 0 1808 288 Revision
r 0 96 96 3264 2464
r 0 2688 96 3264 320
r 0 2304 160 2688 224
r 0 1920 160 2304 224
r 0 1920 224 2688 320
r 0 1792 160 1920 320
r 0 1792 96 2688 160
r 0 1792 320 3264 576
v 0 2560 2464
2560 2400
3264 2400
_
v 0 3122 2400
3122 2435
_
v 0 2999 2400
2999 2435
_
v 0 2613 2400
2613 2435
_
v 0 2560 2435
3264 2435
_
v 0 0 1280
96 1280
48 1328
_
v 0 96 1280
48 1232
_
v 0 3312 1232
3264 1280
3312 1328
_
v 0 3264 1280
3360 1280
_
v 0 1728 2512
1680 2464
1632 2512
_
v 0 1680 2464
1680 2560
_
v 0 1632 48
1680 96
1728 48
_
v 0 1680 96
1680 0
_
v 0 0 688
96 688
_
v 0 0 1872
96 1872
_
v 0 888 2464
888 2560
_
v 0 2472 2464
2472 2560
_
v 0 3264 1872
3360 1872
_
v 0 3264 688
3360 688
_
v 0 2472 0
2472 96
_
v 0 888 0
888 96
_
[comments]
