[symbol2]
bbox 352 320 608 416
port 568 361 100 1792 VAL symbol 2 608 352 0
port 575 393 100 1792 FLNK symbol 2 608 384 0
port 396 415 100 1792 INP symbol 1 352 400 0
port 390 378 100 1792 SLNK symbol 1 352 368 0
port 390 346 100 1792 SDIS symbol 1 352 336 0
uniq 6
[tools]
[attributes]
p 280 450 100 0 0 primitive:ai
p 96 366 100 0 0 SCAN:Passive
p 96 334 100 0 0 PHAS:0
p 96 302 100 0 0 EVNT:0
p 464 366 100 0 -1 Type:ai
p 238 488 100 0 0 DTYP:Soft Channel
p 96 270 100 0 0 PINI:NO
p 96 238 100 0 0 LINR:LINEAR
p 96 206 100 0 0 PREC:0
p 96 174 100 0 0 EGUF:0.0000000e+00
p 96 142 100 0 0 EGUL:0.0000000e+00
p 96 -18 100 0 0 DISV:1
p 96 110 100 0 0 EGU:volts
p 96 78 100 0 0 HOPR:0.0000000e+00
p 96 46 100 0 0 LOPR:0.0000000e+00
p 320 366 100 0 0 HIHI:0.0000000e+00
p 320 334 100 0 0 LOLO:0.0000000e+00
p 320 302 100 0 0 HIGH:0.0000000e+00
p 320 270 100 0 0 LOW:0.0000000e+00
p 320 238 100 0 0 HHSV:NO_ALARM
p 320 206 100 0 0 HSV:NO_ALARM
p 320 174 100 0 0 LSV:NO_ALARM
p 320 142 100 0 0 LLSV:NO_ALARM
p 96 -50 100 0 0 HYST:0.000000000000000e+00
p 96 -82 100 0 0 ADEL:0.000000000000000e+00
p 96 -114 100 0 0 MDEL:0.000000000000000e+00
p 320 110 100 0 0 DISS:NO_ALARM
p 320 78 100 0 0 PRIO:LOW
p 320 46 100 0 0 AOFF:0.0000000e+00
p 96 14 100 0 0 ASLO:0.0000000e+00
p 320 14 100 0 0 SMOO:0.0000000e+00
p 96 -146 100 0 0 SIOL:0.000000000000000e+00
p 96 -178 100 0 0 SIML:0.000000000000000e+00
p 96 -210 100 0 0 SIMS:NO_ALARM
p 141 441 100 0 0 DESC:analog input record
p 96 -82 100 0 0 def(FLNK):0.000000000000000e+00
p 96 -100 100 0 0 typ(FLNK):path
p 96 -132 100 0 0 typ(INP):path
p 96 -164 100 0 0 def(INP):0.000000000000000e+00
p 96 -196 100 0 0 def(SDIS):0.000000000000000e+00
p 96 -228 100 0 0 ASG:
p 96 -228 100 0 0 typ(SDIS):path
p 96 -228 100 0 0 pproc(SDIS):NPP
p 96 -228 100 0 0 palrm(SDIS):NMS
p 304 256 100 1024 0 name:$(top)$(I)
[layers]
<symbol>
v 0 416 416
416 320
512 320
544 352
544 384
512 416
416 416
_
v 0 352 336
416 336
_
v 0 352 368
416 368
_
v 0 352 400
416 400
_
v 0 544 384
608 384
_
v 0 544 352
608 352
_
[comments]
