[symbol2]
bbox -32 32 480 480
port 5 201 100 1792 SELL symbol 1 -32 192 0
port 5 73 100 1792 SLNK symbol 1 -32 64 0
port 448 73 100 1792 LNK6 symbol 2 480 64 0
port 448 137 100 1792 LNK5 symbol 2 480 128 0
port 448 201 100 1792 LNK4 symbol 2 480 192 0
port 448 265 100 1792 LNK3 symbol 2 480 256 0
port 448 329 100 1792 LNK2 symbol 2 480 320 0
port 448 393 100 1792 LNK1 symbol 2 480 384 0
port 5 137 100 1792 SDIS symbol 1 -32 128 0
port 448 457 100 1792 FLNK symbol 2 480 448 0
port 5 265 -100 1792 U2 symbol 1 -32 256 0
port 5 329 -100 1792 U1 symbol 1 -32 320 0
port 5 393 -100 1792 U0 symbol 1 -32 384 0
uniq 12
[tools]
[attributes]
p 160 446 100 0 0 primitive:fanout
p 192 446 100 0 -1 Type:fanout
p 96 350 100 0 1 SCAN:Passive
p 96 318 100 0 1 DISV:1
p 126 425 100 0 1 DESC:fanout record
p 96 286 100 0 1 PINI:NO
p 96 254 100 0 1 PHAS:0
p 96 222 100 0 1 EVNT:0
p 96 190 100 0 1 DISS:NO_ALARM
p 96 158 100 0 1 PRIO:LOW
p 96 126 100 0 1 SELM:All
p 96 -82 100 0 0 def(SDIS):0.000000000000000e+00
p 96 -100 100 0 0 typ(SDIS):path
p 96 -132 100 0 0 typ(LNK1):path
p 96 -164 100 0 0 def(LNK1):0.000000000000000e+00
p 96 -196 100 0 0 typ(LNK2):path
p 96 -228 100 0 0 def(LNK2):0.000000000000000e+00
p 96 -260 100 0 0 typ(LNK3):path
p 96 -292 100 0 0 def(LNK3):0.000000000000000e+00
p 96 -324 100 0 0 typ(LNK4):path
p 96 -356 100 0 0 def(LNK4):0.000000000000000e+00
p 96 -388 100 0 0 typ(LNK5):path
p 96 -420 100 0 0 def(LNK5):0.000000000000000e+00
p 96 -452 100 0 0 typ(LNK6):path
p 96 -484 100 0 0 def(LNK6):0.000000000000000e+00
p 96 -516 100 0 0 typ(FLNK):path
p 96 -548 100 0 0 def(FLNK):0.000000000000000e+00
p -20 387 100 0 -1 username(U0):FLD0
p -18 324 100 0 -1 username(U1):FLD1
p -19 260 100 0 -1 username(U2):FLD2
p 96 -580 100 0 0 typ(SELL):path
p 96 -612 100 0 0 def(SELL):0.000000000000000e+00
p 96 -644 100 0 0 pproc(SELL):NPP
p 96 -676 100 0 0 palrm(SELL):NMS
p 304 256 100 1024 0 name:$(top)$(I)
[layers]
<symbol>
r 0 32 32 416 480
v 0 -32 192
32 192
_
v 0 -32 64
32 64
_
v 0 416 64
480 64
_
v 0 416 128
480 128
_
v 0 416 192
480 192
_
v 0 416 256
480 256
_
v 0 416 320
480 320
_
v 0 32 416
416 416
_
v 0 416 384
480 384
_
v 0 -32 128
32 128
_
v 0 416 448
480 448
_
v 0 -32 256
32 256
_
v 0 -32 320
32 320
_
v 0 -32 384
32 384
_
[comments]
