[symbol2]
bbox 320 256 576 416
port 539 298 -100 1792 U3 symbol 2 576 288 0
port 539 330 -100 1792 U2 symbol 2 576 320 0
port 358 282 -100 1792 U1 symbol 1 320 272 0
port 358 314 -100 1792 U0 symbol 1 320 304 0
port 360 378 100 1792 SLNK symbol 1 320 368 0
port 539 362 100 1792 VAL symbol 2 576 352 0
port 542 394 100 1792 FLNK symbol 2 576 384 0
port 358 410 100 1792 INP symbol 1 320 400 0
port 360 346 100 1792 SDIS symbol 1 320 336 0
uniq 10
[tools]
[attributes]
p 208 446 100 0 0 primitive:bi
p 96 366 100 0 0 SCAN:Passive
p 96 334 100 0 0 PHAS:0
p 96 302 100 0 0 EVNT:0
p 208 494 100 0 0 DTYP:Soft Channel
p 96 270 100 0 0 PINI:NO
p 96 238 100 0 0 ZNAM:enabled
p 96 206 100 0 0 ONAM:disabled
p 320 302 100 0 0 ZSV:NO_ALARM
p 320 270 100 0 0 OSV:NO_ALARM
p 320 238 100 0 0 COSV:NO_ALARM
p 432 334 100 0 -1 Type:bi
p 320 206 100 0 0 DISV:1
p 320 366 100 0 0 DISS:NO_ALARM
p 320 334 100 0 0 PRIO:LOW
p 96 174 100 0 0 SIOL:0.000000000000000e+00
p 96 142 100 0 0 SIML:0.000000000000000e+00
p 96 110 100 0 0 SIMS:NO_ALARM
p 147 443 100 0 0 DESC:binary input record
p 96 -82 100 0 0 def(FLNK):0.000000000000000e+00
p 96 -100 100 0 0 typ(FLNK):path
p 96 -132 100 0 0 typ(INP):val
p 96 -164 100 0 0 def(INP):0.000000000000000e+00
p 96 -198 100 0 0 def(SDIS):0.000000000000000e+00
p 96 -240 100 0 0 typ(SDIS):path
p 96 -240 100 0 0 pproc(SDIS):NPP
p 96 -240 100 0 0 palrm(SDIS):NMS
p 331 307 100 0 -1 username(U0):FLD0
p 331 275 100 0 -1 username(U1):FLD1
p 520 324 100 0 -1 username(U2):FLD2
p 520 292 100 0 -1 username(U3):FLD3
p 96 -272 100 0 0 typ(U0):val
p 96 -304 100 0 0 typ(U1):val
p 96 -336 100 0 0 typ(U2):val
p 96 -368 100 0 0 typ(U3):val
p 304 256 100 1024 0 name:$(top)$(I)
[layers]
<symbol>
v 0 384 416
384 256
480 256
512 288
512 384
480 416
384 416
_
v 0 512 288
576 288
_
v 0 512 320
576 320
_
v 0 320 272
384 272
_
v 0 320 304
384 304
_
v 0 320 368
384 368
_
v 0 512 352
576 352
_
v 0 512 384
576 384
_
v 0 320 400
384 400
_
v 0 320 336
384 336
_
[comments]
