[symbol2]
bbox -384 -64 608 544
port -340 143 -100 1792 U7 symbol 1 -384 128 0
port -340 207 -100 1792 U6 symbol 1 -384 192 0
port -340 271 -100 1792 U5 symbol 1 -384 256 0
port -340 335 -100 1792 U4 symbol 1 -384 320 0
port -346 458 100 1792 RDBL symbol 1 -384 448 0
port 568 9 -100 1792 U3 symbol 2 608 0 0
port 568 73 -100 1792 U2 symbol 2 608 64 0
port 568 137 -100 1792 U1 symbol 2 608 128 0
port 568 201 -100 1792 U0 symbol 2 608 192 0
port 568 265 100 1792 VAL symbol 2 608 256 0
port 575 457 100 1792 FLNK symbol 2 608 448 0
port -340 399 100 1792 DOL symbol 1 -384 384 0
port -346 74 100 1792 SLNK symbol 1 -384 64 0
port -346 10 100 1792 SDIS symbol 1 -384 0 0
port 568 329 100 1792 OUT symbol 2 608 320 0
port 576 392 100 1792 RLNK symbol 2 608 384 0
uniq 12
[tools]
[attributes]
p -272 -96 100 1024 0 name:$(top)$(I)
p 280 450 100 0 0 primitive:emotor
p -256 366 100 0 1 SCAN:Passive
p -256 334 100 0 1 PHAS:0
p -256 302 100 0 1 EVNT:0
p 58 521 100 0 -1 Type:motor
p -256 270 100 0 1 PINI:NO
p -256 110 100 0 1 DISV:1
p -256 238 100 0 1 EGU:units
p 0 302 100 0 1 HIHI:0.0000000e+00
p 0 270 100 0 1 LOLO:0.0000000e+00
p 0 238 100 0 1 HIGH:0.0000000e+00
p 0 206 100 0 1 LOW:0.0000000e+00
p 0 174 100 0 1 HHSV:NO_ALARM
p 0 142 100 0 1 HSV:NO_ALARM
p 0 110 100 0 1 LSV:NO_ALARM
p 0 78 100 0 1 LLSV:NO_ALARM
p 43 491 100 0 -1 DTYP:OMS VME8/44
p 256 110 100 0 1 ACCL:0.0000000e+00
p -256 78 100 0 1 OMSL:supervisory
p -256 174 100 0 1 PREC:0
p 256 206 100 0 1 VELO:0.0000000e+00
p 256 174 100 0 1 ADEL:0.0000000e+00
p 256 142 100 0 1 MDEL:0.0000000e+00
p -256 142 100 0 1 DISS:NO_ALARM
p -256 206 100 0 1 PRIO:LOW
p 0 14 100 0 1 MODE:Position
p 256 302 100 0 1 MRES:0
p 256 270 100 0 1 ERES:0
p 0 46 100 0 1 HLSV:NO_ALARM
p 256 14 100 0 1 RDBD:0.0000000e+00
p 256 238 100 0 1 RTRY:0
p 32 438 100 0 -1 DESC:motor record
p 96 -82 100 0 0 def(FLNK):0.000000000000000e+00
p 96 -100 100 0 0 typ(FLNK):path
p 96 -132 100 0 0 typ(DOL):path
p 96 -164 100 0 0 def(DOL):0.000000000000000e+00
p 96 -164 100 0 0 pproc(DOL):NPP
p 96 -164 100 0 0 palrm(DOL):NMS
p 96 -196 100 0 0 def(SDIS):0.000000000000000e+00
p 96 -228 100 0 0 typ(SDIS):path
p 96 -228 100 0 0 pproc(SDIS):NPP
p 96 -228 100 0 0 palrm(SDIS):NMS
p 96 -260 100 0 0 def(RDBL):0.000000000000000e+00
p 96 -292 100 0 0 typ(RDBL):path
p 96 -292 100 0 0 pproc(RDBL):NPP
p 96 -292 100 0 0 palrm(RDBL):NMS
p 553 195 100 0 -1 username(U0):FLD0
p 552 133 100 0 -1 username(U1):FLD1
p 552 70 100 0 -1 username(U2):FLD2
p 552 6 100 0 -1 username(U3):FLD3
p 96 -324 100 0 0 typ(OUT):path
p 96 -356 100 0 0 def(OUT):0.000000000000e+00
p -367 326 100 0 -1 username(U4):FLD4
p -369 262 100 0 -1 username(U5):FLD5
p -369 197 100 0 -1 username(U6):FLD6
p -369 133 100 0 -1 username(U7):FLD7
p -256 46 100 0 1 HLM:0.0000000e+00
p -256 14 100 0 1 LLM:0.0000000e+00
p 0 366 100 0 1 DHLM:0.0000000e+00
p 0 334 100 0 1 DLLM:0.0000000e+00
p 96 -388 100 0 0 typ(RLNK):path
p 96 -420 100 0 0 def(RLNK):0.000000000000000e+00
p 256 366 100 0 1 UEIP:No
p 256 334 100 0 1 URIP:No
[layers]
<symbol>
r 0 -320 -64 544 544
v 0 -384 128
-320 128
_
v 0 -384 192
-320 192
_
v 0 -384 256
-320 256
_
v 0 -384 320
-320 320
_
v 0 -320 480
544 480
_
v 0 -320 416
544 416
_
v 0 -384 448
-320 448
_
v 0 -384 0
-320 0
_
v 0 -384 64
-320 64
_
v 0 -384 384
-320 384
_
v 0 544 448
608 448
_
v 0 544 256
608 256
_
v 0 544 192
608 192
_
v 0 544 128
608 128
_
v 0 544 64
608 64
_
v 0 544 0
608 0
_
v 0 544 320
608 320
_
v 0 544 384
608 384
_
[comments]
