[symbol2]
bbox 192 272 448 400
port 204 376 100 0 INDX symbol 1 192 368 0
port 230 282 100 1792 SVAL symbol 1 192 272 0
port 230 410 100 1792 INP symbol 1 192 400 0
port 230 346 100 1792 SLNK symbol 1 192 336 0
port 230 314 100 1792 SDIS symbol 1 192 304 0
port 415 345 100 1792 VAL symbol 2 448 336 0
port 415 377 100 1792 FLNK symbol 2 448 368 0
port 430 310 -100 0 UDF symbol 2 448 304 0
uniq 8
[tools]
[attributes]
p 280 450 100 0 0 primitive:esubArray
p 96 366 100 0 0 SCAN:Passive
p 96 334 100 0 0 PHAS:0
p 96 302 100 0 0 EVNT:0
p 272 336 100 0 -1 Type:subArray
p 96 270 100 0 0 PINI:NO
p 96 110 100 0 0 DISV:1
p 213 489 100 0 0 DTYP:Soft Channel
p 96 174 100 0 0 DISV:1
p 320 366 100 0 0 RARM:0
p 320 334 100 0 0 EGU:units
p 320 270 100 0 0 NELM:1
p 320 270 100 0 0 MALM:1
p 320 270 100 0 0 INDX:0
p 320 238 100 0 0 FTVL:STRING
p 320 206 100 0 0 SIOL:0.0000000e+00
p 320 302 100 0 0 SIML:0.0000000e+00
p 320 110 100 0 0 SIMS:NO_ALARM
p 320 174 100 0 0 HOPR:0.0000000e+00
p 320 142 100 0 0 LOPR:0.0000000e+00
p 96 206 100 0 0 PREC:0
p 96 142 100 0 0 DISS:NO_ALARM
p 96 238 100 0 0 PRIO:LOW
p 199 440 100 0 0 DESC:subarray record
p 199 440 100 0 0 ASG:DEFAULT
p 96 -82 100 0 0 def(FLNK):0.000000000000000e+00
p 96 -100 100 0 0 typ(FLNK):path
p 96 -196 100 0 0 def(SDIS):0.000000000000000e+00
p 96 -228 100 0 0 typ(SDIS):path
p 96 -324 100 0 0 def(INP):0.000000000000000e+00
p 96 -358 100 0 0 typ(INP):val
p 396 312 100 0 -1 username(UDF):FLD0
p 304 256 100 1024 0 name:$(top)$(I)
[layers]
<symbol>
v 0 256 400
256 272
352 272
352 288
384 288
384 384
352 384
352 400
256 400
_
v 0 196 272
256 272
_
v 0 192 304
256 304
_
v 0 192 400
256 400
_
v 0 192 336
256 336
_
v 0 192 368
256 368
_
v 0 384 368
448 368
_
v 0 384 304
448 304
_
v 0 448 336
384 336
_
[comments]
