[symbol2]
bbox -32 -224 608 544
port 576 160 100 1024 ALL0 symbol 2 608 160 0
port 576 192 100 1024 ALL1 symbol 2 608 192 0
port 0 -160 100 1024 INF symbol 1 -32 -160 0
port 0 -128 100 1024 INE symbol 1 -32 -128 0
port 0 -96 100 1024 IND symbol 1 -32 -96 0
port 0 -64 100 1024 INC symbol 1 -32 -64 0
port 0 -32 100 1024 INB symbol 1 -32 -32 0
port 0 0 100 1024 INA symbol 1 -32 0 0
port 0 32 100 1024 IN9 symbol 1 -32 32 0
port 0 64 100 1024 IN8 symbol 1 -32 64 0
port 0 96 100 1024 IN7 symbol 1 -32 96 0
port 0 128 100 1024 IN6 symbol 1 -32 128 0
port 0 160 100 1024 IN5 symbol 1 -32 160 0
port 0 192 100 1024 IN4 symbol 1 -32 192 0
port 0 224 100 1024 IN3 symbol 1 -32 224 0
port 0 256 100 1024 IN2 symbol 1 -32 256 0
port 0 288 100 1024 IN1 symbol 1 -32 288 0
port 0 320 100 1024 IN0 symbol 1 -32 320 0
port 0 352 100 1024 SDIS symbol 1 -32 352 0
port 0 384 100 1024 SLNK symbol 1 -32 384 0
port 0 -192 100 1024 BTCH symbol 1 -32 -192 0
port 576 384 100 1024 FLNK symbol 2 608 384 0
port 576 224 100 1024 VAL symbol 3 608 224 0
port 576 32 -100 1024 U0 symbol 2 608 32 0
port 576 -32 -100 1024 U1 symbol 2 608 -32 0
port 576 -96 -100 1024 U2 symbol 2 608 -96 0
port 576 -160 -100 1024 U3 symbol 2 608 -160 0
port 576 288 100 1024 OUT symbol 2 608 288 0
uniq 24
[tools]
[attributes]
p 608 288 75 768 -1 pproc(OUT):NPP
p 640 288 75 768 -1 palrm(OUT):NMS
p 280 450 100 0 0 primitive:ew2mask 
p 96 366 100 0 1 SCAN:Passive
p 96 334 100 0 1 PHAS:0
p 96 302 100 0 1 EVNT:0
p 251 515 100 0 -1 Type:w2mask 
p 212 488 100 0 -1 DTYP:Soft Channel
p 96 270 100 0 1 PINI:NO
p 96 110 100 0 1 DISV:1
p 96 238 100 0 1 EGU:units
p 96 206 100 0 1 HOPR:0
p 96 174 100 0 1 LOPR:0
p 320 366 100 0 1 HIHI:0
p 320 334 100 0 1 LOLO:0
p 320 302 100 0 1 HIGH:0
p 320 270 100 0 1 LOW:0
p 320 238 100 0 1 HHSV:NO_ALARM
p 320 206 100 0 1 HSV:NO_ALARM
p 320 174 100 0 1 LSV:NO_ALARM
p 320 142 100 0 1 LLSV:NO_ALARM
p 96 14 100 0 1 OMSL:supervisory
p 96 -18 100 0 1 IVOA:Continue normally
p 320 46 100 0 1 IVOV:0
p 96 78 100 0 1 HYST:0
p 96 46 100 0 1 ADEL:0
p 320 78 100 0 1 MDEL:0
p 96 142 100 0 1 DISS:NO_ALARM
p 320 110 100 0 1 PRIO:LOW
p 96 -50 100 0 1 SIOL:0.000000000000000e+00
p 96 -82 100 0 1 SIML:0.000000000000000e+00
p 80 -256 100 1024 0 name:$(top)$(I)
p 96 -114 100 0 1 SIMS:NO_ALARM
p 141 441 100 0 1 DESC:word to mask record
p 96 -146 100 0 1 FON:0
p 320 -114 100 0 1 FOFF:0
p 96 -82 100 0 0 def(FLNK):0.000000000000000e+00
p 96 -100 100 0 0 typ(FLNK):path
p 96 -132 100 0 0 typ(DOL):path
p 96 -164 100 0 0 def(DOL):0.000000000000000e+00
p 96 -196 100 0 0 def(SDIS):0.000000000000000e+00
p 96 -228 100 0 0 typ(SDIS):path
p -64 352 75 1280 -1 pproc(DOL):NPP
p -32 352 75 1280 -1 palrm(DOL):NMS
p -64 352 75 1280 -1 pproc(SDIS):NPP
p -32 352 75 1280 -1 palrm(SDIS):NMS
p 96 -260 100 0 0 def(OUT):0.000000000000000e+00 
p 96 -292 100 0 0 typ(OUT):path 
p 576 32 100 1024 -1 username(U0):FLD0 
p 576 -32 100 1024 -1 username(U1):FLD1 
p 576 -96 100 1024 -1 username(U2):FLD2
p 576 -160 100 1024 -1 username(U3):FLD3
p 96 -132 100 0 0 typ(IN0):path
p 96 -164 100 0 0 def(IN0):0.000000000000000e+00
p -64 320 75 1280 -1 pproc(IN0):NPP
p -32 320 75 1280 -1 palrm(IN0):NMS
p 96 -132 100 0 0 typ(IN1):path
p 96 -164 100 0 0 def(IN1):0.000000000000000e+00
p -64 288 75 1280 -1 pproc(IN1):NPP
p -32 288 75 1280 -1 palrm(IN1):NMS
p 96 -132 100 0 0 typ(IN2):path
p 96 -164 100 0 0 def(IN2):0.000000000000000e+00
p -64 256 75 1280 -1 pproc(IN2):NPP
p -32 256 75 1280 -1 palrm(IN2):NMS
p 96 -132 100 0 0 typ(IN3):path
p 96 -164 100 0 0 def(IN3):0.000000000000000e+00
p -64 224 75 1280 -1 pproc(IN3):NPP
p -32 224 75 1280 -1 palrm(IN3):NMS
p 96 -132 100 0 0 typ(IN4):path
p 96 -164 100 0 0 def(IN4):0.000000000000000e+00
p -64 192 75 1280 -1 pproc(IN4):NPP
p -32 192 75 1280 -1 palrm(IN4):NMS
p 96 -132 100 0 0 typ(IN5):path
p 96 -164 100 0 0 def(IN5):0.000000000000000e+00
p -64 160 75 1280 -1 pproc(IN5):NPP
p -32 160 75 1280 -1 palrm(IN5):NMS
p 96 -132 100 0 0 typ(IN6):path
p 96 -164 100 0 0 def(IN6):0.000000000000000e+00
p -64 128 75 1280 -1 pproc(IN6):NPP
p -32 128 75 1280 -1 palrm(IN6):NMS
p 96 -132 100 0 0 typ(IN7):path
p 96 -164 100 0 0 def(IN7):0.000000000000000e+00
p -64 96 75 1280 -1 pproc(IN7):NPP
p -32 96 75 1280 -1 palrm(IN7):NMS
p 96 -132 100 0 0 typ(IN8):path
p 96 -164 100 0 0 def(IN8):0.000000000000000e+00
p -64 64 75 1280 -1 pproc(IN8):NPP
p -32 64 75 1280 -1 palrm(IN8):NMS
p 96 -132 100 0 0 typ(IN9):path
p 96 -164 100 0 0 def(IN9):0.000000000000000e+00
p -64 32 75 1280 -1 pproc(IN9):NPP
p -32 32 75 1280 -1 palrm(IN9):NMS
p 96 -132 100 0 0 typ(INA):path
p 96 -164 100 0 0 def(INA):0.000000000000000e+00
p -64 0 75 1280 -1 pproc(INA):NPP
p -32 0 75 1280 -1 palrm(INA):NMS
p 96 -132 100 0 0 typ(INB):path
p 96 -164 100 0 0 def(INB):0.000000000000000e+00
p -64 -32 75 1280 -1 pproc(INB):NPP
p -32 -32 75 1280 -1 palrm(INB):NMS
p 96 -132 100 0 0 typ(INC):path
p 96 -164 100 0 0 def(INC):0.000000000000000e+00
p -64 -64 75 1280 -1 pproc(INC):NPP
p -32 -64 75 1280 -1 palrm(INC):NMS
p 96 -132 100 0 0 typ(IND):path
p 96 -164 100 0 0 def(IND):0.000000000000000e+00
p -64 -96 75 1280 -1 pproc(IND):NPP
p -32 -96 75 1280 -1 palrm(IND):NMS
p 96 -132 100 0 0 typ(INE):path
p 96 -164 100 0 0 def(INE):0.000000000000000e+00
p -64 -128 75 1280 -1 pproc(INE):NPP
p -32 -128 75 1280 -1 palrm(INE):NMS
p 96 -132 100 0 0 typ(INF):path
p 96 -164 100 0 0 def(INF):0.000000000000000e+00
p -64 -160 75 1280 -1 pproc(INF):NPP
p -32 -160 75 1280 -1 palrm(INF):NMS
p 96 -132 100 0 0 typ(BTCH):path
p 96 -164 100 0 0 def(BTCH):0.000000000000000e+00
p -64 -192 75 1280 -1 pproc(BTCH):NPP
p -32 -192 75 1280 -1 palrm(BTCH):NMS
p 608 32 75 768 0 palrm(U0):NMS
p 640 32 75 768 0 pproc(U0):NPP
p 608 -32 75 768 0 palrm(U1):NMS
p 640 -32 75 768 0 pproc(U1):NPP
p 608 -96 75 768 0 palrm(U2):NMS
p 640 -96 75 768 0 pproc(U2):NPP
p 608 -160 75 768 0 palrm(U3):NMS
p 640 -160 75 768 0 pproc(U3):NPP
[layers]
<symbol>
r 0 32 544 544 -224
v 0 544 160
608 160
_
v 0 544 192
608 192
_
v 0 -32 -160
32 -160
_
v 0 -32 -128
32 -128
_
v 0 -32 -96
32 -96
_
v 0 -32 -64
32 -64
_
v 0 -32 -32
32 -32
_
v 0 -32 0
32 0
_
v 0 -32 32
32 32
_
v 0 -32 64
32 64
_
v 0 -32 96
32 96
_
v 0 -32 128
32 128
_
v 0 -32 160
32 160
_
v 0 -32 192
32 192
_
v 0 -32 224
32 224
_
v 0 -32 256
32 256
_
v 0 -32 288
32 288
_
v 0 -32 320
32 320
_
v 0 544 -160
608 -160
_
v 0 544 -96
608 -96
_
v 0 544 -32
608 -32
_
v 0 544 32
608 32
_
v 0 544 224
608 224
_
v 0 544 384
608 384
_
v 0 -32 -192
32 -192
_
v 0 32 416
544 416
_
v 0 -32 384
32 384
_
v 0 32 480
544 480
_
v 0 -32 352
32 352
_
v 0 544 288
608 288
_
[comments]
