[symbol2]
bbox 480 -96 800 352
port 520 320 100 1024 SELL symbol 1 480 320 0
port 520 256 100 1024 DOL2 symbol 1 480 256 0
port 520 288 100 1024 DOL1 symbol 1 480 288 0
port 520 224 100 1024 DOL3 symbol 1 480 224 0
port 520 192 100 1024 DOL4 symbol 1 480 192 0
port 520 128 100 1024 DOL6 symbol 1 480 128 0
port 520 160 100 1024 DOL5 symbol 1 480 160 0
port 520  96 100 1024 DOL7 symbol 1 480 96 0
port 520  64 100 1024 DOL8 symbol 1 480 64 0
port 520  32 100 1024 DOL9 symbol 1 480 32 0
port 520   0 100 1024 DOLA symbol 1 480 0 0
port 520 -32 100 1024 SLNK symbol 1 480 -32 0
port 520 -64 100 1024 SDIS symbol 1 480 -64 0
port 768 -32 100 1024 FLNK symbol 2 800 -32 0
port 768 288 100 1024 LNK1 symbol 2 800 288 0
port 768 256 100 1024 LNK2 symbol 2 800 256 0
port 768 224 100 1024 LNK3 symbol 2 800 224 0
port 768 192 100 1024 LNK4 symbol 2 800 192 0
port 768 160 100 1024 LNK5 symbol 2 800 160 0
port 768 128 100 1024 LNK6 symbol 2 800 128 0
port 768  96 100 1024 LNK7 symbol 2 800 96 0
port 768  64 100 1024 LNK8 symbol 2 800 64 0
port 768  32 100 1024 LNK9 symbol 2 800 32 0
port 768   0 100 1024 LNKA symbol 2 800 0 0
uniq 30
[tools]
[attributes]
p 126 425 100 0 0 DESC:sequence record
p 96 190 100 0 0 DISS:NO_ALARM
p 96 318 100 0 0 DISV:1
p 96 -2020 100 0 0 DLY1:0.0e+00
p 96 -2052 100 0 0 DLY2:0.0e+00
p 96 -2084 100 0 0 DLY3:0.0e+00
p 96 -2116 100 0 0 DLY4:0.0e+00
p 96 -2148 100 0 0 DLY5:0.0e+00
p 96 -2180 100 0 0 DLY6:0.0e+00
p 96 -2212 100 0 0 DLY7:0.0e+00
p 96 -2244 100 0 0 DLY8:0.0e+00
p 96 -2276 100 0 0 DLY9:0.0e+00
p 96 -2308 100 0 0 DLYA:0.0e+00
p 96 222 100 0 0 EVNT:0
p 96 254 100 0 0 PHAS:0
p 96 286 100 0 0 PINI:NO
p 96 -708 100 0 0 PREC:0
p 96 158 100 0 0 PRIO:LOW
p 96 350 100 0 0 SCAN:Passive
p 96 126 100 0 0 SELM:All
p 592 -128 100 1024 0 name:$(top)$(I)
p 624 126 100 0 -1 Type:seq
p 96 -772 100 0 0 def(DOL1):0.000000000000000e+00
p 96 -900 100 0 0 def(DOL2):0.000000000000000e+00
p 96 -1028 100 0 0 def(DOL3):0.000000000000000e+00
p 96 -1156 100 0 0 def(DOL4):0.000000000000000e+00
p 96 -1284 100 0 0 def(DOL5):0.000000000000000e+00
p 96 -1412 100 0 0 def(DOL6):0.000000000000000e+00
p 96 -1540 100 0 0 def(DOL7):0.000000000000000e+00
p 96 -1668 100 0 0 def(DOL8):0.000000000000000e+00
p 96 -1796 100 0 0 def(DOL9):0.000000000000000e+00
p 96 -1924 100 0 0 def(DOLA):0.000000000000000e+00
p 96 -548 100 0 0 def(FLNK):0.000000000000000e+00
p 96 -164 100 0 0 def(LNK1):0.000000000000000e+00
p 96 -228 100 0 0 def(LNK2):0.000000000000000e+00
p 96 -292 100 0 0 def(LNK3):0.000000000000000e+00
p 96 -356 100 0 0 def(LNK4):0.000000000000000e+00
p 96 -420 100 0 0 def(LNK5):0.000000000000000e+00
p 96 -484 100 0 0 def(LNK6):0.000000000000000e+00
p 96 -2372 100 0 0 def(LNK7):0.000000000000000e+00
p 96 -2436 100 0 0 def(LNK8):0.000000000000000e+00
p 96 -2500 100 0 0 def(LNK9):0.000000000000000e+00
p 96 -2564 100 0 0 def(LNKA):0.000000000000000e+00
p 96 -82 100 0 0 def(SDIS):0.000000000000000e+00
p 96 -612 100 0 0 def(SELL):0.000000000000000e+00
p 440 296 75 1280 -1 palrm(DOL1):NMS
p 440 264 75 1280 -1 palrm(DOL2):NMS
p 440 232 75 1280 -1 palrm(DOL3):NMS
p 440 200 75 1280 -1 palrm(DOL4):NMS
p 440 168 75 1280 -1 palrm(DOL5):NMS
p 440 136 75 1280 -1 palrm(DOL6):NMS
p 440 104 75 1280 -1 palrm(DOL7):NMS
p 440  72 75 1280 -1 palrm(DOL8):NMS
p 440  40 75 1280 -1 palrm(DOL9):NMS
p 440   8 75 1280 -1 parlm(DOLA):NMS
p 840 296 75 1024 -1 palrm(LNK1):NMS
p 840 264 75 1024 -1 palrm(LNK2):NMS
p 840 232 75 1024 -1 palrm(LNK3):NMS
p 840 200 75 1024 -1 palrm(LNK4):NMS
p 840 168 75 1024 -1 palrm(LNK5):NMS
p 840 136 75 1024 -1 palrm(LNK6):NMS
p 840 104 75 1024 -1 palrm(LNK7):NMS
p 840  72 75 1024 -1 palrm(LNK8):NMS
p 840  40 75 1024 -1 palrm(LNK9):NMS
p 840   8 75 1024 -1 palrm(LNKA):NMS
p 440 -56 75 1024 -1 palrm(SDIS):NMS
p 440 328 75 1280 -1 palrm(SELL):NMS
p 408 296 75 1280 -1 pproc(DOL1):NPP
p 408 264 75 1280 -1 pproc(DOL2):NPP
p 408 232 75 1280 -1 pproc(DOL3):NPP
p 408 200 75 1280 -1 pproc(DOL4):NPP
p 408 168 75 1280 -1 pproc(DOL5):NPP
p 408 136 75 1280 -1 pproc(DOL6):NPP
p 408 104 75 1280 -1 pproc(DOL7):NPP
p 408  72 75 1280 -1 pproc(DOL8):NPP
p 408  40 75 1280 -1 pproc(DOL9):NPP
p 408   8 75 1280 -1 pproc(DOLA):NPP
p 808 296 75 1024 -1 pproc(LNK1):NPP
p 808 264 75 1024 -1 pproc(LNK2):NPP
p 808 232 75 1024 -1 pproc(LNK3):NPP
p 808 200 75 1024 -1 pproc(LNK4):NPP
p 808 168 75 1024 -1 pproc(LNK5):NPP
p 808 136 75 1024 -1 pproc(LNK6):NPP
p 808 104 75 1024 -1 pproc(LNK7):NPP
p 808  72 75 1024 -1 pproc(LNK8):NPP
p 808  40 75 1024 -1 pproc(LNK9):NPP
p 808   8 75 1024 -1 pproc(LNKA):NPP
p 408 -56 75 1024 -1 pproc(SDIS):NPP
p 408 328 75 1280 -1 pproc(SELL):NPP
p 160 446 100 0 0 primitive:eseq
p 96 -740 100 0 0 typ(DOL1):path
p 96 -868 100 0 0 typ(DOL2):path
p 96 -996 100 0 0 typ(DOL3):path
p 96 -1124 100 0 0 typ(DOL4):path
p 96 -1252 100 0 0 typ(DOL5):path
p 96 -1380 100 0 0 typ(DOL6):path
p 96 -1508 100 0 0 typ(DOL7):path
p 96 -1636 100 0 0 typ(DOL8):path
p 96 -1764 100 0 0 typ(DOL9):path
p 96 -1892 100 0 0 typ(DOLA):path
p 96 -516 100 0 0 typ(FLNK):path
p 96 -132 100 0 0 typ(LNK1):path
p 96 -196 100 0 0 typ(LNK2):path
p 96 -260 100 0 0 typ(LNK3):path
p 96 -324 100 0 0 typ(LNK4):path
p 96 -388 100 0 0 typ(LNK5):path
p 96 -452 100 0 0 typ(LNK6):path
p 96 -2340 100 0 0 typ(LNK7):path
p 96 -2404 100 0 0 typ(LNK8):path
p 96 -2468 100 0 0 typ(LNK9):path
p 96 -2532 100 0 0 typ(LNKA):path
p 96 -100 100 0 0 typ(SDIS):path
p 96 -580 100 0 0 typ(SELL):path
[layers]
<symbol>
v 0 480 256
544 256
_
v 0 480 288
544 288
_
v 0 480 224
544 224
_
v 0 480 192
544 192
_
v 0 480 128
544 128
_
v 0 480 160
544 160
_
v 0 480 96
544 96
_
v 0 480 64
544 64
_
v 0 736 96
800 96
_
v 0 480 32
544 32
_
v 0 736 64
800 64
_
v 0 736 32
800 32
_
v 0 736 0
800 0
_
v 0 480 0
544 0
_
v 0 480 320
544 320
_
v 0 736 -32
800 -32
_
v 0 480 -64
544 -64
_
v 0 736 288
800 288
_
v 0 736 256
800 256
_
v 0 736 224
800 224
_
v 0 736 192
800 192
_
v 0 736 160
800 160
_
v 0 736 128
800 128
_
v 0 480 -32
544 -32
_
v 0 544 352
544 -96
_
v 0 736 352
736 -96
_
v 0 544 352
640 224
736 352
_
v 0 544 -96
640 32
736 -96
_
[comments]
