[symbol2]
bbox 416 352 992 832
port 448 720 100 1792 SELL symbol 1 416 704 0
port 960 640 100 1024 OUTA symbol 2 992 640 0
port 960 608 100 1024 OUTB symbol 2 992 608 0
port 960 576 100 1024 OUTC symbol 2 992 576 0
port 960 544 100 1024 OUTD symbol 2 992 544 0
port 960 512 100 1024 OUTE symbol 2 992 512 0
port 960 480 100 1024 OUTF symbol 2 992 480 0
port 960 448 100 1024 OUTG symbol 2 992 448 0
port 960 416 100 1024 OUTH symbol 2 992 416 0
port 960 704 100 1024 VAL symbol 3 992 704 0
port 960 736 100 1024 FLNK symbol 2 992 736 0
port 448 640 100 1024 DOL symbol 1 416 640 0
port 448 512 100 1024 SDIS symbol 1 416 512 0
port 448 576 100 1024 SLNK symbol 1 416 576 0
uniq 18
[tools]
[attributes]
p 512 416 100 768 1 ADEL:0
p 736 480 100 768 0 ASG:
p 704 752 100 1024 1 DESC:data fanout record
p 512 544 100 768 1 DISS:NO_ALARM
p 512 576 100 768 1 DISV:1
p 512 448 100 768 1 EGU:units
p 512 608 100 768 1 EVNT:0
p 736 512 100 768 1 HHSV:NO_ALARM
p 736 576 100 768 1 HIGH:0
p 736 640 100 768 1 HIHI:0
p 736 704 100 768 1 HOPR:0
p 736 448 100 768 1 HSV:NO_ALARM
p 736 384 100 768 1 HYST:0
p 736 480 100 768 1 LLSV:NO_ALARM
p 736 608 100 768 1 LOLO:0
p 736 672 100 768 1 LOPR:0
p 736 544 100 768 1 LOW:0
p 736 416 100 768 1 LSV:NO_ALARM
p 512 384 100 768 1 MDEL:0
p 512 480 100 768 1 OMSL:supervisory
p 512 640 100 768 1 PHAS:0
p 512 672 100 768 1 PINI:NO
p 512 512 100 768 1 PRIO:LOW
p 512 704 100 768 1 SCAN:Passive
p 512 360 100 0 1 SELM:All
p 736 352 100 768 0 TSEL:0.00e+0
p 704 784 140 1024 -1 Type:dfanout
p 872 -2248 100 0 0 def(DOL):0
p 352 -544 100 0 0 def(FLNK):0
p 1012 -2388 100 0 0 def(OUTA):0
p 1072 -2448 100 0 0 def(OUTB):0
p 1092 -2468 100 0 0 def(OUTC):0
p 1112 -2488 100 0 0 def(OUTD):0
p 1132 -2508 100 0 0 def(OUTE):0
p 1152 -2528 100 0 0 def(OUTF):0
p 1172 -2548 100 0 0 def(OUTG):0
p 1192 -2568 100 0 0 def(OUTH):0
p 352 -768 100 0 0 def(SDIS):0
p 1672 -3048 100 0 0 def(SELL):0
p 528 320 100 1024 0 name:$(top)$(I)
p 416 640 75 1280 -1 palrm(DOL):NMS
p 1024 640 75 768 -1 palrm(OUTA):NMS
p 1024 608 75 768 -1 palrm(OUTB):NMS
p 1024 576 75 768 -1 palrm(OUTC):NMS
p 1024 544 75 768 -1 palrm(OUTD):NMS
p 1024 512 75 768 -1 palrm(OUTE):NMS
p 1024 480 75 768 -1 palrm(OUTF):NMS
p 1024 448 75 768 -1 palrm(OUTG):NMS
p 1024 416 75 768 -1 palrm(OUTH):NMS
p 416 512 75 1280 -1 palrm(SDIS):NMS
p 392 712 75 0 -1 palrm(SELL):NMS
p 384 640 75 1280 -1 pproc(DOL):NPP
p 992 640 75 768 -1 pproc(OUTA):NPP
p 992 608 75 768 -1 pproc(OUTB):NPP
p 992 576 75 768 -1 pproc(OUTC):NPP
p 992 544 75 768 -1 pproc(OUTD):NPP
p 992 512 75 768 -1 pproc(OUTE):NPP
p 992 480 75 768 -1 pproc(OUTF):NPP
p 992 448 75 768 -1 pproc(OUTG):NPP
p 992 416 75 768 -1 pproc(OUTH):NPP
p 384 512 75 1280 -1 pproc(SDIS):NPP
p 360 712 75 0 -1 pproc(SELL):NPP
p 352 -1728 100 0 0 primitive:edfan
p 852 -2228 100 0 0 typ(DOL):path
p 352 -576 100 0 0 typ(FLNK):path
p 992 -2368 100 0 0 typ(OUTA):path
p 1492 -2868 100 0 0 typ(OUTB):path
p 1512 -2888 100 0 0 typ(OUTC):path
p 1532 -2908 100 0 0 typ(OUTD):path
p 1552 -2928 100 0 0 typ(OUTE):path
p 1572 -2948 100 0 0 typ(OUTF):path
p 1592 -2968 100 0 0 typ(OUTG):path
p 1612 -2988 100 0 0 typ(OUTH):path
p 352 -672 100 0 0 typ(SDIS):path
p 1652 -3028 100 0 0 typ(SELL):path
[layers]
<symbol>
r 0 480 352 928 832
v 0 416 704
480 704
_
v 0 480 752
928 752
_
v 0 928 640
992 640
_
v 0 928 608
992 608
_
v 0 928 576
992 576
_
v 0 928 544
992 544
_
v 0 928 512
992 512
_
v 0 928 480
992 480
_
v 0 928 448
992 448
_
v 0 928 416
992 416
_
v 0 928 704
992 704
_
v 0 928 736
992 736
_
v 0 416 640
480 640
_
v 0 416 512
480 512
_
v 0 416 576
480 576
_
[comments]
