[symbol2]
bbox 0 128 256 256
port 34 169 100 1792 SLNK symbol 1 0 160 0
port 41 233 100 1792 INP symbol 1 0 224 0
port 224 172 100 1792 VAL symbol 2 256 160 0
port 224 236 100 1792 FLNK symbol 2 256 224 0
uniq 2
[tools]
[attributes]
p 0 96 100 0 0 primitive:waveform
p 72 141 100 0 -1 Type:waveform
p 96 366 100 0 0 SCAN:Passive
p 96 334 100 0 0 PHAS:0
p 96 302 100 0 0 EVNT:0
p 168 426 100 0 0 TYPE:cardType
p 96 270 100 0 0 PRCI:NO
p 96 238 100 0 0 EGU:volts
p 96 206 100 0 0 HOPR:0.000000
p 96 174 100 0 0 LOPR:0.000000
p 96 142 100 0 0 RATE:5 MHZ
p 96 110 100 0 0 PTSS:0
p 96 78 100 0 0 NELM:0
p 96 46 100 0 0 SELM:0
p 96 14 100 0 0 MCNT:0
p 96 -50 100 0 0 Node:nodename
p 96 -82 100 0 0 DESC:waveform record
p 96 -82 100 0 0 def(FLNK):0.000000
p 96 -100 100 0 0 typ(FLNK):path
p 96 -132 100 0 0 typ(INP):val
p 96 -164 100 0 0 def(INP):#C0 B0
p 304 256 100 1024 0 name:$(top)$(I)
[layers]
<symbol>
c 0 96 192
112 224
144 160
160 192
_
v 0 0 160
64 160
_
v 0 0 224
64 224
_
v 0 64 256
160 256
192 224
192 160
160 128
64 128
64 256
_
v 0 192 160
256 160
_
v 0 192 224
256 224
_
[comments]
