[symbol2]
bbox -32 -256 672 480
port 644 112 100 1792 S1 symbol 2 672 96 0
port 644 -112 100 1792 S8 symbol 2 672 -128 0
port 644 -80 100 1792 S7 symbol 2 672 -96 0
port 644 -48 100 1792 S6 symbol 2 672 -64 0
port 644 -16 100 1792 S5 symbol 2 672 -32 0
port 644 16 100 1792 S4 symbol 2 672 0 0
port 644 48 100 1792 S3 symbol 2 672 32 0
port 644 80 100 1792 S2 symbol 2 672 64 0
port 0 272 100 1792 CNT symbol 1 -32 256 0
port 644 -208 100 1792 FLNK symbol 2 672 -224 0
port 0 -48 100 1792 SLNK symbol 1 -32 -64 0
port 0 -80 100 1792 SDIS symbol 1 -32 -96 0
port 644 272 100 1792 OUT symbol 2 672 256 0
uniq 66
[tools]
[attributes]
p 400 -224 100 0 1 ASG:
p 384 256 100 0 1 CNT:Done
p 384 224 100 0 1 CONT:OneShot
p 64 256 100 0 1 D1:Up
p 64 -32 100 0 1 D10:Up
p 64 -64 100 0 1 D11:Up
p 64 -96 100 0 1 D12:Up
p 64 -128 100 0 1 D13:Up
p 64 -160 100 0 1 D14:Up
p 64 -192 100 0 1 D15:Up
p 64 -224 100 0 1 D16:Up
p 64 224 100 0 1 D2:Up
p 64 192 100 0 1 D3:Up
p 64 160 100 0 1 D4:Up
p 64 128 100 0 1 D5:Up
p 64 96 100 0 1 D6:Up
p 64 64 100 0 1 D7:Up
p 64 32 100 0 1 D8:Up
p 64 0 100 0 1 D9:Up
p 177 374 100 0 1 DESC:scaler record
p 96 158 100 0 0 DISS:NO_ALARM
p 96 190 100 0 0 DISV:1
p 384 192 100 0 1 DLY:
p 384 160 100 0 1 DLY1:
p 384 96 100 0 1 EGU:Hz
p 96 254 100 0 0 EVNT:0
p 384 128 100 0 1 FREQ:10000000
p 160 256 100 0 1 G1:N
p 160 -32 100 0 1 G10:N
p 160 -64 100 0 1 G11:N
p 160 -96 100 0 1 G12:N
p 160 -128 100 0 1 G13:N
p 160 -160 100 0 1 G14:N
p 160 -192 100 0 1 G15:N
p 160 -224 100 0 1 G16:N
p 160 224 100 0 1 G2:N
p 160 192 100 0 1 G3:N
p 160 160 100 0 1 G4:N
p 160 128 100 0 1 G5:N
p 160 96 100 0 1 G6:N
p 160 64 100 0 1 G7:N
p 160 32 100 0 1 G8:N
p 160 0 100 0 1 G9:N
p 96 286 100 0 0 PHAS:0
p 96 222 100 0 0 PINI:NO
p 288 256 100 0 1 PR1:
p 288 -32 100 0 1 PR10:
p 288 -64 100 0 1 PR11:
p 288 -96 100 0 1 PR12:
p 288 -128 100 0 1 PR13:
p 288 -160 100 0 1 PR14:
p 288 -192 100 0 1 PR15:
p 288 -224 100 0 1 PR16:
p 288 224 100 0 1 PR2:
p 288 192 100 0 1 PR3:
p 288 160 100 0 1 PR4:
p 288 128 100 0 1 PR5:
p 288 96 100 0 1 PR6:
p 288 64 100 0 1 PR7:
p 288 32 100 0 1 PR8:
p 288 0 100 0 1 PR9:
p 96 62 100 0 0 PREC:2
p 96 126 100 0 0 PRIO:HIGH
p 676 -868 100 0 0 PROC:0
p 96 318 100 0 1 SCAN:Passive
p 176 448 100 0 1 Type:scaler
p 161 -187 100 0 0 def(FLNK): 0.000000000000000e+0
p 384 -32 100 0 0 def(OUT): C0 S0
p 400 -128 100 0 0 def(SDIS): 0.00
p 96 80 100 0 0 pproc(SDIS):NPP
p 272 446 100 0 0 primitive:escaler
p 161 -186 100 0 0 typ(FLNK):path
p 416 -32 100 0 0 typ(OUT):path
p 696 -888 100 0 0 typ(SDIS):path
p 304 256 100 1024 0 name:$(top)$(I)
[layers]
<symbol>
r 0 32 -256 608 480
v 0 608 96
672 96
_
v 0 608 -128
672 -128
_
v 0 608 -96
672 -96
_
v 0 608 -64
672 -64
_
v 0 608 -32
672 -32
_
v 0 608 0
672 0
_
v 0 608 32
672 32
_
v 0 608 64
672 64
_
v 0 -32 256
32 256
_
v 0 608 -224
672 -224
_
v 0 32 416
608 416
_
v 0 32 352
608 352
_
v 0 -32 -64
32 -64
_
v 0 -32 -96
32 -96
_
v 0 608 256
672 256
_
[comments]
