[symbol2]
bbox 0 0 2560 1600
uniq 0
[tools]
[attributes]
p 1776 128 100 768 -1 author:$Author: ajf $
p 1760 96 100 768 -1 date:$Date: 2003/12/04 10:54:00 $
p 2000 176 200 768 -1 file:$RCSfile: eborderB.sym,v $
p 2288 128 100 0 -1 page:
p 2384 128 100 0 -1 pages:
p 2000 96 100 0 0 primitive:eborderB
p 2048 128 100 0 -1 revision:$Revision: 1.1.1.1 $
p 2000 240 150 768 -1 system:
p 304 256 100 1024 0 name:$(top)$(I)
[layers]
<symbol>
l 200 7 0 2004 140 B
l 100 0 0 2332 128 OF
l 100 0 0 2188 128 SHEET
r 0 96 96 2464 1504
v 0 0 800
96 800
48 848
_
v 0 96 800
48 752
_
v 0 2512 752
2464 800
2512 848
_
v 0 2464 800
2560 800
_
v 0 1328 1552
1280 1504
1232 1552
_
v 0 1280 1504
1280 1600
_
v 0 1232 48
1280 96
1328 48
_
v 0 1280 96
1280 0
_
v 0 2266 96
2266 122
_
v 0 2153 122
2153 165
_
v 0 2097 96
2097 122
_
v 0 2027 122
2027 165
_
v 0 1984 235
2464 235
_
v 0 1984 165
2464 165
_
v 0 1984 122
2464 122
_
v 0 1984 96
1984 288
_
v 0 1760 165
1984 165
_
v 0 1760 129
1984 129
_
v 0 1760 96
1760 288
2464 288
_
v 0 1760 1475
2464 1475
_
v 0 1813 1440
1813 1475
_
v 0 2199 1440
2199 1475
_
v 0 2322 1440
2322 1475
_
v 0 1760 1504
1760 1440
2464 1440
_
[comments]
