[symbol2]
bbox 256 128 608 256
port 294 170 100 1792 SDIS symbol 1 256 160 0
port 294 202 100 1792 SLNK symbol 1 256 192 0
port 575 233 100 1792 FLNK symbol 2 608 224 0
port 568 201 100 1792 OUT symbol 2 608 192 0
port 568 169 -100 1792 U0 symbol 2 608 160 0
port 294 234 100 1792 SGL symbol 1 256 224 0
uniq 7
[tools]
[attributes]
p 280 450 100 0 0 primitive:eptrn
p 96 366 100 0 0 SCAN:Passive
p 96 334 100 0 0 PHAS:0
p 96 302 100 0 0 EVNT:0
p 373 152 100 0 -1 Type:pulseTrain
p 96 270 100 0 0 PINI:NO
p 96 142 100 0 0 DISV:1
p 217 488 100 0 0 DTYP:Soft Channel
p 320 366 100 0 0 UNIT:Seconds
p 96 78 100 0 0 PER:0.000000000000000e+00
p 96 46 100 0 0 DCY:0.000000000000000e+00
p 320 270 100 0 0 CTYP:Internal
p 320 238 100 0 0 CEDG:Rising Edge
p 320 206 100 0 0 ECS:0
p 96 14 100 0 0 ECR:0.000000000000000e+00
p 320 110 100 0 0 LLOW:Logic Low=0
p 320 302 100 0 0 GTYP:Hardware
p 96 110 100 0 0 HGV:0
p 320 334 100 0 0 SGV:Inactive
p 320 174 100 0 0 HOPR:0.0000000e+00
p 320 142 100 0 0 LOPR:0.0000000e+00
p 96 206 100 0 0 PREC:0
p 96 174 100 0 0 DISS:NO_ALARM
p 96 238 100 0 0 PRIO:LOW
p 152 441 100 0 0 DESC:pulse train record
p 96 -82 100 0 0 def(FLNK):0.000000000000000e+00
p 96 -100 100 0 0 typ(FLNK):path
p 96 -196 100 0 0 def(SDIS):0.000000000000000e+00
p 96 -228 100 0 0 typ(SDIS):path
p 96 -228 100 0 0 pproc(SDIS):NPP
p 96 -228 100 0 0 palrm(SDIS):NMS
p 96 -260 100 0 0 def(SGL):0.000000000000000e+00
p 96 -292 100 0 0 typ(SGL):path
p 96 -292 100 0 0 pproc(SGL):NPP
p 96 -292 100 0 0 palrm(SGL):NMS
p 96 -324 100 0 0 def(OUT):0.000000000000000e+00
p 96 -358 100 0 0 typ(OUT):val
p 552 164 100 0 -1 username(U0):FLD0
p 304 256 100 1024 0 name:$(top)$(I)
[layers]
<symbol>
v 0 320 256
512 256
544 224
544 160
512 128
320 128
320 256
_
v 0 352 192
384 192
384 224
416 224
416 192
448 192
448 224
480 224
480 192
512 192
512 224
_
v 0 544 160
608 160
_
v 0 544 192
608 192
_
v 0 544 224
608 224
_
v 0 256 192
320 192
_
v 0 256 160
320 160
_
v 0 256 224
320 224
_
[comments]
