[symbol2]
bbox 352 32 608 288
port 568 169 -100 1792 U3 symbol 2 608 160 0
port 575 201 -100 1792 U2 symbol 2 608 192 0
port 390 106 100 1792 SIML symbol 1 352 96 0
port 396 175 -100 1792 U1 symbol 1 352 160 0
port 390 138 100 1792 SIOL symbol 1 352 128 0
port 390 74 100 1792 SDIS symbol 1 352 64 0
port 568 233 100 1792 VAL symbol 2 608 224 0
port 575 265 100 1792 FLNK symbol 2 608 256 0
port 384 266 100 1792 INP symbol 1 352 256 0
port 390 234 100 1792 SLNK symbol 1 352 224 0
port 390 202 -100 1792 U0 symbol 1 352 192 0
uniq 12
[tools]
[attributes]
p 280 450 100 0 0 primitive:elongin
p 96 366 100 0 0 SCAN:Passive
p 96 334 100 0 0 PHAS:0
p 96 302 100 0 0 EVNT:0
p 444 158 100 0 -1 Type:longin
p 212 488 100 0 0 DTYP:Soft Channel
p 96 270 100 0 0 PINI:NO
p 96 110 100 0 0 DISV:1
p 96 238 100 0 0 EGU:volts
p 96 206 100 0 0 HOPR:0
p 96 174 100 0 0 LOPR:0
p 320 366 100 0 0 HIHI:0
p 320 334 100 0 0 LOLO:0
p 320 302 100 0 0 HIGH:0
p 320 270 100 0 0 LOW:0
p 320 238 100 0 0 HHSV:NO_ALARM
p 320 206 100 0 0 HSV:NO_ALARM
p 320 174 100 0 0 LSV:NO_ALARM
p 320 142 100 0 0 LLSV:NO_ALARM
p 96 78 100 0 0 HYST:0
p 96 46 100 0 0 ADEL:0
p 96 14 100 0 0 MDEL:0
p 96 142 100 0 0 DISS:NO_ALARM
p 320 110 100 0 0 PRIO:LOW
p 96 -82 100 0 0 SIMS:NO_ALARM
p 141 441 100 0 0 DESC:long input record
p 96 -82 100 0 0 def(FLNK):0.000000000000000e+00
p 96 -100 100 0 0 typ(FLNK):path
p 96 -132 100 0 0 typ(INP):val
p 96 -164 100 0 0 def(INP):0.000000000000000e+00
p 96 -196 100 0 0 def(SDIS):0.000000000000000e+00
p 96 -228 100 0 0 typ(SDIS):path
p 96 -228 100 0 0 pproc(SDIS):NPP
p 96 -228 100 0 0 palrm(SDIS):NMS
p 366 196 100 0 -1 username(U0):FLD0
p 96 -292 100 0 0 typ(U0):val
p 366 164 100 0 -1 username(U1):FLD1
p 96 -356 100 0 0 typ(U1):val
p 550 196 100 0 -1 username(U2):FLD2
p 96 -420 100 0 0 typ(U2):val
p 550 164 100 0 -1 username(U3):FLD3
p 96 -484 100 0 0 typ(U3):val
p 96 -516 100 0 0 pproc(SIML):NPP
p 96 -548 100 0 0 palrm(SIML):NMS
p 96 -580 100 0 0 def(SIML):0.000000000000000e+00
p 96 -612 100 0 0 typ(SIML):path
p 96 -644 100 0 0 pproc(SIOL):NPP
p 96 -676 100 0 0 palrm(SIOL):NMS
p 96 -708 100 0 0 def(SIOL):0.000000000000000e+00
p 96 -740 100 0 0 typ(SIOL):path
p 304 256 100 1024 0 name:$(top)$(I)
[layers]
<symbol>
v 0 544 192
608 192
_
v 0 544 160
608 160
_
v 0 416 288
416 32
512 32
544 64
544 256
512 288
416 288
_
v 0 352 96
416 96
_
v 0 352 64
416 64
_
v 0 352 128
416 128
_
v 0 352 160
416 160
_
v 0 352 192
416 192
_
v 0 352 224
416 224
_
v 0 352 256
416 256
_
v 0 544 256
608 256
_
v 0 544 224
608 224
_
[comments]
