N20121216S0214.fits #Acquisition Image
N20121216S0219.fits #Science Target Pairs
N20121216S0220.fits #Science Target Pairs
N20121216S0221.fits #Science Target Pairs
N20121216S0222.fits #Science Target Pairs
N20121216S0206.fits #Standard Star Acquisition Image
N20121216S0207.fits #Standard Star Spectra
N20121216S0208.fits #Standard Star Spectra
N20121216S0209.fits #Standard Star Spectra
N20121216S0210.fits #Standard Star Spectra
N20121216S0223.fits #Arc
N20121216S0224.fits #Arc
N20121216S0225.fits #IR Flats
N20121216S0226.fits #IR Flats
N20121216S0227.fits #IR Flats
N20121216S0228.fits #IR Flats
N20121216S0237.fits #QH Flats
N20121216S0238.fits #QH Flats
N20121216S0239.fits #QH Flats
N20121216S0240.fits #QH Flats
N20121216S0295.fits #Pinhole Flats
