\relax 
\@writefile{toc}{\contentsline {section}{\numberline {1}Introduction}{3}}
\newlabel{intro}{{1}{3}}
\@writefile{lot}{\contentsline {table}{\numberline {1}{\ignorespaces \tnotemarkskip 8ptObservational Setup}}{4}}
\newlabel{obs}{{1}{4}}
\@writefile{toc}{\contentsline {section}{\numberline {2}Code, Access and Requirements}{5}}
\newlabel{get}{{2}{5}}
\@writefile{toc}{\contentsline {subsection}{\numberline {2.1}The Code}{5}}
\@writefile{toc}{\contentsline {subsection}{\numberline {2.2}The Data}{6}}
\newlabel{data_reqs}{{2.2}{6}}
\@writefile{toc}{\contentsline {section}{\numberline {3}Inspecting Your Input Data}{7}}
\newlabel{inspect}{{3}{7}}
\@writefile{toc}{\contentsline {section}{\numberline {4}Running the Pipeline (aka ``if you don't read anything else'')}{7}}
\newlabel{run}{{4}{7}}
\@writefile{toc}{\contentsline {section}{\numberline {5}The Reduction Steps}{9}}
\newlabel{example}{{5}{9}}
\@writefile{toc}{\contentsline {subsection}{\numberline {5.1}Identifying the Input Files (Step=0)}{10}}
\newlabel{id}{{5.1}{10}}
\@writefile{toc}{\contentsline {subsection}{\numberline {5.2}Pattern Noise Cleaning (Step=1)}{11}}
\newlabel{clean}{{5.2}{11}}
\@writefile{toc}{\contentsline {subsubsection}{\numberline {5.2.1}Example: NGC 3031}{12}}
\newlabel{clean_example}{{5.2.1}{12}}
\@writefile{toc}{\contentsline {subsection}{\numberline {5.3}Preparing the Data (Step=2)}{12}}
\newlabel{nsprepare}{{5.3}{12}}
\@writefile{lof}{\contentsline {figure}{\numberline {1}{\ignorespaces  \relax \fontsize  {10}{12}\selectfont  \abovedisplayskip 10\p@ plus2\p@ minus5\p@ \abovedisplayshortskip \z@ plus3\p@ \belowdisplayshortskip 6\p@ plus3\p@ minus3\p@ \def \leftmargin \leftmargini \parsep 5\p@ plus2.5\p@ minus\p@ \topsep 10\p@ plus4\p@ minus6\p@ \itemsep 5\p@ plus2.5\p@ minus\p@ {\leftmargin \leftmargini \topsep 6\p@ plus2\p@ minus2\p@ \parsep 3\p@ plus2\p@ minus\p@ \itemsep \parsep }\belowdisplayskip \abovedisplayskip File N20120305S0067 (left) contains some fairly low-level electronic striping which the cleanir script effectively removes (right). The data also show a couple of ``tachyons'' (bloblike artefacts that often appear after GNIRS has been cooled to operating temperature), and ``radiation events'', cosmic ray-like hits resulting from radioactive camera lens coatings. These lenses were replaced in mid-2012. Display files N20120305S0067 and cN20120305S0067 with z1=-5 and z2=5 to reproduce this figure and inspect the data.}}{13}}
\newlabel{pattern}{{1}{13}}
\@writefile{toc}{\contentsline {subsubsection}{\numberline {5.3.1}Example: NGC 3031}{14}}
\@writefile{lof}{\contentsline {figure}{\numberline {2}{\ignorespaces  \relax \fontsize  {10}{12}\selectfont  \abovedisplayskip 10\p@ plus2\p@ minus5\p@ \abovedisplayshortskip \z@ plus3\p@ \belowdisplayshortskip 6\p@ plus3\p@ minus3\p@ \def \leftmargin \leftmargini \parsep 5\p@ plus2.5\p@ minus\p@ \topsep 10\p@ plus4\p@ minus6\p@ \itemsep 5\p@ plus2.5\p@ minus\p@ {\leftmargin \leftmargini \topsep 6\p@ plus2\p@ minus2\p@ \parsep 3\p@ plus2\p@ minus\p@ \itemsep \parsep }\belowdisplayskip \abovedisplayskip Left: file rncN20120305S0067[sci,2]. This is extension 2/order 4 of an on-source galaxy spectrum after the orders have been ``cut'' into separate extensions by nsreduce. Right: rncN20120305S0074[sci,2], ext 2/order 4 of a quartz halogen flat file after the cutting. Display these files with z1=-20 and z2=20 to reproduce this figure.}}{15}}
\newlabel{cut}{{2}{15}}
\@writefile{toc}{\contentsline {subsection}{\numberline {5.4}Making the Flatfield (Step=3)}{16}}
\newlabel{nsflat}{{5.4}{16}}
\@writefile{toc}{\contentsline {subsubsection}{\numberline {5.4.1}Example: NGC 3031}{17}}
\@writefile{toc}{\contentsline {subsection}{\numberline {5.5}Reducing the Science Target and Standard Star Data (Step=4)}{17}}
\newlabel{nsreduce}{{5.5}{17}}
\@writefile{lof}{\contentsline {figure}{\numberline {3}{\ignorespaces  \relax \fontsize  {10}{12}\selectfont  \abovedisplayskip 10\p@ plus2\p@ minus5\p@ \abovedisplayshortskip \z@ plus3\p@ \belowdisplayshortskip 6\p@ plus3\p@ minus3\p@ \def \leftmargin \leftmargini \parsep 5\p@ plus2.5\p@ minus\p@ \topsep 10\p@ plus4\p@ minus6\p@ \itemsep 5\p@ plus2.5\p@ minus\p@ {\leftmargin \leftmargini \topsep 6\p@ plus2\p@ minus2\p@ \parsep 3\p@ plus2\p@ minus\p@ \itemsep \parsep }\belowdisplayskip \abovedisplayskip MasterFlat.fits, displayed using the {\bf  nxdisplay} task.}}{18}}
\newlabel{flat}{{3}{18}}
\@writefile{toc}{\contentsline {subsubsection}{\numberline {5.5.1}Example: NGC 3031}{20}}
\newlabel{despike}{{5.5.1}{20}}
\@writefile{lof}{\contentsline {figure}{\numberline {4}{\ignorespaces  \relax \fontsize  {10}{12}\selectfont  \abovedisplayskip 10\p@ plus2\p@ minus5\p@ \abovedisplayshortskip \z@ plus3\p@ \belowdisplayshortskip 6\p@ plus3\p@ minus3\p@ \def \leftmargin \leftmargini \parsep 5\p@ plus2.5\p@ minus\p@ \topsep 10\p@ plus4\p@ minus6\p@ \itemsep 5\p@ plus2.5\p@ minus\p@ {\leftmargin \leftmargini \topsep 6\p@ plus2\p@ minus2\p@ \parsep 3\p@ plus2\p@ minus\p@ \itemsep \parsep }\belowdisplayskip \abovedisplayskip On-source galaxy spectrum, before (left, ncN20120305S0067) and after (right, lncN20120305S0067) radiation event ``cleaning''.}}{20}}
\newlabel{radevent}{{4}{20}}
\@writefile{lof}{\contentsline {figure}{\numberline {5}{\ignorespaces  \relax \fontsize  {10}{12}\selectfont  \abovedisplayskip 10\p@ plus2\p@ minus5\p@ \abovedisplayshortskip \z@ plus3\p@ \belowdisplayshortskip 6\p@ plus3\p@ minus3\p@ \def \leftmargin \leftmargini \parsep 5\p@ plus2.5\p@ minus\p@ \topsep 10\p@ plus4\p@ minus6\p@ \itemsep 5\p@ plus2.5\p@ minus\p@ {\leftmargin \leftmargini \topsep 6\p@ plus2\p@ minus2\p@ \parsep 3\p@ plus2\p@ minus\p@ \itemsep \parsep }\belowdisplayskip \abovedisplayskip The radiation event mask, ``bgmskN20120305S0067.pl'' created for file 67 using the default value of tgt\_thresh (left), and tgt\_thresh=5 (right). With the lower value of tgt\_thresh, signal from the galaxy has been erroneously flagged as radiation events.}}{21}}
\newlabel{masks}{{5}{21}}
\@writefile{toc}{\contentsline {subsection}{\numberline {5.6}S-distortion Correction and Wavelength Calibration (Step=5)}{21}}
\newlabel{nssdist}{{5.6}{21}}
\@writefile{lof}{\contentsline {figure}{\numberline {6}{\ignorespaces  \relax \fontsize  {10}{12}\selectfont  \abovedisplayskip 10\p@ plus2\p@ minus5\p@ \abovedisplayshortskip \z@ plus3\p@ \belowdisplayshortskip 6\p@ plus3\p@ minus3\p@ \def \leftmargin \leftmargini \parsep 5\p@ plus2.5\p@ minus\p@ \topsep 10\p@ plus4\p@ minus6\p@ \itemsep 5\p@ plus2.5\p@ minus\p@ {\leftmargin \leftmargini \topsep 6\p@ plus2\p@ minus2\p@ \parsep 3\p@ plus2\p@ minus\p@ \itemsep \parsep }\belowdisplayskip \abovedisplayskip Left: close-up of the data shown in Figure 4\hbox {}, after removal of radiation events (lncN20120305S0067; z1=-5, z2=75). Right: extension 6/order 8 of the same file after sky subtraction (rlncN20120305S0067; z1=-5, z2=75). The green circle identifies the same pixels of extension 6/order 8 in each case, for orientation.}}{22}}
\newlabel{reduced}{{6}{22}}
\@writefile{toc}{\contentsline {subsubsection}{\numberline {5.6.1}Example: NGC 3031}{23}}
\@writefile{lof}{\contentsline {figure}{\numberline {7}{\ignorespaces  \relax \fontsize  {10}{12}\selectfont  \abovedisplayskip 10\p@ plus2\p@ minus5\p@ \abovedisplayshortskip \z@ plus3\p@ \belowdisplayshortskip 6\p@ plus3\p@ minus3\p@ \def \leftmargin \leftmargini \parsep 5\p@ plus2.5\p@ minus\p@ \topsep 10\p@ plus4\p@ minus6\p@ \itemsep 5\p@ plus2.5\p@ minus\p@ {\leftmargin \leftmargini \topsep 6\p@ plus2\p@ minus2\p@ \parsep 3\p@ plus2\p@ minus\p@ \itemsep \parsep }\belowdisplayskip \abovedisplayskip Extension1/order3 before and after transforming (files rlncN20120305S0067, ttfrlncN20120305S0067; z1=0, z2=200).}}{24}}
\newlabel{trans}{{7}{24}}
\@writefile{toc}{\contentsline {subsection}{\numberline {5.7}Combining the Files (Step=6)}{24}}
\newlabel{combine}{{5.7}{24}}
\@writefile{lof}{\contentsline {figure}{\numberline {8}{\ignorespaces  \relax \fontsize  {10}{12}\selectfont  \abovedisplayskip 10\p@ plus2\p@ minus5\p@ \abovedisplayshortskip \z@ plus3\p@ \belowdisplayshortskip 6\p@ plus3\p@ minus3\p@ \def \leftmargin \leftmargini \parsep 5\p@ plus2.5\p@ minus\p@ \topsep 10\p@ plus4\p@ minus6\p@ \itemsep 5\p@ plus2.5\p@ minus\p@ {\leftmargin \leftmargini \topsep 6\p@ plus2\p@ minus2\p@ \parsep 3\p@ plus2\p@ minus\p@ \itemsep \parsep }\belowdisplayskip \abovedisplayskip As for Figure 7\hbox {}, but for extension 6/order 8.}}{25}}
\newlabel{trans6}{{8}{25}}
\@writefile{toc}{\contentsline {subsubsection}{\numberline {5.7.1}Example: NGC 3031}{25}}
\@writefile{lof}{\contentsline {figure}{\numberline {9}{\ignorespaces  \relax \fontsize  {10}{12}\selectfont  \abovedisplayskip 10\p@ plus2\p@ minus5\p@ \abovedisplayshortskip \z@ plus3\p@ \belowdisplayshortskip 6\p@ plus3\p@ minus3\p@ \def \leftmargin \leftmargini \parsep 5\p@ plus2.5\p@ minus\p@ \topsep 10\p@ plus4\p@ minus6\p@ \itemsep 5\p@ plus2.5\p@ minus\p@ {\leftmargin \leftmargini \topsep 6\p@ plus2\p@ minus2\p@ \parsep 3\p@ plus2\p@ minus\p@ \itemsep \parsep }\belowdisplayskip \abovedisplayskip Extension 1/order 3 of the combined galaxy and standard star data sets (target\_comb, standard\_comb).}}{26}}
\newlabel{comb}{{9}{26}}
\@writefile{toc}{\contentsline {subsection}{\numberline {5.8}Extracting the Spectra (Step=7)}{26}}
\newlabel{extract}{{5.8}{26}}
\@writefile{lof}{\contentsline {figure}{\numberline {10}{\ignorespaces  \relax \fontsize  {10}{12}\selectfont  \abovedisplayskip 10\p@ plus2\p@ minus5\p@ \abovedisplayshortskip \z@ plus3\p@ \belowdisplayshortskip 6\p@ plus3\p@ minus3\p@ \def \leftmargin \leftmargini \parsep 5\p@ plus2.5\p@ minus\p@ \topsep 10\p@ plus4\p@ minus6\p@ \itemsep 5\p@ plus2.5\p@ minus\p@ {\leftmargin \leftmargini \topsep 6\p@ plus2\p@ minus2\p@ \parsep 3\p@ plus2\p@ minus\p@ \itemsep \parsep }\belowdisplayskip \abovedisplayskip Spectra extracted from extension 1/order3 of the standard star (vstandard\_comb.fits, green) and galaxy (vtarget\_comb.fits, white). Most of the features in the spectra are atmospheric absorption bands, although CO band heads appear to be present in the galaxy spectrum from about 2.3 $\mu $m.}}{28}}
\newlabel{specs}{{10}{28}}
\@writefile{toc}{\contentsline {subsubsection}{\numberline {5.8.1}Example: NGC 3031}{28}}
\@writefile{toc}{\contentsline {subsection}{\numberline {5.9}H Line Removal (Step=8)}{28}}
\newlabel{hlines}{{5.9}{28}}
\@writefile{toc}{\contentsline {subsubsection}{\numberline {5.9.1}Example: NGC 3031}{30}}
\@writefile{toc}{\contentsline {subsection}{\numberline {5.10}Telluric Line Cancellation (Step=9)}{30}}
\newlabel{telluric}{{5.10}{30}}
\@writefile{lof}{\contentsline {figure}{\numberline {11}{\ignorespaces  \relax \fontsize  {10}{12}\selectfont  \abovedisplayskip 10\p@ plus2\p@ minus5\p@ \abovedisplayshortskip \z@ plus3\p@ \belowdisplayshortskip 6\p@ plus3\p@ minus3\p@ \def \leftmargin \leftmargini \parsep 5\p@ plus2.5\p@ minus\p@ \topsep 10\p@ plus4\p@ minus6\p@ \itemsep 5\p@ plus2.5\p@ minus\p@ {\leftmargin \leftmargini \topsep 6\p@ plus2\p@ minus2\p@ \parsep 3\p@ plus2\p@ minus\p@ \itemsep \parsep }\belowdisplayskip \abovedisplayskip Standard star spectrum (extension 2/order 4) followed by the science target spectrum, a Vega model spectrum, and the standard star spectrum with the H absorption lines removed.. }}{31}}
\newlabel{lines}{{11}{31}}
\@writefile{lof}{\contentsline {figure}{\numberline {12}{\ignorespaces  \relax \fontsize  {10}{12}\selectfont  \abovedisplayskip 10\p@ plus2\p@ minus5\p@ \abovedisplayshortskip \z@ plus3\p@ \belowdisplayshortskip 6\p@ plus3\p@ minus3\p@ \def \leftmargin \leftmargini \parsep 5\p@ plus2.5\p@ minus\p@ \topsep 10\p@ plus4\p@ minus6\p@ \itemsep 5\p@ plus2.5\p@ minus\p@ {\leftmargin \leftmargini \topsep 6\p@ plus2\p@ minus2\p@ \parsep 3\p@ plus2\p@ minus\p@ \itemsep \parsep }\belowdisplayskip \abovedisplayskip Extension 3/order 5 of the NGC 3031 spectrum, before and after (green) the automatic telluric cancellation. }}{32}}
\newlabel{starlines}{{12}{32}}
\@writefile{toc}{\contentsline {subsubsection}{\numberline {5.10.1}Example: NGC 3031}{32}}
\@writefile{toc}{\contentsline {subsection}{\numberline {5.11}Flux Calibration (Step=10)}{32}}
\newlabel{flux}{{5.11}{32}}
\@writefile{lof}{\contentsline {figure}{\numberline {13}{\ignorespaces  \relax \fontsize  {10}{12}\selectfont  \abovedisplayskip 10\p@ plus2\p@ minus5\p@ \abovedisplayshortskip \z@ plus3\p@ \belowdisplayshortskip 6\p@ plus3\p@ minus3\p@ \def \leftmargin \leftmargini \parsep 5\p@ plus2.5\p@ minus\p@ \topsep 10\p@ plus4\p@ minus6\p@ \itemsep 5\p@ plus2.5\p@ minus\p@ {\leftmargin \leftmargini \topsep 6\p@ plus2\p@ minus2\p@ \parsep 3\p@ plus2\p@ minus\p@ \itemsep \parsep }\belowdisplayskip \abovedisplayskip Extension 3/order 5 of the NGC 3031 spectrum, before (green) and after flux calibration. }}{34}}
\newlabel{fcal}{{13}{34}}
\@writefile{toc}{\contentsline {subsubsection}{\numberline {5.11.1}Example: NGC 3031}{34}}
\@writefile{toc}{\contentsline {subsection}{\numberline {5.12}Combining the Orders (Step=11)}{34}}
\newlabel{telluric}{{5.12}{34}}
\@writefile{toc}{\contentsline {subsubsection}{\numberline {5.12.1}Example: NGC 3031}{36}}
\@writefile{toc}{\contentsline {subsection}{\numberline {5.13}Generating an Error Spectrum (Step=12)}{36}}
\@writefile{toc}{\contentsline {subsection}{\numberline {5.14}Science Target Data Sheets (Step=13)}{36}}
\newlabel{record}{{5.14}{36}}
\@writefile{lof}{\contentsline {figure}{\numberline {14}{\ignorespaces  \relax \fontsize  {10}{12}\selectfont  \abovedisplayskip 10\p@ plus2\p@ minus5\p@ \abovedisplayshortskip \z@ plus3\p@ \belowdisplayshortskip 6\p@ plus3\p@ minus3\p@ \def \leftmargin \leftmargini \parsep 5\p@ plus2.5\p@ minus\p@ \topsep 10\p@ plus4\p@ minus6\p@ \itemsep 5\p@ plus2.5\p@ minus\p@ {\leftmargin \leftmargini \topsep 6\p@ plus2\p@ minus2\p@ \parsep 3\p@ plus2\p@ minus\p@ \itemsep \parsep }\belowdisplayskip \abovedisplayskip The ``orders.pdf'' file generated for NGC\nobreakspace  {}3031.}}{37}}
\newlabel{orders}{{14}{37}}
\@writefile{toc}{\contentsline {subsubsection}{\numberline {5.14.1}Example: NGC 3031}{37}}
\@writefile{lof}{\contentsline {figure}{\numberline {15}{\ignorespaces  \relax \fontsize  {10}{12}\selectfont  \abovedisplayskip 10\p@ plus2\p@ minus5\p@ \abovedisplayshortskip \z@ plus3\p@ \belowdisplayshortskip 6\p@ plus3\p@ minus3\p@ \def \leftmargin \leftmargini \parsep 5\p@ plus2.5\p@ minus\p@ \topsep 10\p@ plus4\p@ minus6\p@ \itemsep 5\p@ plus2.5\p@ minus\p@ {\leftmargin \leftmargini \topsep 6\p@ plus2\p@ minus2\p@ \parsep 3\p@ plus2\p@ minus\p@ \itemsep \parsep }\belowdisplayskip \abovedisplayskip }}{38}}
\newlabel{final}{{15}{38}}
\@writefile{toc}{\contentsline {section}{\numberline {6}What to look for}{38}}
\@writefile{lof}{\contentsline {figure}{\numberline {16}{\ignorespaces  \relax \fontsize  {10}{12}\selectfont  \abovedisplayskip 10\p@ plus2\p@ minus5\p@ \abovedisplayshortskip \z@ plus3\p@ \belowdisplayshortskip 6\p@ plus3\p@ minus3\p@ \def \leftmargin \leftmargini \parsep 5\p@ plus2.5\p@ minus\p@ \topsep 10\p@ plus4\p@ minus6\p@ \itemsep 5\p@ plus2.5\p@ minus\p@ {\leftmargin \leftmargini \topsep 6\p@ plus2\p@ minus2\p@ \parsep 3\p@ plus2\p@ minus\p@ \itemsep \parsep }\belowdisplayskip \abovedisplayskip The ``data sheet'' generated for NGC\nobreakspace  {}3031. The dashed blue line is a model Vega spectrum, intended to point out the locations where imperfectly removed lines in the standard star could be mistaken for real features. The ``messy'' regions around 1.4 and 1.8 $\mu $m correspond to areas of of low atmospheric transmission.}}{39}}
\newlabel{data}{{16}{39}}
\@writefile{toc}{\contentsline {section}{\numberline {7}Usage/Syntax Examples}{39}}
\@writefile{toc}{\contentsline {section}{\numberline {8}Troubleshooting, Support, and Acknowledgment}{40}}
\newlabel{trouble}{{8}{40}}
\@writefile{toc}{\contentsline {section}{\numberline {9}History}{40}}
\@writefile{toc}{\contentsline {section}{\numberline {10}Wishlist}{40}}
\bibstyle{/Users/rmason/aastex52/apj}
\bibdata{/Users/rmason/aastex52/refs}
