https://archive.gemini.edu/file/N20111127S0092.fits
https://archive.gemini.edu/file/N20111127S0101.fits
https://archive.gemini.edu/file/N20111127S0102.fits
https://archive.gemini.edu/file/N20111127S0103.fits
https://archive.gemini.edu/file/N20111127S0104.fits
https://archive.gemini.edu/file/N20111127S0105.fits
https://archive.gemini.edu/file/N20111127S0106.fits
https://archive.gemini.edu/file/N20111127S0107.fits
https://archive.gemini.edu/file/N20111127S0108.fits
https://archive.gemini.edu/file/N20111127S0109.fits
https://archive.gemini.edu/file/N20111127S0110.fits
https://archive.gemini.edu/file/N20111127S0119.fits
https://archive.gemini.edu/file/N20111127S0120.fits
https://archive.gemini.edu/file/N20111127S0121.fits
https://archive.gemini.edu/file/N20111127S0122.fits
https://archive.gemini.edu/file/N20111127S0126.fits
https://archive.gemini.edu/file/N20111127S0127.fits
https://archive.gemini.edu/file/N20111127S0128.fits
https://archive.gemini.edu/file/N20111127S0129.fits
https://archive.gemini.edu/file/N20111127S0130.fits
https://archive.gemini.edu/file/N20111127S0172.fits





















