<?xml version="1.0" encoding="utf-8"?>
<!-- Generator: Adobe Illustrator 24.1.2, SVG Export Plug-In . SVG Version: 6.00 Build 0)  -->
<svg version="1.1" id="Layer_1" xmlns="http://www.w3.org/2000/svg" xmlns:xlink="http://www.w3.org/1999/xlink" x="0px" y="0px"
	 viewBox="0 0 662 313" style="enable-background:new 0 0 662 313;" xml:space="preserve">
<style type="text/css">
	.st0{fill-rule:evenodd;clip-rule:evenodd;}
	.st1{fill-rule:evenodd;clip-rule:evenodd;fill:#021976;}
	.st2{fill-rule:evenodd;clip-rule:evenodd;fill:#FFFFFF;}
</style>
<g>
	<path class="st0" d="M94.83,123.05c9.91-0.49,21.34-2.63,31.59-3.6c35.04-3.31,66.47-4.06,101.91-3.11
		c30.71,0.83,63.08,5.24,92.14,13.45c24.64,6.96,53.03,19.52,75.5,30.24c8.04,3.83,15.6,8.1,23.11,12.12
		c10.32,5.52,23.28,13.35,33.1,19.76l21.1,14.13c10.56,7.57,30.18,21.95,39.85,30.61l9.61,8.46l64.89-75.17
		c-1.98-0.58-5.44-2.44-7.61-3.46l-15.33-6.77c-1.96-0.84-6.17-2.91-7.91-3.2c-1.78,2.35-2.65,7.09-9.76,14.49
		c-3.89,4.05-7.86,7.48-13.89,10.59c-17.85,9.22-40.59,6.89-56.01-6.28c-9.19-7.86-15.6-18.43-17.63-31.3
		c-1.59-10.05-0.23-13.42,1.28-22.2c-2.48-0.31-7.53-2.16-10.25-2.93c-55.48-15.71-115.2-27.95-173.24-28.2
		c-48.59-0.21-96.85,4.88-142.81,18.34C127.57,111.04,99.26,119.86,94.83,123.05L94.83,123.05z"/>
	<path class="st1" d="M460.99,121.8c2.78,0.46,20.64,6.39,24.61,7.7c11.06,3.65,25.19,8.45,36.02,12.66c4.02,1.56,8,2.96,11.89,4.53
		L556.9,156c2.56-7.43,4.33-12.93,3.96-22.13c-0.31-7.83-2.47-14.81-5.49-20.96c-5.38-10.92-15.62-20.32-28.21-24.94
		c-14.47-5.31-31.02-3.18-42.85,3.88c-5.79,3.46-10.6,7.56-14.3,12.27C467.07,107.83,462.16,115.87,460.99,121.8L460.99,121.8z"/>
	<path class="st1" d="M265.27,169.14c11.28-0.02,21.94,0.8,21.67,13.12c-0.26,12.01-10.36,13.14-21.69,13.13L265.27,169.14
		L265.27,169.14z M281,204.94c1.24-0.63,3.68-1.16,5.2-1.85c11.94-5.41,16.5-21.53,10.06-33.22c-7.77-14.1-24.28-12.5-43.51-12.5
		l-0.01,82.82h12.51l0-33.91l1.89,0c1.07,0.26,15.19,21.6,18.31,25.73l5.16,8.18h15.71C302.49,234.84,282.94,208.28,281,204.94
		L281,204.94z"/>
	<path class="st1" d="M111.92,208.26l12.88-27.81l12.05,27.86L111.92,208.26L111.92,208.26z M96.93,240.19l9.56-20.11l35.58,0.04
		l8.59,20.08h13.7l-39.33-87.86L84,240.19H96.93L96.93,240.19z"/>
	<path class="st1" d="M336.53,208.26l12.88-27.81l12.05,27.86L336.53,208.26L336.53,208.26z M321.54,240.19l9.56-20.11l35.59,0.04
		l8.59,20.08h13.7l-39.33-87.86l-41.05,87.86H321.54L321.54,240.19z"/>
	<path class="st1" d="M232.74,212.8l0.06-55.35h-12.32c0,8.81,0,17.7,0,26.59c0,2.96,0.56,25.57-0.36,26.18
		c0.6,3.94-1.55,10.42-3.3,12.8c-7.83,10.62-25.99,8.93-30.84-3.22c-2.77-6.94-1.88-22.01-1.88-30.39c0-10.67-0.01-21.34,0-31.97
		h-12.52c0.07,14.5,0.01,29.06,0.01,43.61c0,6.83-0.47,13.97,1.6,20.18c5.93,17.79,26.17,24.96,42.22,17.68
		c2.43-1.1,5.2-2.92,6.74-4.31c1.66-1.49,3.92-3.52,5.21-5.54C230.01,224.98,232.99,219.24,232.74,212.8L232.74,212.8z"/>
	<path class="st2" d="M265.25,195.39c11.33,0,21.43-1.13,21.69-13.13c0.27-12.32-10.39-13.14-21.67-13.12L265.25,195.39
		L265.25,195.39z"/>
</g>
</svg>
