https://archive.gemini.edu/file/N20120123S0052.fits
https://archive.gemini.edu/file/N20120123S0061.fits
https://archive.gemini.edu/file/N20120123S0062.fits
https://archive.gemini.edu/file/N20120123S0063.fits
https://archive.gemini.edu/file/N20120123S0064.fits
https://archive.gemini.edu/file/N20120123S0065.fits
https://archive.gemini.edu/file/N20120123S0066.fits
https://archive.gemini.edu/file/N20120123S0067.fits
https://archive.gemini.edu/file/N20120123S0068.fits
https://archive.gemini.edu/file/N20120123S0077.fits
https://archive.gemini.edu/file/N20120123S0078.fits
https://archive.gemini.edu/file/N20120123S0079.fits
https://archive.gemini.edu/file/N20120123S0080.fits
https://archive.gemini.edu/file/N20120123S0081.fits
https://archive.gemini.edu/file/N20120123S0082.fits
https://archive.gemini.edu/file/N20120123S0086.fits
https://archive.gemini.edu/file/N20120123S0093.fits
https://archive.gemini.edu/file/N20120123S0094.fits
https://archive.gemini.edu/file/N20120123S0095.fits
https://archive.gemini.edu/file/N20120123S0096.fits
https://archive.gemini.edu/file/N20120123S0146.fits

