https://archive.gemini.edu/file/N20110516S0154.fits
https://archive.gemini.edu/file/N20110516S0155.fits
https://archive.gemini.edu/file/N20110516S0156.fits
https://archive.gemini.edu/file/N20110516S0157.fits
https://archive.gemini.edu/file/N20110516S0159.fits
https://archive.gemini.edu/file/N20110516S0181.fits
https://archive.gemini.edu/file/N20110516S0188.fits
https://archive.gemini.edu/file/N20110516S0189.fits
https://archive.gemini.edu/file/N20110516S0161.fits
https://archive.gemini.edu/file/N20110516S0162.fits
https://archive.gemini.edu/file/N20110516S0163.fits
https://archive.gemini.edu/file/N20110516S0172.fits
https://archive.gemini.edu/file/N20110516S0173.fits
https://archive.gemini.edu/file/N20110516S0383.fits
