#CuAr_Line_List: 3094A-10470A
3247.54      Cu_I
3273.962     Cu_I
3307.2283    Ar_II
3350.9243    Ar_II
3376.4359    Ar_II
3388.5309    Ar_II
3464.1272    Ar_II
3476.7474    Ar_II
3478.2324    Ar_II
3480.5055    Ar_II
3491.244     Ar_II
3509.7785    Ar_II
3514.3877    Ar_II
#3519.9936   Unkn-blend
#3521.2601   Unkn-blend
#3521.9781   Unkn-blend
#3535.3196   Ar_II-weak
3545.845     Ar_II
#3548.5144   Ar_II
#3554.3058   Ar_I-weak
#3556.9041   Unkn
#3559.5081   Ar_II-blend
#3561.0304   Ar_II-blend
#3565.0298   Unkn-weak
#3567.6564   Ar_I-weak
3576.6156    Ar_II
3582.3546    Ar_II
3588.4407    Ar_II
3606.5218    Ar_I
3622.1375    Ar_II
#3632.6831   Unkn-weak/blend
3639.8329    Ar_II-blend
3649.8323    Unkn
#3650.8896   Unkn
3655.2782    Ar_II
#3659.5289   Unkn
3660.437     Unkn
#3669.6024   Unkn-blend
#3673.2645   Unkn-weak
3678.2701    Unkn
3680.0609    Unkn
3682.5448    Unkn
#3690.8951   Ar_I-weak/blend
#3706.9302   Unkn-weak
#3709.9088   Unkn
#3714.7337   Unkn
3718.2065    Ar_II
3720.4265    Ar_II-weak
3724.5165    Ar_II
3729.3087    Ar_II
3737.889     Ar_II
3746.4476    Unkn-weak
#3750.4799   Unkn
# 3753.6     Unkn??
#3763.5053   Unkn-weak/blend
3765.27      Ar_II
3770.369     Ar_I
3780.8398    Ar_II
3786.3824    Ar_II
3796.5934    Ar_II
3799.382     Ar_II
3803.1724    Ar_II
3809.4561    Ar_II
#3819.0159   Unkn-weak
#3825.6729   Unkn-blend
#3826.8072   Unkn-blend
3834.6787    Ar_I
3841.5187    Unkn
3845.4055    Unkn
3850.5813    Ar_II
#3856.1382   Unkn-weak
3868.5284    Ar_II
3872.1371    Unkn
3875.2645    Ar_II
3880.3332    Unkn
# 3891.8     Unkn??
3894.66      Unkn-weak
3900.6266    Unkn-weak
#3911.576    Unkn-weak
3914.7675    Ar_II
3925.7188    Ar_II
3928.6233    Ar_II
#3931.2359   Unkn-weak/blend
3932.5466    Ar_II
3944.2717    Unkn
3946.0971    Ar_II 
3947.5046    Ar_I 
3948.9789    Ar_I
3952.7291    Unkn
3958.38      Unkn
# 3961.6     Unkn??
3968.3594    Ar_II
3974.4766    Ar_II
3979.3559    Ar_II
3988.1576    Unkn-weak
3992.0535    Unkn
3994.7918    Ar_II
4005.3628    Unkn
4011.2093    Unkn
4013.8566    Ar_II
4019.8429    Unkn
4022.629     Cu_I-weak
4031.3783    Unkn
4033.8093    Ar_II
4035.46      Ar_II
4038.8043    Unkn
4042.8937    Ar_II
4044.4179    Ar_II
#4047.4815   Unkn_weak+blend
4052.9208    Ar_II
4062.641     Cu_I-weak
4072.0047    Ar_II
4076.6284    Ar_II
#4079.5738   blend
4082.3872    Ar_II
# 4097.2     Unkn??
4099.4563    Unkn_weak
4103.9121    Ar_II
4112.8153    Ar_II
#4116.3753   Unkn_weak
4128.64      Unkn
4131.7235    Ar_II
#4144.2435   Unkn
4156.086     Ar_II
4158.5905    Ar_I
4164.1795    Ar_I
#4168.9682   Unkn-He_I?
4179.2973    Ar_II
4181.8836    Ar_I
4190.713     Ar_I
#4191.0294   Ar_I-blend
4198.317     Ar_I
4200.6745    Ar_I
#4203.4109   Unkn_weak
#4217.4308   Unkn_weak+blend
4222.6373    Ar_II
#4228.158    Ar_II-blend
4229.8696    Unkn
4237.2198    Ar_II
4251.1846    Ar_I
#4255.6034   Unkn
4259.3619    Ar_I
4266.5271    Ar_I+Ar_II
4272.1689    Ar_I
4275.11      Cu I
4277.5282    Ar_II
4282.8976    Ar_II
4297.9645    Unkn
4300.1008    Ar_I
4309.2392    Ar_II
4331.1995    Ar_II
4333.5612    Ar_I
4335.3379    Ar_I
4337.0708    Unkn
4345.168     Ar_I
4348.064     Ar_II
4352.2049    Ar_II
4362.0662    Ar_II
4363.7945    Unkn_weak
4367.8316    Ar_II
4370.7532    Ar_II
4375.9542    Ar_II
4379.6668    Ar_II
4385.0566    Ar_II
#4386.9656   Unkn_weak
#4397.7971   Unkn_weak
#4400.9863    Ar_II-blend
#4404.9022   Unkn_weak
#4406.4704   Unkn_weak
4420.9124  
4426.0011    Ar_II
4430.189     Ar_II
4433.838     Ar_II
4439.4614    Ar_II
#4445.8483   Unkn_weak
4448.8792    Ar_II
4460.5574    Unkn_weak
4474.7594    Ar_II
4481.8107    Ar_II
4490.9816    Ar_II
4498.5384    Ar_II
4502.9268    Unkn
#4507.8339  Unkn_weak
4510.7332    Ar_I
4522.323     Ar_I
4530.5523    Ar_II
#4530.785   weak/blend
4535.4903    Ar_II
4537.6426    Ar_II
4545.0519    Ar_II
4547.7589    Unkn_weak
4564.4054    Ar_II
4564.4054    Ar_II
4579.3495    Ar_II
4589.8978    Ar_II
4596.0967    Ar_I
4598.7627    Ar_II
4609.5673    Ar_II
4628.4409    Ar_I
4637.2328    Ar_II
4651.124     Cu_I
4657.9012    Ar_II
4682.2759    Cu_II
4702.3161    Ar_I
4721.591     Ar_II
4726.8683    Ar_II
4732.0532    Ar_II
4735.9058    Ar_II
4764.8646    Ar_II
4786.1485    Unkn
4792.0819    Unkn
4806.0205    Ar_II
4847.8095    Ar_II
4865.9105    Ar_II
4876.2611    Ar_I
4879.8635    Ar_II
4882.2432    Unkn
4889.0422    Ar_II
4904.7516    Ar_II
4933.2091    Ar_II
4942.9214    Unkn
4965.0795    Ar_II
4972.1597    Ar_II
5009.3344    Ar_II
5017.1628    Ar_II
5062.0371    Ar_II
5090.4951    Ar_II
5105.541     Cu_I
5118.2023    Unkn
5125.7654    Unkn
5141.7827    Ar_II
5145.3083    Ar_II
5151.3907    Ar_I
5153.235     Cu_I
5162.2846    Ar_I
5165.7728    Ar_II
5187.7462    Ar_I
5218.202     Cu_I
5221.271     Ar_I
5245.3781    Unkn
5254.4648    Unkn
5264.7824    Unkn
5305.688     Unkn
5311.9787    Unkn
5373.4943    Ar_I
5384.3753    Unkn
5393.5995    Unkn
#5393.9719    Ar_I
5397.516     Unkn
5402.6048    Unkn
5410.473     Ar_I
5421.3517    Ar_I
5439.9891    Unkn
5451.652     Ar_I
5457.4157    Unkn
5467.1704    Ar_I
5473.4516    Ar_I
5490.1194    Unkn
5495.8738    Ar_I
5498.1841    Unkn
5506.1128    Ar_I
5514.376     Unkn
5519.3436    Unkn
5524.957     Ar_I
5545.0495    Unkn
5554.0       Unkn
5558.702     Ar_I
5572.5413    Ar_I
5577.6845    Unkn
5581.8714    Unkn
5588.72      Ar_I
5597.4756    Ar_I
5601.1216    Unkn
5606.733     Ar_I
5641.3751    Unkn
5648.6863    Unkn
5650.7043    Ar_I
5654.4566    Unkn
5659.1272    Unkn
5681.9001    Ar_I
5691.6612    Unkn
5700.24      Cu_I
5739.5196    Ar_I
5743.2755    Unkn
5756.5983    Unkn
5772.1143    Ar_I
5774.0087    Unkn
5782.132     Cu_I
5783.536     Ar_I
5786.5553    Unkn
5802.0798    Unkn
5812.7592    Unkn
5828.0739    Unkn
5834.2633    Ar_I
5843.7775    Unkn
5860.3103    Ar_I
5882.6242    Ar_I
5888.5841    Ar_I
5912.0853    Ar_I
5916.5992    Unkn
5928.813     Ar_I
5942.6686    Ar_I
5949.2583    Unkn
5964.4723    Unkn
5968.3199    Unkn
5971.6008    Unkn
5981.9239    Unkn
5987.3016    Ar_I
5998.9987    Ar_I
6005.7242    Unkn
6013.6777    Unkn
6025.15      Ar_I
6032.1274    Ar_I
6043.2233    Ar_I
6046.8977    Unkn
6052.7229    Ar_I
6059.3725    Ar_I
6064.7508    Unkn
6081.2433    Unkn
6085.8797    Unkn
6090.7848    Unkn
6098.8031    Ar_I
6101.1615    Unkn
6105.6351    Ar_I
6114.9234    Ar_II
6119.6565    Unkn
6123.3619    Unkn
6138.6559    Unkn
6145.4411    Ar_I
6155.2385    Ar_I
6165.1232    Unkn
6170.174     Ar_I
6172.2778    Ar_II
6201.1002    Unkn
6212.5031    Ar_I
6215.9383    Ar_I
6243.1201    Ar_II
6248.4055    Unkn
6296.8722    Ar_I
6307.657     Ar_I
6364.8937    Unkn
6369.5748    Ar_I
6384.7169    Ar_I
6416.3071    Ar_I
6431.555     Unkn
6437.6003    Unkn
6441.8994    Unkn
6443.8598    Unkn
6466.5526    Unkn
6481.437     Cu_II
6483.0825    Ar_II
6538.112     Ar_I
6604.8534    Ar_I
6638.221     Ar_II
6639.74      Ar_II
6643.6976    Ar_II
6660.6761    Ar_I
6664.051     Ar_I
6666.359     Ar_II
6677.2817    Ar_I
6684.2929    Ar_II
6719.2184    Unkn
6752.8335    Ar_I
6756.163     Ar_I
6766.6117    Ar_I
6827.2488    Unkn
6861.2688    Ar_II
6871.2891    Ar_I
6879.5824    Ar_I
6925.0094    Unkn
6937.6642    Ar_I
6951.4776    Ar_I
6965.4307    Ar_I
6992.2126    Unkn
7030.2514    Ar_I
7067.2181    Ar_I
7086.7044    Unkn
7107.4778    Ar_I
7125.82      Ar_I
7147.0416    Ar_I
7158.8387    Ar_I
7206.9804    Ar_I
7229.9386    Unkn
7233.5365    Unkn
7265.1724    Ar_I
7270.664     Ar_I
7272.9359    Ar_I
7285.4437    Unkn
7311.7159    Ar_I
7316.005     Ar_I
7350.814     Ar_I
7353.293     Ar_I
7372.1184    Ar_I
7383.9805    Ar_I
7392.9801    Ar_I
7412.3368    Ar_I
7425.2942    Ar_I
7435.368     Ar_I   
7471.1641    Unkn
7484.3267    Unkn
7503.8691    Ar_I
7514.6518    Ar_I
7618.3443    Unkn
7635.106     Ar_I
7704.8169    Unkn
7724.2072    Ar_I
7798.5604    Unkn
7814.323     Unkn
7861.91      Unkn
7891.075     Ar_I
7916.442     Unkn
7948.1764    Ar_I
8006.1567    Ar_I
8014.7857    Ar_I
8037.2183    Unkn
8046.1169    Unkn
8053.3085    Ar_I
8103.6931    Ar_I
8115.311     Ar_I
8264.5225    Ar_I
8384.724     Unkn
8392.27      Ar_I
8408.2096    Ar_I
8424.6475    Ar_I
8521.4422    Ar_I
8605.7762    Ar_I
8620.4602    Ar_I
8667.9442    Ar_I
8761.6862    Unkn
8799.0875    Unkn
8849.91      Ar_I
9075.394     Ar_I
9122.9674    Ar_I
9194.6385    Ar_I
9224.4992    Ar_I
9291.5313    Ar_I
9354.2198    Ar_I
9453.7366    Ar_II(2)
9471.8116    Ar_II(2)
9529.7292    Ar_II(2)
9657.7863    Ar_I
9784.5028    Ar_I
9866.4182    Ar_II(2)
9906.3907    Unkn
9930.159     Ar_II(2)
10018.6688   Ar_II(2)
10034.3256   Ar_II(2)
10052.06     Ar_I
10124.0742  Ar_II(2)
10180.9902  Ar_II(2)
10283.5654  Ar_II(2)
10290.6166  Ar_II(2)
10302.7814  Ar_I(2)
10324.5692  Ar_II(2)
10375.4924  Ar_I(2)
10442.542   Ar_I(2)
10467.177   Ar_II
10470.054   Ar_I
10478.034   Ar_I
10506.5     Ar_I
