\relax 
\newlabel{wcs}{{14}{16}}
\@writefile{toc}{\contentsline {section}{\numberline {14}Astrometric}{16}}
\@writefile{toc}{\contentsline {subsection}{\numberline {14.1}Photometric Calibration}{17}}
\@writefile{toc}{\contentsline {subsection}{\numberline {14.2}Astrometric Calibration}{18}}
\@setckpt{wcs}{
\setcounter{page}{19}
\setcounter{equation}{0}
\setcounter{enumi}{0}
\setcounter{enumii}{0}
\setcounter{enumiii}{0}
\setcounter{enumiv}{0}
\setcounter{footnote}{0}
\setcounter{mpfootnote}{0}
\setcounter{part}{0}
\setcounter{section}{14}
\setcounter{subsection}{2}
\setcounter{subsubsection}{0}
\setcounter{paragraph}{0}
\setcounter{subparagraph}{0}
\setcounter{figure}{0}
\setcounter{table}{0}
\setcounter{NAT@ctr}{0}
}
