\relax 
\@writefile{toc}{\contentsline {section}{Introduction}{1}}
\@writefile{toc}{\contentsline {section}{\numberline {1}The Calibration Model}{1}}
\newlabel{O}{{1}{1}}
\newlabel{R}{{4}{2}}
\newlabel{L}{{5}{2}}
\newlabel{F'}{{6}{2}}
\newlabel{F''}{{7}{2}}
\newlabel{calmodels}{{8}{2}}
\newlabel{stdcalmodel}{{9}{2}}
\newlabel{calmodel}{{10}{3}}
\@writefile{toc}{\contentsline {section}{\numberline {2}Calibration Algorithms}{3}}
\@writefile{toc}{\contentsline {subsection}{\numberline {2.1}Dark Energy Camera}{3}}
\@writefile{lof}{\contentsline {figure}{\numberline {1}{\ignorespaces NOAO DECam - Dark sky stacks in u (left) and z (right). The g filter also has a comparable pattern but not other filters. The data was calibrated just with dome flat fields which were not gain corrected. In addition to illustrating the size and amplitude of the pattern it also demonstrates that the amplitude in dome flats is not such as to "flat field" the pattern away. The bright spot at the center of the u filter is a different effect which is still not well understood. }}{4}}
\newlabel{DECam1}{{1}{4}}
\newlabel{starflat}{{11}{4}}
\@writefile{toc}{\contentsline {subsection}{\numberline {2.2}Mosaic Imager}{5}}
\@writefile{lof}{\contentsline {figure}{\numberline {2}{\ignorespaces NOAO MOSAIC - On the left is a raw exposure (Bw filter). A dome would be similar without the sources. In the middle is the calibrated version after a pattern corrected dome flat was applied and the background pattern removed. On the left is the pattern extracted from a dark sky stack of a number of exposures. }}{5}}
\newlabel{Mosaic1}{{2}{5}}
\@writefile{toc}{\contentsline {subsection}{\numberline {2.3}One Degree Imager}{7}}
\@writefile{lof}{\contentsline {figure}{\numberline {3}{\ignorespaces WIYN ODI - The pupil pattern seen in the 4 central OTAs of ODI. This was extracted using the ratio of g-band exposures between the stronger layer and the weaker, more diffuse layer. There are two bad cells visible. }}{7}}
\newlabel{ODI1}{{3}{7}}
