\relax 
\newlabel{rsp}{{17}{29}}
\@writefile{toc}{\contentsline {section}{\numberline {17}Astrometric Transformations}{29}}
\newlabel{rsptan}{{17.1}{29}}
\@writefile{toc}{\contentsline {subsection}{\numberline {17.1}Setting a Common Sampling}{29}}
\newlabel{rsprsp}{{17.2}{30}}
\@writefile{toc}{\contentsline {subsection}{\numberline {17.2}Resampling Images}{30}}
\newlabel{mosaic}{{18}{31}}
\@writefile{toc}{\contentsline {section}{\numberline {18}Mosaicking}{31}}
\@setckpt{rsp}{
\setcounter{page}{32}
\setcounter{equation}{0}
\setcounter{enumi}{0}
\setcounter{enumii}{0}
\setcounter{enumiii}{0}
\setcounter{enumiv}{0}
\setcounter{footnote}{0}
\setcounter{mpfootnote}{0}
\setcounter{part}{0}
\setcounter{section}{18}
\setcounter{subsection}{0}
\setcounter{subsubsection}{0}
\setcounter{paragraph}{0}
\setcounter{subparagraph}{0}
\setcounter{figure}{3}
\setcounter{table}{0}
\setcounter{NAT@ctr}{0}
}
