\relax 
\@writefile{toc}{\contentsline {section}{\numberline {20}Photometric Uniformity}{36}}
\newlabel{dq}{{21}{36}}
\@writefile{toc}{\contentsline {section}{\numberline {21}Data Quality Characterization}{36}}
\newlabel{mdp}{{22}{37}}
\@writefile{toc}{\contentsline {section}{\numberline {22}Data Products}{37}}
\@setckpt{old}{
\setcounter{page}{39}
\setcounter{equation}{0}
\setcounter{enumi}{0}
\setcounter{enumii}{0}
\setcounter{enumiii}{0}
\setcounter{enumiv}{0}
\setcounter{footnote}{0}
\setcounter{mpfootnote}{0}
\setcounter{part}{0}
\setcounter{section}{22}
\setcounter{subsection}{0}
\setcounter{subsubsection}{0}
\setcounter{paragraph}{0}
\setcounter{subparagraph}{0}
\setcounter{figure}{6}
\setcounter{table}{0}
\setcounter{NAT@ctr}{0}
}
