\relax 
\@input{intro.aux}
\@input{datasets.aux}
\@input{cm.aux}
\@input{dirverify.aux}
\@input{xt.aux}
\@input{overscan.aux}
\@input{masks.aux}
\@input{satbleed.aux}
\@input{interp.aux}
\@input{zero.aux}
\@input{dflat.aux}
\@input{dunits.aux}
\@input{wcs.aux}
\@input{skycal.aux}
\@input{rsp.aux}
\@input{stk.aux}
\@input{old.aux}
\@input{references.aux}
\global\NAT@numberstrue
