\relax 
\newlabel{stk}{{19}{32}}
\@writefile{toc}{\contentsline {section}{\numberline {19}Overlap Stacking}{32}}
\@writefile{toc}{\contentsline {subsection}{\numberline {19.1}Missing vs Bad Data}{32}}
\@writefile{lof}{\contentsline {figure}{\numberline {4}{\ignorespaces  Large region of a Mosaic dither stack using masktype="goodvalue" showing how bad pixels associated with the bright stars result in no overlap data: a) output image has blank values of zero, b) output mask has values of 1 overlayed as red. The "ticks" at the left and bottom are incomplete filling of the gaps by the dither. }}{34}}
\@writefile{lof}{\contentsline {figure}{\numberline {5}{\ignorespaces  The same stack as the previous figure but using masktype="novalue": a) output image with pixels filled in by combined interpolated values, b) overlaid output mask with values of 1 (red) for no data and 2 (green) for interpolated values. }}{34}}
\@writefile{lof}{\contentsline {figure}{\numberline {6}{\ignorespaces  A blow-up of previous figure showing edge overlap effects and the remnant of the bleed trail when one input exposure did not have the bright star and, hence, no trail. The exposure mask identifies this region of low significance. }}{35}}
\@setckpt{stk}{
\setcounter{page}{36}
\setcounter{equation}{0}
\setcounter{enumi}{0}
\setcounter{enumii}{0}
\setcounter{enumiii}{0}
\setcounter{enumiv}{0}
\setcounter{footnote}{0}
\setcounter{mpfootnote}{0}
\setcounter{part}{0}
\setcounter{section}{19}
\setcounter{subsection}{1}
\setcounter{subsubsection}{0}
\setcounter{paragraph}{0}
\setcounter{subparagraph}{0}
\setcounter{figure}{6}
\setcounter{table}{0}
\setcounter{NAT@ctr}{0}
}
