\contentsline {section}{Purpose of this Document}{2}
\contentsline {section}{\numberline {1}Introduction}{2}
\contentsline {section}{\numberline {2}PSA and PSQDB}{3}
\contentsline {section}{\numberline {3}The NHPPS DECCP Pipeline Application}{3}
\contentsline {subsection}{\numberline {3.1}Staging}{4}
\contentsline {subsection}{\numberline {3.2}Orchestration}{4}
\contentsline {subsection}{\numberline {3.3}Post-DECCP Processing}{5}
