{
    "ANTARES_API_URL": "/v1",
    "ANTARES_FRONTEND_URL": "localhost",
    "ANTARES_ISSUE_TRACKER_URL": "https://gitlab.com/nsf-noirlab/csdc/antares/antares/-/issues",
    "ANTARES_SUPPORT_EMAIL": "antares@noirlab.edu",
    "ANTARES_SLACK_INVITATION": "https://join.slack.com/t/antares-noao/shared_invite/zt-2o2jgviw1-ZIMLCeI~g_d6VYdNj5zcUw"
}
