{
    "data": [
        {
            "type": "alert_property",
            "attributes": {
                "description": "dec coordinate. Defined on ZTF Candidates, but not ZTF Upper Limits.",
                "es_mapping": null,
                "type": "float",
                "origin": "ANTARES"
            },
            "id": "ant_dec",
            "links": {
                "self": "http://api.antares.noirlab.edu/v1/alert_properties/ant_dec"
            }
        },
        {
            "type": "alert_property",
            "attributes": {
                "description": "UNIX timestamp of input message. eg, Kafka msg timestamp.",
                "es_mapping": null,
                "type": "int",
                "origin": "ANTARES"
            },
            "id": "ant_input_msg_time",
            "links": {
                "self": "http://api.antares.noirlab.edu/v1/alert_properties/ant_input_msg_time"
            }
        },
        {
            "type": "alert_property",
            "attributes": {
                "description": "Magnitude, if this Alert is a mag measurement type",
                "es_mapping": null,
                "type": "float",
                "origin": "ANTARES"
            },
            "id": "ant_mag",
            "links": {
                "self": "http://api.antares.noirlab.edu/v1/alert_properties/ant_mag"
            }
        },
        {
            "type": "alert_property",
            "attributes": {
                "description": "Magnitude error, if this Alert is a mag reading type",
                "es_mapping": null,
                "type": "float",
                "origin": "ANTARES"
            },
            "id": "ant_magerr",
            "links": {
                "self": "http://api.antares.noirlab.edu/v1/alert_properties/ant_magerr"
            }
        },
        {
            "type": "alert_property",
            "attributes": {
                "description": "Magnitude upper limit",
                "es_mapping": null,
                "type": "float",
                "origin": "ANTARES"
            },
            "id": "ant_maglim",
            "links": {
                "self": "http://api.antares.noirlab.edu/v1/alert_properties/ant_maglim"
            }
        },
        {
            "type": "alert_property",
            "attributes": {
                "description": "MJD time of observation",
                "es_mapping": null,
                "type": "float",
                "origin": "ANTARES"
            },
            "id": "ant_mjd",
            "links": {
                "self": "http://api.antares.noirlab.edu/v1/alert_properties/ant_mjd"
            }
        },
        {
            "type": "alert_property",
            "attributes": {
                "description": "One of: 'g', 'R', 'i'",
                "es_mapping": null,
                "type": "str",
                "origin": "ANTARES"
            },
            "id": "ant_passband",
            "links": {
                "self": "http://api.antares.noirlab.edu/v1/alert_properties/ant_passband"
            }
        },
        {
            "type": "alert_property",
            "attributes": {
                "description": "ra coordinate. Defined on ZTF Candidates, but not ZTF Upper Limits.",
                "es_mapping": null,
                "type": "float",
                "origin": "ANTARES"
            },
            "id": "ant_ra",
            "links": {
                "self": "http://api.antares.noirlab.edu/v1/alert_properties/ant_ra"
            }
        },
        {
            "type": "alert_property",
            "attributes": {
                "description": "Origin or type of the Alert. 1 = ZTF Candidate, 2 = ZTF Upper Limit.",
                "es_mapping": null,
                "type": "int",
                "origin": "ANTARES"
            },
            "id": "ant_survey",
            "links": {
                "self": "http://api.antares.noirlab.edu/v1/alert_properties/ant_survey"
            }
        },
        {
            "type": "alert_property",
            "attributes": {
                "description": "UNIX timestamp when ANTARES received the alert",
                "es_mapping": null,
                "type": "int",
                "origin": "ANTARES"
            },
            "id": "ant_time_received",
            "links": {
                "self": "http://api.antares.noirlab.edu/v1/alert_properties/ant_time_received"
            }
        }
    ],
    "links": {
        "self": "http://api.antares.noirlab.edu/v1/alert_properties",
        "next": "http://api.antares.noirlab.edu/v1/alert_properties?page%5Boffset%5D=10&page%5Blimit%5D=10"
    },
    "meta": {
        "count": 130
    }
}
