{
  "version": 2,
  "name": "Up And Running Interview",
  "alias": ["upandrunning.nragone.com"],
  "builds": [
    {
      "src": "package.json",
      "use": "@now/static-build",
      "config": {
        "distDir": "build"
      }
    }
  ],
  "routes": [
    {
      "src": "^/static/(.*)",
      "dest": "/static/$1"
    },
    {
      "src": "^/js/(.*)",
      "dest": "/js/$1"
    },
    {
      "src": "^/images/(.*)",
      "dest": "/images/$1"
    },
    {
      "src": "^/fonts/(.*)",
      "dest": "/fonts/$1"
    },
    {
      "src": "^/favicon.ico",
      "dest": "/favicon.ico"
    },
    {
      "src": "^/manifest.json",
      "dest": "/manifest.json"
    },
    {
      "src": "^/(.*)",
      "dest": "/index.html"
    }
  ]
}
