<svg version="1.1" viewBox="0 0 64 64" xmlns="http://www.w3.org/2000/svg">
 <g fill="#808080">
  <path d="m6 7h34l-8 13h-26l-2 2v-13z" fill="#808080" stroke-opacity=".546554" stroke-width="2"/>
 </g>
 <g stroke-opacity=".546554">
  <path d="m10 13h27l-5 7h-22z" fill="#e6e6e6" stroke-width="2"/>
  <path d="m38 7-6.769531 11h-27.230469v4l2-2h26l8-13z" fill="#000000" opacity=".310827" stroke-width="17.5204"/>
  <path d="m6 20h26l8-13h18l2 2v47l-2 2h-52l-2-2v-34z" fill="#ffec9c" stroke-width="17.5204"/>
 </g>
 <path d="m32.480158 41.919943c-3.490147 1.138935 9.11905-12.818048 9.11905-3.770014s-15.198417 12.818048-15.198417 4.524017c0-4.147016 9.878971-12.818048 11.398813-15.080057 1.519842-2.262008 0-5.27802-1.519842-8.294031-3.799604 7.540028 2.279763 37.700142-2.279762 37.700142s-3.039684-6.032023-0.759921-3.016011" fill="none" stroke="#808080" stroke-linecap="round" stroke-linejoin="round" stroke-width="2.3"/>
 <g transform="matrix(.75992086 0 0 .75400284 15.761899 11.005827)" fill="none" stroke="#808080" stroke-linecap="round" stroke-linejoin="round" stroke-width="1.32108">
  <path d="m56 49h-48v-28h48"/>
  <path d="m8 42h48"/>
  <path d="m8 35h48"/>
  <path d="m8 28h48"/>
 </g>
 <ellipse cx="50.718258" cy="42.673946" rx="2.659723" ry="2.2620084" fill="#808080"/>
 <path d="m52.998021 42.673946v-12.818048s0.970943 4.534827 2.279763 4.524017" fill="none" stroke="#808080" stroke-linecap="round" stroke-linejoin="round"/>
</svg>
