<svg version="1.1" viewBox="0 0 64 64" xmlns="http://www.w3.org/2000/svg">
 <path d="m6 10h52l2 2v40l-2 2h-52l-2-2v-40z" fill="#e6e6e6" stroke-opacity=".546554" stroke-width="17.5204"/>
 <path d="m4 12 2-2h2l2 2v40l-2 2h-2l-2-2z" fill="#808080"/>
 <path d="m5 26h3v3h-1v2h1v2h-1v2h1v3h-3z" fill="#ffec9c" stroke-width=".999996"/>
 <path d="m10 52v-1h50v1l-2 2h-50z" fill="#000000" fill-opacity=".20185558"/>
 <rect x="22" y="39" width="26" height="5" fill="#808080" stroke-width=".999997"/>
 <path d="m35 19 13 16h-26z" fill="#808080" stroke-width=".999997"/>
</svg>
