<svg version="1.1" viewBox="0 0 64 64" xmlns="http://www.w3.org/2000/svg">
 <path d="m35.001953 4.986328-0.015625 3.013672h-24.986328l-2 2v47l2 2h41l2-2v-30.9375l2.876953 0.01563 0.0293-5.996094-3.298828-0.01758c-0.374138-1.880052-1.105452-3.670876-2.1543-5.275394l2.34375-2.324218-4.214844-4.263672-2.373047 2.347656c-1.579892-1.062427-3.347741-1.814111-5.208984-2.214844v-0.333984h-0.01758l0.01563-2.986328z" fill="#e6e6e6" stroke-opacity=".546554" stroke-width="17.5204"/>
 <path d="m8 55h45v2l-2 2h-41l-2-2z" fill="#000000" opacity=".25"/>
 <g stroke-linejoin="bevel" stroke-width="3">
  <path d="m16 20h28l2 2v10h-32v-10z" fill="#00aa88"/>
  <path d="m14 32h32v14l-2 2h-28l-2-2z" fill="#ffffff"/>
  <path d="m22 43 8-16 8 16" fill="none" stroke="#4d4d4d" stroke-linecap="square"/>
  <path d="m24 39h12" fill="none" stroke="#4d4d4d"/>
 </g>
</svg>
