<svg version="1.1" viewBox="0 0 64 64" xmlns="http://www.w3.org/2000/svg">
 <path d="m6 10h52l2 2v40l-2 2h-52l-2-2v-40z" fill="#e6e6e6" stroke-opacity=".546554" stroke-width="17.5204"/>
 <rect x="33" y="15.999999" width="19" height="29" fill="#808080"/>
 <path d="m4 12 2-2h2l2 2v40l-2 2h-2l-2-2z" fill="#808080"/>
 <path d="m5 33h4v2h-2v2h2v2h-2v2h2v2h-4z" fill="#ffec9c" stroke-width=".999996"/>
 <path d="m5 45h4v2h-2v2h2v2h-4z" fill="#ffec9c" stroke-width=".999996"/>
 <path d="m10 52v-1h50v1l-2 2h-50z" fill="#000000" fill-opacity=".20185558"/>
 <g fill="#ffec9c">
  <path d="m43 23v-3h6v5h-2v-3h-2v3h-6v-5h2v3z"/>
  <path d="m43 31v-3h6v5h-2v-3h-2v3h-6v-5h2v3z"/>
  <path d="m47 39.5v-4h2v5l-1 1h-8l-1-1v-5h7v2h-5v2z"/>
 </g>
</svg>
