<svg version="1.1" viewBox="0 0 64 64" xmlns="http://www.w3.org/2000/svg">
 <g stroke="#ffec9c" stroke-width="2">
  <path d="m59 9v46l-2 2h-50l-2-2v-46l2-2h50z" fill="#000000" fill-rule="evenodd"/>
  <path d="m12 20 8 6-8 6" fill="none" stroke-linejoin="bevel"/>
  <path d="m24 32h9" fill="none" stroke-linejoin="bevel"/>
 </g>
 <path d="m32 6v52h25l3-3v-46l-2-3z" fill="#ffffff" fill-opacity=".2" fill-rule="evenodd"/>
 <path d="m16 36c1-1 8 2 9 4 0 0 1.75-1 7-1s7 1 7 1c1-2 8-5 9-4s-1 8-3 12c0 0 1 5 0 8h-26c-1-3 0-8 0-8-2-4-4-11-3-12z" fill="#917c6f" stroke-linejoin="bevel" stroke-width="2"/>
 <ellipse cx="26.555555" cy="48" rx="3.5555556" ry="3.5" fill="#ffffff"/>
 <path d="m26.555556 45c1 1 1 5 0 6-1-1-1-5 0-6z" fill="#917c6f" stroke-linejoin="bevel" stroke-width="2"/>
 <ellipse cx="37.444443" cy="48" rx="3.5555556" ry="3.5" fill="#ffffff"/>
 <g stroke-linejoin="bevel" stroke-width="2">
  <path d="m37.444444 45c1 1 1 5 0 6-1-1-1-5 0-6z" fill="#917c6f"/>
  <path d="m29 54c1-1 5-1 6 0s0 2 0 2h-6s-1-1 0-2z" fill="#ffffff"/>
  <path d="m14 53c6 0 6 5 3 4-1 2-2 2-3 0-1 2-2 1-3 0-3 1-3-4 3-4z" fill="#917c6f"/>
  <path d="m50 53c-6 0-6 5-3 4 1 2 2 2 3 0 1 2 2 1 3 0 3 1 3-4-3-4z" fill="#917c6f"/>
 </g>
 <g fill="none" stroke="#ffffff" stroke-linejoin="bevel">
  <path d="m25 54c-2.888573-3.600788-8.334735-6.044186-14.531426-4.778875"/>
  <path d="m25 55c-3.468799-3.045812-9.255956-4.508579-15.139671-2.18869"/>
  <path d="m39 54c2.888573-3.600788 8.334735-6.044186 14.531426-4.778875"/>
  <path d="m39 55c3.468799-3.045812 9.255956-4.508579 15.139671-2.18869"/>
 </g>
</svg>
