<svg version="1.1" viewBox="0 0 16 16" xmlns="http://www.w3.org/2000/svg">
 <g stroke="#ffec9c" stroke-linejoin="round" stroke-width="2">
  <path d="m3.7573512 12.242621 8.4852418-8.4852419" fill="#ffffff"/>
  <circle cx="8" cy="8" r="6" fill="none" stroke-linecap="round"/>
 </g>
</svg>
