<svg version="1.1" viewBox="0 0 64 64" xmlns="http://www.w3.org/2000/svg">
 <path d="m12 4h40l2 2v52l-2 2h-40l-2-2v-52z" fill="#e6e6e6" stroke-opacity=".546554" stroke-width="17.5204"/>
 <g fill="#808080">
  <rect x="16" y="28" width="31" height="3"/>
  <rect x="16" y="12" width="31" height="3"/>
  <rect x="16" y="36" width="31" height="3"/>
  <rect x="16" y="44" width="24" height="3"/>
  <rect x="16" y="20" width="24" height="3"/>
 </g>
 <path d="m10 56h44v2l-2 2h-40l-2-2z" fill="#000000" opacity=".25"/>
 <path d="m19 25v27h19z" fill="none" stroke="#333333" stroke-linecap="round" stroke-width="6"/>
</svg>
