<svg version="1.1" viewBox="0 0 64 64" xmlns="http://www.w3.org/2000/svg">
 <path d="m12 4h40l2 2v52l-2 2h-40l-2-2v-52z" fill="#dfb281" stroke-opacity=".546554" stroke-width="17.5204"/>
 <g fill="#ffec9c" stroke="#ffffff" stroke-linejoin="round" stroke-width="2.5">
  <path d="m16 13h12"/>
  <path d="m16 18h12"/>
  <path d="m16 23h12"/>
 </g>
 <g transform="matrix(1.7142857,0,0,1.7142857,-22.593682,-42.257716)" fill="#ffffff" stroke-width="3.79899">
  <ellipse cx="37.231155" cy="43.120602" rx="5.0653267" ry="6.0150752"/>
  <path d="m30.899497 51.668341c2.532664-2.532663 9.497487-2.532663 12.030151-0.633166v5.698493l-1.266332 1.266332h-12.663316s-0.633166-3.798996 1.899497-6.331659z"/>
 </g>
 <path d="m10 56h44v2l-2 2h-40l-2-2z" fill="#000000" opacity=".25"/>
</svg>
