<svg version="1.1" viewBox="0 0 64 64" xmlns="http://www.w3.org/2000/svg">
 <defs>
  <filter id="filter2532" x="-.192" y="-.192" width="1.384" height="1.384" color-interpolation-filters="sRGB">
   <feGaussianBlur stdDeviation="0.48"/>
  </filter>
  <filter id="filter2590" x="-.3" y="-.3" width="1.6" height="1.6" color-interpolation-filters="sRGB">
   <feGaussianBlur stdDeviation="0.375"/>
  </filter>
  <filter id="filter2648" x="-.055687501" y="-.89100001" width="1.111375" height="2.782" color-interpolation-filters="sRGB">
   <feGaussianBlur stdDeviation="0.7425"/>
  </filter>
 </defs>
 <path d="m6 23h52l2 2v33l-2 2h-52l-2-2v-33z" fill="#e6e6e6" stroke-opacity=".546554" stroke-width="17.5204"/>
 <path d="m4 25 2-2h2l2 2v33l-2 2h-2l-2-2z" fill="#808080"/>
 <path d="m5 39h4v2h-2v2h2v2h-2v2h2v2h-4z" fill="#ffec9c" stroke-width=".999996"/>
 <path d="m5 51h4v2h-2v2h2v2h-4z" fill="#ffec9c" stroke-width=".999996"/>
 <circle cx="34" cy="43" r="12" fill="#808080"/>
 <circle cx="34.333332" cy="41.333332" r="3.6666667" fill="#e6e6e6"/>
 <path d="m10 58v-1h50v1l-2 2h-50z" fill="#000000" fill-opacity=".201856"/>
 <path d="M 32.148438,4.537109 C 26.985035,17.186853 21.82156,27.078754 16.658203,39.728515 22.438103,43.486751 28.218325,47.244495 34,51 39.781667,47.244484 45.561903,43.48676 51.341797,39.728515 45.561338,25.566349 39.779927,14.162384 34,0 Z" fill="#fafafa" fill-rule="evenodd"/>
 <g transform="matrix(.85207254 0 0 .85207254 6.733677 -.84179108)" stroke-width="1.17361">
  <circle cx="33.498882" cy="34.398254" r="8.2438612" fill="#e6e6e6" stroke-width="1.17361"/>
  <g stroke-width="1.17361">
   <path d="M 32,5.9194604 49.445341,48.660538 32,60.000003 14.554663,48.660538 Z" fill="#fafafa" fill-rule="evenodd" stroke="#000000"/>
   <path d="m33 57v-44l14 35z" fill="#000000" stroke-opacity=".54902"/>
   <path d="m31 57v-44l-14 35z" fill="#000000" stroke-opacity=".54902"/>
  </g>
  <path d="M 30,44 24.975677,51.119576 30,55 Z" fill="#fafafa" style="paint-order:normal"/>
  <path d="m34 29s6.344817 10.513904 9.517432 16.770853c-3.17234 3.057966-9.517028 9.173896-9.517028 9.173896z" fill="#fafafa" style="paint-order:normal"/>
 </g>
 <g fill="#ffec9c">
  <circle transform="matrix(1.2481857,0,0,1.3131414,-8.3105924,-16.970211)" cx="34" cy="50" r="3" filter="url(#filter2532)" opacity=".867" stroke-width=".781094"/>
  <path transform="matrix(1.2481857,0,0,1.3131414,-8.3105924,-16.970211)" d="m34 50 16 1-16 1-16-1z" filter="url(#filter2648)" opacity=".867" stroke-width="1.56219"/>
  <circle transform="matrix(1.2481857,0,0,1.3131414,-8.3105924,-16.970211)" cx="34" cy="51" r="1.5" filter="url(#filter2590)" opacity=".867" style="mix-blend-mode:normal"/>
 </g>
 <path d="m4 25 2-2h18l8-19v56h-26l-2-2z" fill="#000000" opacity=".25"/>
</svg>
