<svg version="1.1" viewBox="0 0 64 64" xmlns="http://www.w3.org/2000/svg">
 <g fill="#808080">
  <path d="m6 7h34l-8 13h-26l-2 2v-13z" fill="#808080" stroke-opacity=".546554" stroke-width="2"/>
 </g>
 <g stroke-opacity=".546554">
  <path d="m10 13h27l-5 7h-22z" fill="#e6e6e6" stroke-width="2"/>
  <path d="m38 7-6.769531 11h-27.230469v4l2-2h26l8-13z" fill="#000000" opacity=".310827" stroke-width="17.5204"/>
  <path d="m6 20h26l8-13h18l2 2v47l-2 2h-52l-2-2v-34z" fill="#ff7f2a" stroke-width="17.5204"/>
 </g>
</svg>
