<svg version="1.1" viewBox="0 0 64 64" xmlns="http://www.w3.org/2000/svg">
 <path d="m9 9 13-2 10-5 10 5 13 2 2 13 5 10-5 10-2 13-13 2-10 5-10-5-13-2-2-13-5-10 5-10z" fill="#ffa700"/>
 <g transform="translate(5,5)" fill-rule="evenodd">
  <path d="M 23.537634,30.462367 4.0201006,38.666191 6,48 l 9.333809,1.9799 z" fill="#ffffff"/>
  <path d="M 18.96102,35.03898 6.7625631,40.166369 8,46 l 5.833631,1.237437 z" fill="#999999"/>
 </g>
 <g transform="translate(0,2)" fill-rule="evenodd">
  <path d="M 32,26.801959 24,7.199999 32,2 40,7.199999 Z" fill="#ffffff"/>
  <path d="M 31.999999,20.501222 37,8.2500001 32,5 27,8.2500001 Z" fill="#999999"/>
 </g>
 <g transform="matrix(1,0,0,-1,0,62)" fill-rule="evenodd">
  <path d="M 32,26.801959 24,7.199999 32,2 40,7.199999 Z" fill="#ffffff"/>
  <path d="M 31.999999,20.501222 37,8.2500001 32,5 27,8.2500001 Z" fill="#999999"/>
 </g>
 <g transform="translate(5,3)" fill-rule="evenodd">
  <path d="M 23.537634,25.537633 4.020101,17.333809 6,8 15.333809,6.0201 Z" fill="#ffffff"/>
  <path d="M 18.961021,20.96102 13.833632,8.7625622 8,10 6.7625641,15.833631 Z" fill="#999999"/>
 </g>
 <g transform="rotate(-45,12.899495,5.6862915)" fill-rule="evenodd">
  <path d="M 5.537634,35.537633 -13.979899,27.333809 -12,18 -2.666191,16.0201 Z" fill="#ffffff"/>
  <path d="M 0.961021,30.96102 -4.166368,18.762562 -10,20 l -1.237436,5.833631 z" fill="#999999"/>
 </g>
 <g transform="matrix(-.70710678 -.70710678 -.70710678 .70710678 64.242641 10.786797)" fill-rule="evenodd">
  <path d="M 5.537634,35.537633 -13.979899,27.333809 -12,18 -2.666191,16.0201 Z" fill="#ffffff"/>
  <path d="M 0.961021,30.96102 -4.166368,18.762562 -10,20 l -1.237436,5.833631 z" fill="#999999"/>
 </g>
 <g transform="translate(-5,5)">
  <path d="M 40.462366,30.462367 48.666191,49.9799 58,48 59.979899,38.666191 Z" fill="#ffffff" fill-rule="evenodd"/>
  <path d="M 45.03898,35.03898 50.166369,47.237437 56,46 57.237437,40.166369 Z" fill="#999999" fill-rule="evenodd"/>
 </g>
 <g transform="translate(-5,3)" fill-rule="evenodd">
  <path d="M 40.462366,25.537633 48.666191,6.0201 58,8 l 1.979899,9.333809 z" fill="#ffffff"/>
  <path d="M 45.03898,20.96102 57.237438,15.833632 56,10 50.166369,8.7625633 Z" fill="#999999"/>
 </g>
</svg>
