<svg version="1.1" viewBox="0 0 64 64" xmlns="http://www.w3.org/2000/svg">
 <path d="m60 8v48l-4 4h-48l-4-4v-48l4-4h48z" fill="#004455" fill-rule="evenodd"/>
 <g fill="#ffffff">
  <g fill-rule="evenodd">
   <path d="m17.033203 60h1.966797c-0.409603-0.222524-0.813571-0.455879-1.210938-0.697266-0.398606-0.242139-0.790093-0.493391-1.175781-0.753906s-0.764556-0.53031-1.136719-0.808594c-0.372163-0.278283-0.737671-0.565882-1.095703-0.861328-0.358032-0.295445-0.709439-0.598154-1.052734-0.910156s-0.677908-0.632986-1.005859-0.960938c-0.327952-0.327951-0.648936-0.662564-0.960938-1.005859s-0.614711-0.694702-0.910156-1.052734c-0.295446-0.358032-0.583045-0.72354-0.861328-1.095703-0.278284-0.372163-0.548079-0.751031-0.808594-1.136719s-0.511767-0.777175-0.753906-1.175781c-0.24214-0.398606-0.476061-0.803926-0.699219-1.214844-0.223159-0.410918-0.435101-0.827376-0.638672-1.25s-0.398654-0.851433-0.582031-1.285156c-0.183377-0.433724-0.355001-0.874143-0.517578-1.31836-0.162577-0.444216-0.315861-0.893553-0.457032-1.347656-0.14117-0.454103-0.271467-0.911616-0.390625-1.375-0.119157-0.463384-0.225726-0.932239-0.322265-1.404297-0.09654-0.472058-0.182546-0.947608-0.25586-1.427734-0.07331-0.480126-0.134111-0.963584-0.183593-1.451172-0.04948-0.487588-0.08824-0.980166-0.113282-1.474609-0.025044-0.494444-0.037109-0.991496-0.037109-1.492188v7.6875c0.109432 0.413581 0.223149 0.824083 0.349609 1.230469 0.14614 0.469628 0.30241 0.935098 0.470704 1.394531 0.168293 0.459433 0.347291 0.914673 0.537109 1.363281 0.189818 0.448609 0.390849 0.890971 0.601562 1.328125 0.210713 0.437155 0.431131 0.867898 0.66211 1.292969 0.230978 0.425071 0.472041 0.843501 0.722656 1.255859 0.250615 0.412359 0.511629 0.819734 0.78125 1.21875 0.269622 0.399017 0.547939 0.790736 0.835938 1.175782 0.287998 0.385045 0.584878 0.762368 0.890625 1.132812 0.305746 0.370444 0.620494 0.73463 0.943359 1.089844s0.654786 0.701661 0.99414 1.041016c0.339355 0.339354 0.685802 0.671275 1.041016 0.99414s0.7194 0.637613 1.089844 0.94336c0.370444 0.305746 0.747767 0.602626 1.132812 0.890624 0.385046 0.287999 0.776765 0.566317 1.175782 0.835938 0.319122 0.215636 0.646912 0.421481 0.974609 0.625z"/>
   <path d="m59.830078 45.083984c-0.09239 0.235636-0.17901 0.474453-0.277344 0.707032-0.183377 0.433723-0.37846 0.862532-0.582031 1.285156s-0.415513 0.839082-0.638672 1.25c-0.223158 0.410918-0.457079 0.816238-0.699219 1.214844-0.242139 0.398606-0.493391 0.790093-0.753906 1.175781s-0.53031 0.764556-0.808594 1.136719c-0.278283 0.372163-0.565882 0.737671-0.861328 1.095703-0.295445 0.358032-0.598154 0.709439-0.910156 1.052734s-0.632986 0.677908-0.960938 1.005859c-0.327951 0.327952-0.662564 0.648936-1.005859 0.960938s-0.694702 0.614711-1.052734 0.910156c-0.358032 0.295446-0.72354 0.583045-1.095703 0.861328-0.372163 0.278284-0.751031 0.548079-1.136719 0.808594s-0.777175 0.511767-1.175781 0.753906c-0.397367 0.241387-0.801335 0.474742-1.210938 0.697266h1.966797c0.327697-0.203519 0.655487-0.409364 0.974609-0.625 0.399017-0.269621 0.790736-0.547939 1.175782-0.835938 0.385045-0.287998 0.762368-0.584878 1.132812-0.890624 0.370444-0.305747 0.73463-0.620495 1.089844-0.94336s0.701661-0.654786 1.041016-0.99414c0.339354-0.339355 0.671275-0.685802 0.99414-1.041016s0.637613-0.7194 0.94336-1.089844c0.305746-0.370444 0.602626-0.747767 0.890624-1.132812 0.287999-0.385046 0.566317-0.776765 0.835938-1.175782 0.269621-0.399016 0.530635-0.806391 0.78125-1.21875 0.250615-0.412358 0.491678-0.830788 0.722656-1.255859 0.216673-0.398744 0.422237-0.803497 0.621094-1.212891z"/>
   <path d="m59.830078 21.416016c-0.198857-0.409394-0.404421-0.814147-0.621094-1.212891-0.230978-0.425071-0.472041-0.843501-0.722656-1.255859-0.250615-0.412359-0.511629-0.819734-0.78125-1.21875-0.269621-0.399017-0.547939-0.790736-0.835938-1.175782-0.287998-0.385045-0.584878-0.762368-0.890624-1.132812-0.305747-0.370444-0.620495-0.73463-0.94336-1.089844s-0.654786-0.701661-0.99414-1.041016c-0.339355-0.339354-0.685802-0.671275-1.041016-0.99414s-0.7194-0.637613-1.089844-0.94336c-0.370444-0.305746-0.747767-0.602626-1.132812-0.890624-0.385046-0.287999-0.776765-0.566316-1.175782-0.835938-0.399016-0.269621-0.806391-0.530635-1.21875-0.78125-0.412358-0.2506148-0.830788-0.4916776-1.255859-0.7226562-0.425071-0.2309787-0.855814-0.4513963-1.292969-0.6621094-0.437154-0.2107131-0.879516-0.4117444-1.328125-0.6015625-0.448608-0.1898182-0.903848-0.3688156-1.363281-0.5371094s-0.924903-0.3245631-1.394531-0.4707031c-0.469628-0.1461401-0.942682-0.28094-1.421875-0.4042969-0.479194-0.1233569-0.963042-0.2359932-1.451172-0.3359375s-0.982079-0.1877695-1.478516-0.2636719c-0.496437-0.0759023-0.995886-0.1401753-1.5-0.1914062-0.504114-0.051231-1.012275-0.0893042-1.523437-0.1152344s-1.025388-0.0390625-1.542969-0.0390625-1.031807 0.013132-1.542969 0.039063c-0.511162 0.02593-1.019323 0.064003-1.523437 0.1152344-0.504114 0.051231-1.003563 0.1155039-1.5 0.1914062-0.496437 0.075902-0.990386 0.1637271-1.478516 0.2636714-0.48813 0.099944-0.971978 0.2125806-1.451172 0.3359375-0.479193 0.1233569-0.952247 0.2581568-1.421875 0.4042969-0.469628 0.14614-0.935098 0.3024093-1.394531 0.4707031s-0.914673 0.3472912-1.363281 0.5371094c-0.448609 0.1898181-0.890971 0.3908494-1.328125 0.6015625-0.437155 0.2107131-0.867898 0.4311307-1.292969 0.6621094-0.425071 0.2309786-0.843501 0.4720414-1.255859 0.7226562-0.412359 0.250615-0.819734 0.511629-1.21875 0.78125-0.399017 0.269622-0.790736 0.547939-1.175782 0.835938-0.385045 0.287998-0.762368 0.584878-1.132812 0.890624-0.370444 0.305747-0.73463 0.620495-1.089844 0.94336s-0.701661 0.654786-1.041016 0.99414c-0.339354 0.339355-0.671275 0.685802-0.99414 1.041016s-0.637613 0.7194-0.943359 1.089844c-0.305747 0.370444-0.602627 0.747767-0.890625 1.132812-0.287999 0.385046-0.566316 0.776765-0.835938 1.175782-0.269621 0.399016-0.530635 0.806391-0.78125 1.21875-0.250615 0.412358-0.491678 0.830788-0.722656 1.255859-0.230979 0.425071-0.451397 0.855814-0.66211 1.292969-0.210713 0.437154-0.411744 0.879516-0.601562 1.328125-0.189818 0.448608-0.368816 0.903848-0.537109 1.363281-0.168294 0.459433-0.324564 0.924903-0.470704 1.394531-0.12646 0.406386-0.240177 0.816888-0.349609 1.230469v7.6875c0-0.500692 0.01206-0.997744 0.03711-1.492188 0.02504-0.494443 0.0638-0.987021 0.113281-1.474609 0.04948-0.487588 0.11028-0.971046 0.183594-1.451172 0.07331-0.480126 0.15932-0.955676 0.255859-1.427734 0.09654-0.472058 0.203108-0.940913 0.322266-1.404297s0.249454-0.920897 0.390625-1.375 0.294454-0.90344 0.457031-1.347656c0.162577-0.444217 0.334201-0.884636 0.517578-1.31836 0.183378-0.433723 0.378461-0.862532 0.582032-1.285156 0.20357-0.422624 0.415513-0.839082 0.638672-1.25 0.223158-0.410918 0.457079-0.816238 0.699218-1.214844 0.24214-0.398606 0.493392-0.790093 0.753907-1.175781 0.260514-0.385688 0.53031-0.764556 0.808593-1.136719 0.278284-0.372163 0.565883-0.737671 0.861329-1.095703 0.295445-0.358032 0.598154-0.709439 0.910156-1.052734s0.632986-0.677908 0.960938-1.005859c0.327951-0.327952 0.662564-0.648936 1.005859-0.960938s0.694702-0.614711 1.052734-0.910156c0.358032-0.295446 0.72354-0.583045 1.095703-0.861328 0.372163-0.278284 0.751031-0.548079 1.136719-0.808594s0.777175-0.511767 1.175781-0.753906c0.398606-0.24214 0.803926-0.476061 1.214844-0.6992191 0.410918-0.2231585 0.827376-0.435101 1.25-0.6386719s0.851433-0.3986541 1.285156-0.5820312c0.433724-0.1833772 0.874143-0.3550012 1.31836-0.5175782 0.444216-0.162577 0.893553-0.3158606 1.347656-0.4570312s0.911616-0.2714671 1.375-0.390625 0.932239-0.2257267 1.404297-0.3222656c0.472058-0.096539 0.947608-0.1825458 1.427734-0.2558594 0.480126-0.073314 0.963584-0.1341117 1.451172-0.1835938 0.487588-0.049482 0.980166-0.088237 1.474609-0.1132812s0.991495-0.0371094 1.492187-0.0371094 0.997744 0.012065 1.492188 0.037109c0.494443 0.025044 0.987021 0.063799 1.474609 0.1132812 0.487588 0.049482 0.971046 0.1102802 1.451172 0.1835938 0.480126 0.073314 0.955676 0.1593204 1.427734 0.2558594s0.940913 0.2031077 1.404297 0.3222656 0.920897 0.2494544 1.375 0.390625 0.90344 0.2944542 1.347656 0.4570312c0.444217 0.162577 0.884636 0.334201 1.31836 0.5175782 0.433723 0.1833771 0.862532 0.3784603 1.285156 0.5820312s0.839082 0.4155134 1.25 0.6386719 0.816238 0.4570795 1.214844 0.6992185c0.398606 0.24214 0.790093 0.493392 1.175781 0.753907s0.764556 0.53031 1.136719 0.808594c0.372163 0.278283 0.737671 0.565882 1.095703 0.861328 0.358032 0.295445 0.709439 0.598154 1.052734 0.910156s0.677908 0.632986 1.005859 0.960938c0.327952 0.327951 0.648936 0.662564 0.960938 1.005859s0.614711 0.694702 0.910156 1.052734c0.295446 0.358032 0.583045 0.72354 0.861328 1.095703 0.278284 0.372163 0.548079 0.751031 0.808594 1.136719s0.511767 0.777175 0.753906 1.175781c0.24214 0.398606 0.476061 0.803926 0.699219 1.214844 0.223159 0.410918 0.435101 0.827376 0.638672 1.25s0.398654 0.851433 0.582031 1.285156c0.09833 0.232579 0.184951 0.471396 0.277344 0.707032z"/>
  </g>
  <circle cx="32.617188" cy="34" r="9.5" stroke-width="3"/>
  <circle cx="46.226151" cy="29.580864" r="2.5" stroke-width="3"/>
  <circle cx="51.326275" cy="40.460125" r="3.5" stroke-width="3.00001"/>
  <circle cx="47.155361" cy="8.5" r="3" stroke-width="3"/>
  <circle cx="8.9997025" cy="27.75" r="4" stroke-width="3"/>
 </g>
 <g fill="none" stroke="#ffffff" stroke-linecap="round" stroke-linejoin="round">
  <circle cx="32.330078" cy="34.5" r="14.5" stroke-width=".999997"/>
  <circle cx="32.330078" cy="34.5" r="19.5"/>
  <circle cx="32.330078" cy="35" r="24.5"/>
 </g>
 <path d="m4 40h56v16l-4 4h-48l-4-4z" fill="#000000" fill-opacity=".2" fill-rule="evenodd"/>
</svg>
