<svg version="1.1" viewBox="0 0 64 64" xmlns="http://www.w3.org/2000/svg">
 <path d="m19 4h30l3 3v51l-2 2h-32l-2-2v-51z" fill="#e6e6e6" stroke-opacity=".546554" stroke-width="17.5204"/>
 <path transform="scale(1,-1)" d="m18-57h32v51h-13s-0.251263-3-3-3-3 3-3 3h-13z" fill="#4d4d4d" stroke-width=".999994"/>
 <path d="m16 58v-1h36v1l-2 2h-32z" fill="#000000" fill-opacity=".201856"/>
 <path d="m17 10v-3l2-2h30l2 2v3" fill="none" stroke="#b8b8b8" stroke-width="2"/>
 <ellipse cx="44.000004" cy="51.999996" rx="3.0000002" ry="2.9999998" fill="#ff0000"/>
</svg>
