<svg version="1.1" viewBox="0 0 64 64" xmlns="http://www.w3.org/2000/svg">
 <g transform="matrix(.96428571 0 0 1 1.1428572 -5.5)">
  <path transform="translate(0,17)" d="m6-6-2 2v9l2-2h52l2 2v-9l-2-2z" fill="#ffec9c" stroke-linejoin="round" stroke-width="3.05505"/>
  <g transform="translate(0,17)" stroke-width="1.01835">
   <path d="m6-6-2 2 11.117188 7h5.507812zm52 0-14.625 9h5.507812l11.117188-7z" fill="#000000" fill-opacity=".309804" stroke-linejoin="round" stroke-width="3.05505"/>
  </g>
  <path d="m4 17h56v5l-2-2h-52l-2 2z" fill="#000000" fill-opacity=".484305" stroke-linejoin="round" stroke-width="3.05505"/>
 </g>
 <g transform="matrix(.96428571 0 0 1 1.1428572 .5)" stroke-opacity=".546554" stroke-width="17.8419">
  <path d="m6 14h52l2 2v29l-2 2h-52l-2-2v-29z" fill="#ffec9c"/>
  <path d="m32 30-26-16-2 2 27 17-26 13 27-13 27 13-26-13 27-17-2-2z" fill="#000000" opacity=".310827"/>
 </g>
 <g stroke-linejoin="round" stroke-width="3">
  <path d="m4 37h12v9h32v-9h12v19l-2 2h-52l-2-2z" fill="#e6e6e6"/>
  <path d="m5 35h13v9h28v-9h13v2h1-12v9h-32v-9h-12 1z" fill="#000000" fill-opacity=".309804"/>
  <path d="m4.0000008 54h55.999999v2l-2 2h-52l-2-2z" fill-opacity=".309804"/>
 </g>
</svg>
