<svg version="1.1" viewBox="0 0 64 64" xmlns="http://www.w3.org/2000/svg">
 <g stroke-width="0">
  <path d="m12 14h6v5h28v-5h6v44l-2 2h-36l-2-2z" fill="#999999"/>
  <g fill="#808080">
   <rect x="18" y="23" width="4" height="32"/>
   <rect x="30" y="23" width="4" height="32"/>
   <rect x="42" y="23" width="4" height="32"/>
   <path d="m14 10h36l2 2v2h-6v5h-28v-5h-6v-2z"/>
  </g>
 </g>
</svg>
