<svg version="1.1" viewBox="0 0 64 64" xmlns="http://www.w3.org/2000/svg">
 <g stroke-opacity=".546554" stroke-width="17.5204">
  <path d="m6 6h52l2 2v33l-2 2h-52l-2-2v-33z" fill="#e6e6e6"/>
  <path d="m8 8h48l2 2v29l-2 2h-48l-2-2v-29z" fill="#808080"/>
  <path d="m6 48h52l2 2v8l-2 2h-52l-2-2v-8z" fill="#e6e6e6"/>
  <path d="m23.642857 44h16.714286l0.642857 1v1l-0.642857 1h-16.714286l-0.642857-1v-1z" fill="#e6e6e6"/>
 </g>
 <path d="m4 56h56v2l-2 2h-52l-2-2z" opacity=".25"/>
 <path d="m48 50h9l1 1v6l-1 1h-9l-1-1v-6z" fill="#808080" stroke-width="2"/>
 <rect x="52" y="52" width="5" height="4" fill="#ffec9c" stroke-width=".999996"/>
</svg>
