<svg version="1.1" viewBox="0 0 64 64" xmlns="http://www.w3.org/2000/svg">
 <path d="m12 4h40l2 2v52l-2 2h-40l-2-2v-52z" fill="#5f8dd3" stroke-opacity=".546554" stroke-width="17.5204"/>
 <path d="m10 56h44v2l-2 2h-40l-2-2z" fill="#000000" opacity=".25"/>
 <g fill="#ffec9c" stroke="#e6e6e6" stroke-linejoin="round" stroke-width="2.5">
  <path d="m16 12h32"/>
  <path d="m16 17h32"/>
  <path d="m16 22h32"/>
  <path d="m16 27h24"/>
  <path d="m16 37h32"/>
  <path d="m16 42h32"/>
  <path d="m16 47h16"/>
 </g>
</svg>
