<svg version="1.1" viewBox="0 0 16 16" xmlns="http://www.w3.org/2000/svg">
 <g transform="matrix(-1,0,0,1,15.999944,0)" fill="none" stroke-linecap="round" stroke-linejoin="round" stroke-width="2">
  <path d="m10.999944 12v2h-9v-6" stroke="#e6e6e6"/>
  <path d="m13.999944 3v6h-9v-6" stroke="#ffec9c"/>
 </g>
</svg>
