<svg version="1.1" viewBox="0 0 16 16" xmlns="http://www.w3.org/2000/svg">
 <path d="m-10 49h4v6h-4z" fill="#808080"/>
 <path d="m-13 47v9h10v-9h1l5.45e-4 -3h-12.000545l-5.45e-4 3zm3 2h4v6h-4z" fill="#ffec9c" stroke-opacity=".546554" stroke-width="2"/>
 <path d="m-3 47h-10v3.000136l1-1.36e-4 3-2h6z" fill-opacity=".309804" stroke-linejoin="round" stroke-width="3"/>
 <g stroke-linecap="round" stroke-width="2">
  <path d="m8 3v10" fill="#e6e6e6" stroke="#e6e6e6"/>
  <path d="m3 3v10" fill="#808080" stroke="#ffec9c"/>
  <path d="m13 3v10" fill="#808080" stroke="#ffec9c"/>
 </g>
</svg>
