<svg version="1.1" viewBox="0 0 16 16" xmlns="http://www.w3.org/2000/svg">
 <g transform="rotate(90,8,8)" stroke="#ffec9c" stroke-linecap="round" stroke-linejoin="round" stroke-width="2">
  <path d="m8 2v11" fill="#ffffff"/>
  <path d="m14 8-6 6-6-6" fill="none"/>
 </g>
</svg>
