<svg version="1.1" viewBox="0 0 16 16" xmlns="http://www.w3.org/2000/svg">
 <g transform="matrix(-1,0,0,1,15.999944,0)">
  <g transform="rotate(180,7.999972,8)" stroke="#ffec9c" stroke-linecap="round" stroke-linejoin="round" stroke-width="2">
   <path d="m2 8h5.999944" fill="#ffffff"/>
   <path d="m7.999944 3 6 5-6 5" fill="none"/>
  </g>
 </g>
</svg>
