<svg version="1.1" viewBox="0 0 64 64" xmlns="http://www.w3.org/2000/svg">
 <g>
  <path d="m6 12h52l2 2v36l-2 2h-52l-2-2v-36z" fill="#e6e6e6" stroke-opacity=".546554" stroke-width="17.5204"/>
  <circle cx="20" cy="29" r="14" fill="#333333" stroke-linecap="round" stroke-width="4"/>
  <circle cx="44" cy="29" r="7" fill="#333333" stroke-linecap="round" stroke-width="4"/>
  <rect x="12" y="14" width="40" height="9" fill="#ffffff" stroke-width=".999997"/>
 </g>
 <path d="m49 44 1 8h-36l1-8c1-1 33-1 34 0z" fill="#000000" fill-opacity=".2"/>
 <path d="m4 50v-1h56v1l-2 2h-52z" fill="#000000" fill-opacity=".201856"/>
 <g>
  <g stroke-linecap="round" stroke-width="4">
   <circle cx="20" cy="29" r="6" fill="#808080"/>
   <circle cx="20" cy="29" r="3.5" fill="#e6e6e6"/>
   <circle cx="44" cy="29" r="6" fill="#808080"/>
   <circle cx="44" cy="29" r="3.5" fill="#e6e6e6"/>
  </g>
  <rect x="12" y="14" width="40" height="3" fill="#85a6d9"/>
 </g>
</svg>
