<svg version="1.1" viewBox="0 0 64 64" xmlns="http://www.w3.org/2000/svg">
 <g fill="#808080">
  <path d="m6 7h52l2 2-1 8-1-6h-16l-8 13h-24l-2 2-4 30v-47z" fill="#808080" stroke-opacity=".546554" stroke-width="2"/>
 </g>
 <g stroke-opacity=".546554">
  <path d="m10 13h31l-7 11h-24z" fill="#e6e6e6" stroke-width="2"/>
  <path d="m40 8-8.769531 13h-27.230469v35l4-30 2-2h24l8-13h16l1 6 0.879266-7.0536935-1.879266-1.9463065z" fill="#000000" opacity=".310827" stroke-width="17.5204"/>
  <path d="m10 24h24l8-13h16l2 2-4 43-2 2h-48l-2-2 4-30z" fill="#ffec9c" stroke-width="17.5204"/>
 </g>
</svg>
