<svg version="1.1" viewBox="0 0 64 64" xmlns="http://www.w3.org/2000/svg">
 <path d="m4 52v-40l2-2h52l2 2v40l-2 2h-52z" fill="#e6e6e6" stroke-opacity=".546554" stroke-width="17.5204"/>
 <path d="m4 19v-7l2-2h52l2 2v7z" fill="#808080" stroke-opacity=".546554" stroke-width="17.5204"/>
 <path d="m4 50h56v2l-2 2h-52l-2-2z" fill="#000000" opacity=".25"/>
 <g fill="#808080">
  <rect x="9" y="32" width="7" height="7"/>
  <rect x="9" y="42" width="7" height="7"/>
  <rect x="19" y="22" width="7" height="7"/>
  <rect x="19" y="32" width="7" height="7"/>
  <rect x="19" y="42" width="7" height="7"/>
  <rect x="29" y="22" width="7" height="7"/>
  <rect x="29" y="32" width="7" height="7"/>
  <rect x="29" y="42" width="7" height="7"/>
 </g>
 <g fill="#ff7f2a">
  <rect x="49" y="22" width="7" height="7"/>
  <rect x="49" y="32" width="7" height="7"/>
  <rect x="39" y="22" width="7" height="7"/>
  <rect x="39" y="32" width="7" height="7"/>
  <rect x="39" y="42" width="7" height="7"/>
 </g>
</svg>
