<svg version="1.1" viewBox="0 0 64 64" xmlns="http://www.w3.org/2000/svg" xmlns:xlink="http://www.w3.org/1999/xlink">
 <defs>
  <linearGradient id="linearGradient19796" x1="40" x2="40" y1="42" y2="9" gradientUnits="userSpaceOnUse">
   <stop stop-color="#ffcc00" offset="0"/>
   <stop stop-color="#a10000" stop-opacity=".85881978" offset="1"/>
  </linearGradient>
  <linearGradient id="linearGradient20213" x1="40" x2="40" y1="45" y2="7" gradientUnits="userSpaceOnUse">
   <stop stop-color="#fdd900" offset="0"/>
   <stop stop-color="#c20000" offset="1"/>
  </linearGradient>
 </defs>
 <g fill="none" stroke="#ffffff">
  <circle cx="30" cy="34.5" r="14.5"/>
  <circle cx="30" cy="34.5" r="19.5"/>
  <circle cx="30" cy="34.5" r="25.5"/>
 </g>
 <circle cx="17.691265" cy="42.5" r="2.5" fill="#808080" stroke-width="3"/>
 <circle cx="7.9356985" cy="21.497538" r="3" fill="#808080" stroke-width="3"/>
 <g fill="#e6e6e6" stroke-width="2">
  <rect x="20" y="4" width="24" height="12"/>
  <rect x="47" y="4" width="13" height="12"/>
  <rect transform="scale(-1,1)" x="-60" y="19" width="24" height="12"/>
  <rect transform="scale(-1,1)" x="-33" y="19" width="13" height="12"/>
  <rect x="20" y="34" width="24" height="12"/>
  <rect x="47" y="34" width="13" height="12"/>
 </g>
 <circle cx="32.364914" cy="53.892418" r="3.5" fill="#808080" stroke-width="3.00001"/>
 <path d="m29 19c-0.276106 8.057529 2.353544 12.551271 5 15-2.844183-7.543913-1.360865-21.459154 8-23-2.606673 3.633904-4.997045 12.379595-2.192645 13.840876 2.804399 1.461281 5.219876-3.600299 4.192645-9.840876 3.791848 1.619225 5 7 1 13-2 3 2.812367 8.590221 3 9-3-7 2.052335-8.075312 3-14 7 11 1.5 21-11 21s-18.420852-17.993722-11-25z" fill="url(#linearGradient19796)" stroke="url(#linearGradient20213)" stroke-width="2"/>
</svg>
