<svg version="1.1" viewBox="0 0 64 64" xmlns="http://www.w3.org/2000/svg">
 <path d="m45 16h15v32h-15z" fill="#e6e6e6" stroke-opacity=".546554" stroke-width="17.5204"/>
 <path d="m4 12 2-2h37l2 2v40l-2 2h-37l-2-2z" fill="#808080"/>
 <path d="m4 52v-1h41v1l-2 2h-37z" fill="#000000" fill-opacity=".201856"/>
 <g fill="#808080">
  <rect x="45" y="16" width="3" height="32" opacity=".25"/>
  <rect x="50" y="21" width="4" height="7"/>
  <rect x="50" y="36" width="4" height="7"/>
 </g>
 <path d="m10 30h28l-14 18z" fill="#ffec9c" stroke-dasharray="8, 4" stroke-width="4"/>
 <rect x="18" y="16" width="12" height="12" fill="#ffec9c"/>
 <path d="m4 12 2-2h26v44h-26l-2-2z" fill="#000000" fill-opacity=".2"/>
</svg>
