<svg version="1.1" viewBox="0 0 16 16" xmlns="http://www.w3.org/2000/svg">
 <path d="m-10 49h4v6h-4z" fill="#808080"/>
 <path d="m-13 47v9h10v-9h1l5.45e-4 -3h-12.000545l-5.45e-4 3zm3 2h4v6h-4z" fill="#ffec9c" stroke-opacity=".546554" stroke-width="2"/>
 <path d="m-3 47h-10v3.000136l1-1.36e-4 3-2h6z" fill-opacity=".309804" stroke-linejoin="round" stroke-width="3"/>
 <g fill="#808080" stroke-linecap="round" stroke-width="2">
  <g stroke="#ffec9c">
   <path d="m8 9h6"/>
   <path d="m8 12h6"/>
   <path d="m8 6h6"/>
  </g>
  <path d="m2 6h2" stroke="#ffffff"/>
  <path d="m8 3h6" stroke="#ffec9c"/>
  <g stroke="#ffffff">
   <path d="m2 3h2"/>
   <path d="m2 12h2"/>
   <path d="m2 9h2"/>
  </g>
 </g>
</svg>
