<svg version="1.1" viewBox="0 0 64 64" xmlns="http://www.w3.org/2000/svg">
 <path d="m6 10h52l2 2v40l-2 2h-52l-2-2v-40z" fill="#e6e6e6" stroke-opacity=".546554" stroke-width="17.5204"/>
 <path d="m4 12 2-2h2l2 2v40l-2 2h-2l-2-2z" fill="#808080"/>
 <path d="m5 33h4v2h-2v2h2v2h-2v2h2v2h-4z" fill="#ffec9c" stroke-width=".999996"/>
 <path d="m5 45h4v2h-2v2h2v2h-4z" fill="#ffec9c" stroke-width=".999996"/>
 <circle cx="35" cy="32" r="18" fill="#b3b3b3"/>
 <circle cx="35" cy="32" r="5.5" fill="#e6e6e6"/>
 <g fill="#000000">
  <path d="m10 52v-1h50v1l-2 2h-50z" fill-opacity=".20185558"/>
  <rect transform="rotate(29.176209)" x="33.217976" y="-4.6312227" width="6" height="40" stroke-width=".999996"/>
  <rect transform="rotate(90)" x="44.368256" y="-56" width="5.6317444" height="24"/>
 </g>
</svg>
