<svg version="1.1" viewBox="0 0 16 16" xmlns="http://www.w3.org/2000/svg">
 <g fill="none" stroke="#ffec9c" stroke-linecap="round" stroke-linejoin="round" stroke-width="2">
  <path d="m13 5c-2-5-11-4-11 3s9 8 11 3"/>
  <path d="m14 2 2.8e-5 4h-4"/>
 </g>
</svg>
