<svg version="1.1" viewBox="0 0 64 64" xmlns="http://www.w3.org/2000/svg">
 <g fill="#ffec9c" stroke-linecap="round" stroke-linejoin="round">
  <path d="m18 32 14 28h-28z"/>
  <path d="m32 4 14 28h-28z"/>
  <path d="m46 32 14 28h-28z"/>
 </g>
 <path d="m34 56-2 4-2-4h-24l-2 4h56l-2-4z" fill="#000000" opacity=".310827" stroke-opacity=".546554" stroke-width="17.5204"/>
</svg>
