<svg version="1.1" viewBox="0 0 64 64" xmlns="http://www.w3.org/2000/svg">
 <g>
  <path d="m60 8v48l-4 4h-48l-4-4v-48l4-4h48z" fill="#ffffff" fill-rule="evenodd"/>
  <path d="m37.00195 19.985353-0.01758 3.310547a14.987803 14.987803 0 0 0-5.251953 2.169922l-2.347657-2.371094-4.261718 4.214844 2.347656 2.375a14.987803 14.987803 0 0 0-2.220703 5.228515l-3.314453-0.01758-0.0293 5.994142 3.310547 0.01758a14.987803 14.987803 0 0 0 2.169922 5.251953l-2.371094 2.347656 4.214844 4.261719 2.373046-2.347656a14.987803 14.987803 0 0 0 5.228516 2.222656l-0.01758 3.3125 5.996094 0.0293 0.01758-3.310547a14.987803 14.987803 0 0 0 5.251953-2.167968l2.347662 2.371089 4.261719-4.216797-2.324219-2.347657a14.987803 14.987803 0 0 0 2.207031-5.253905l3.304688 0.01758 0.0293-5.996095-3.298828-0.01563a14.987803 14.987803 0 0 0-2.154297-5.27539l2.34375-2.324219-4.214844-4.263672-2.373047 2.347657a14.987803 14.987803 0 0 0-5.228515-2.220704l0.01758-3.314452zm2.166016 9.03711a8.992682 8.992682 0 0 1 7.130859 2.636718 8.992682 8.992682 0 0 1-0.06641 12.720702 8.992682 8.992682 0 0 1-12.71875-0.06836 8.992682 8.992682 0 0 1 0.06641-12.718749 8.992682 8.992682 0 0 1 5.587891-2.570311zm0.738281 3.96289a5 5 0 0 0-5 4.999999 5 5 0 0 0 5 5 5 5 0 0 0 5-5 5 5 0 0 0-5-4.999999z" fill="#e1cdc3" stroke-linejoin="bevel" stroke-width="3.1"/>
  <path d="m21.00195 19.985353-0.01758 3.310547a14.987803 14.987803 0 0 0-5.251953 2.169922l-2.347657-2.371094-4.261718 4.214844 2.347656 2.375a14.987803 14.987803 0 0 0-2.220703 5.228515l-3.314453-0.01758-0.0293 5.994142 3.310547 0.01758a14.987803 14.987803 0 0 0 2.169922 5.251953l-2.371094 2.347656 4.214844 4.261719 2.373046-2.347656a14.987803 14.987803 0 0 0 5.228516 2.222656l-0.01758 3.3125 5.996094 0.0293 0.01758-3.310547a14.987803 14.987803 0 0 0 5.251953-2.167968l2.347662 2.371089 4.261719-4.216797-2.324219-2.347657a14.987803 14.987803 0 0 0 2.207031-5.253905l3.304688 0.01758 0.0293-5.996095-3.298828-0.01563a14.987803 14.987803 0 0 0-2.154297-5.27539l2.34375-2.324219-4.214844-4.263672-2.373047 2.347657a14.987803 14.987803 0 0 0-5.228515-2.220704l0.01758-3.314452zm2.166016 9.03711a8.992682 8.992682 0 0 1 7.130859 2.636718 8.992682 8.992682 0 0 1-0.06641 12.720702 8.992682 8.992682 0 0 1-12.71875-0.06836 8.992682 8.992682 0 0 1 0.06641-12.718749 8.992682 8.992682 0 0 1 5.587891-2.570311zm0.738281 3.96289a5 5 0 0 0-5 4.999999 5 5 0 0 0 5 5 5 5 0 0 0 5-5 5 5 0 0 0-5-4.999999z" fill="#c3afa5" stroke-linejoin="bevel" stroke-width="3.1"/>
 </g>
 <path d="m4 40h56v16l-4 4h-48l-4-4z" fill="#000000" fill-opacity=".2" fill-rule="evenodd"/>
 <path d="m29.00195 7.985353-0.01758 3.310547a14.987803 14.987803 0 0 0-5.251953 2.169922l-2.347657-2.371094-4.261718 4.214844 2.347656 2.375a14.987803 14.987803 0 0 0-2.220703 5.228515l-3.314453-0.01758-0.0293 5.994142 3.310547 0.01758a14.987803 14.987803 0 0 0 2.169922 5.251953l-2.371094 2.347656 4.214844 4.261719 2.373046-2.347656a14.987803 14.987803 0 0 0 5.228516 2.222656l-0.01758 3.3125 5.996094 0.0293 0.01758-3.310547a14.987803 14.987803 0 0 0 5.251953-2.167968l2.347662 2.371089 4.261719-4.216797-2.324219-2.347657a14.987803 14.987803 0 0 0 2.207031-5.253905l3.304688 0.01758 0.0293-5.996095-3.298828-0.01563a14.987803 14.987803 0 0 0-2.154297-5.27539l2.34375-2.324219-4.214844-4.263672-2.373047 2.347657a14.987803 14.987803 0 0 0-5.228515-2.220704l0.01758-3.314452zm2.166016 9.03711a8.992682 8.992682 0 0 1 7.130859 2.636718 8.992682 8.992682 0 0 1-0.06641 12.720702 8.992682 8.992682 0 0 1-12.71875-0.06836 8.992682 8.992682 0 0 1 0.06641-12.718749 8.992682 8.992682 0 0 1 5.587891-2.570311zm0.738281 3.96289a5 5 0 0 0-5 4.999999 5 5 0 0 0 5 5 5 5 0 0 0 5-5 5 5 0 0 0-5-4.999999z" fill="#a59187" stroke-linejoin="bevel" stroke-width="3.1"/>
</svg>
