<svg version="1.1" viewBox="0 0 64 64" xmlns="http://www.w3.org/2000/svg">
 <path d="M 60,10 60.105263,54 58,56 H 6.2105262 L 4.105263,54 4.0000001,10.000001 6,8 h 52 z" fill="#5fbcd3" stroke-linejoin="bevel" stroke-width="3"/>
 <g stroke="#ffffff" stroke-linejoin="bevel">
  <path d="m28 24h8l4 4v8l-4 4h-8l-4-4v-8l4-4" fill="none"/>
  <path d="m28 24h28v-12h-16z" fill="none"/>
  <path d="m36 24 20 20v-20z" fill="#ffffff" fill-opacity=".5"/>
  <path d="m40 28v24h14l2-2v-6z" fill="none"/>
  <path d="m40 36-16 16h16z" fill="#ffffff" fill-opacity=".5"/>
  <path d="m36 40h-28v10l2 2h14l12-12" fill="none"/>
  <path d="m28 40-20-20v20z" fill="#ffffff" fill-opacity=".5"/>
  <path d="m24 36-16-16v-6l2-2h14z" fill="none"/>
  <path d="m24 28v-16h16z" fill="#ffffff" fill-opacity=".5"/>
 </g>
 <path d="m32 8v48h-26l-2-2v-44l2-2z" fill="#000000" opacity=".25"/>
</svg>
