<svg version="1.1" viewBox="0 0 64 64" xmlns="http://www.w3.org/2000/svg">
 <path d="m4 10 2-2h52l2 2v35h-56z" fill="#ffee66" stroke-width=".999989"/>
 <path d="m3.9999997 55 2 2h52l2-2v-10h-56z" fill="#e6e6e6" stroke-width=".522227"/>
 <path d="m45 46h-5.5v10h6v-5h-3" fill="none" stroke="#333333" stroke-linecap="round" stroke-linejoin="round" stroke-width="2"/>
 <path d="M 22.767578,25.847656 C 17.407826,25.867941 12.209107,27.681752 8,31 11.945243,28.950505 16.321808,27.869921 20.767578,27.847656 31.469177,27.850175 41.3076,33.382017 46,43 43.166066,32.542275 33.602484,25.850508 22.767578,25.847656 Z" fill="#87aade"/>
 <path d="m28.5 46 4 10 3-10" fill="none" stroke="#333333" stroke-linecap="round" stroke-linejoin="round" stroke-width="2"/>
 <path d="m24.5 47-1-1h-4l-1 1v3l1 1h4l1 1v3l-1 1h-4l-1-1" fill="none" stroke="#333333" stroke-linecap="round" stroke-linejoin="round" stroke-width="2"/>
 <g stroke="#333333" stroke-linecap="round" stroke-linejoin="round" stroke-width="3">
  <path d="m45.693239 42.394839-2.727404-16.048715" fill="#ffee66"/>
  <circle transform="rotate(-52.155448)" cx="8.1156349" cy="47.714836" r="2.7032175" fill="none"/>
 </g>
 <g transform="rotate(58.547635,37.902126,3.5771491)" stroke="#333333" stroke-linecap="round" stroke-linejoin="round" stroke-width="3">
  <path d="m45.693239 42.394839-2.727404-16.048715" fill="#ffee66"/>
  <circle transform="rotate(-52.155448)" cx="8.1156349" cy="47.714836" r="2.7032175" fill="none"/>
 </g>
 <path d="m3.9999997 53h56v2l-2 2h-52l-2-2z" fill="#000000" opacity=".25"/>
</svg>
