<svg version="1.1" viewBox="0 0 64 64" xmlns="http://www.w3.org/2000/svg">
 <path d="m6 8h52l2 2v44l-2 2h-52l-2-2v-44z" fill="#ffffff"/>
 <path d="m9 11h46l2 2v38l-2 2h-46l-2-2v-38z" fill="#1c3c66" stroke-opacity=".546554" stroke-width="17.5204"/>
 <path d="m7 13 2-2h2l2 2v38l-2 2h-2l-2-2z" fill="#808080"/>
 <path d="m8 32h4v2h-2v2h2v2h-2v2h2v2h-4z" fill="#ffec9c" stroke-width=".999996"/>
 <path d="m8 44h4v2h-2v2h2v2h-4z" fill="#ffec9c" stroke-width=".999996"/>
 <path d="m13 31h5l6 19 8-38 6 27 6-27 6 26h7" fill="none" opacity=".5" stroke="#ffffff" stroke-linejoin="bevel" stroke-width="3.5"/>
 <circle cx="36" cy="32.666668" r="12" fill="#ff0000" opacity=".75" stroke-width=".666667"/>
 <circle cx="36" cy="32.666668" r="3.6666667" fill="#ffffff" opacity=".75" stroke-width=".666667"/>
 <path d="m13 51v-1h44v1l-2 2h-44z" fill="#ffffff" fill-opacity=".201856"/>
</svg>
