<svg version="1.1" viewBox="0 0 64 64" xmlns="http://www.w3.org/2000/svg">
 <path d="m28 4c11 0 16 3 28 14 0 0-4.080655 13.753255-6 20s-2 18-2 18-18 4-24 4-8-4-8-4l-8-44s9-8 20-8z" fill="#e6e6e6" stroke-opacity=".546554" stroke-width="17.5204"/>
 <g fill="#808080" stroke-width=".999994">
  <path transform="scale(1,-1)" d="m16-50s4.860838 3.330163 4 11-6 15-9 15z"/>
  <path transform="scale(1,-1)" d="m23-31h8v3h-3v16h3v5c-9 0-16-2-20-7z" opacity=".5"/>
  <path d="m41 31h-8v-3h3v-16h-3v-5s6 0 18 10z" opacity=".5"/>
 </g>
 <path d="m16 56s2 2 8 2 24-6 24-6v4s-18 4-24 4-8-4-8-4z" fill="#000000" fill-opacity=".201856"/>
 <rect x="30" y="14" width="4" height="12" fill="#808080"/>
</svg>
