<svg version="1.1" viewBox="0 0 64 64" xmlns="http://www.w3.org/2000/svg">
 <circle cx="32" cy="31.999998" r="27.999998" fill="#ffec9c"/>
 <path d="M 44,27 34,51 30,45 24.748047,59.003906 A 27.999998,27.999998 0 0 0 32,60 27.999998,27.999998 0 0 0 59.496094,36.992188 L 57,32 52,49 Z" fill="#4d4d4d"/>
 <path d="m30.25 12.5-4 2-1 3v3h-2l-1-2 1-2-1-2h-3v3h-2l-2 2-4 2-2 2 4 5 5 2v-1h1l-1.386719 1.664062c-0.778247-0.423286-1.66929-0.664062-2.613281-0.664062-3.025715 0-5.5 2.474285-5.5 5.5s2.474285 5.5 5.5 5.5 5.5-2.474285 5.5-5.5c0-0.315619-0.02841-0.624345-0.08008-0.925781l2.58008-0.574219 2.511719-0.837891c-0.006888 0.112058-0.011719 0.224174-0.011719 0.337891 0 3.025715 2.474285 5.5 5.5 5.5s5.5-2.474285 5.5-5.5c0-2.913312-2.294707-5.313831-5.166016-5.488281l-0.333984-3.011719 3-1-1-3 1-1v-3h-2v-1l1-1-1-2zm-7 9h2l1 2h-3zm4 3v3l-3 1-1-3zm3 1 0.337891 3.042969c-0.40753 0.04949-0.802149 0.143004-1.177735 0.277343l-1.160156-2.320312zm-4 3v1l-1 1-1-1zm2 0 0.396484 0.660156c-1.374641 0.744291-2.400165 2.056306-2.757812 3.617188l-0.638672-1.277344zm-6 2v2l-2.199219 0.824219c-0.16709-0.297902-0.360544-0.579127-0.578125-0.839844zm8.558594 0.0293 0.15625 1.398437-0.650391-1.302737c0.160037-0.0437 0.325527-0.07479 0.494141-0.0957zm1.001953 0.01563c1.674415 0.265535 2.939453 1.701417 2.939453 3.45507 0 1.944837-1.555163 3.5-3.5 3.5s-3.5-1.555163-3.5-3.5c0-1.375809 0.777956-2.555717 1.921875-3.128906l1.441406 2.402344 0.136719 1.226562h1zm-16.560547 1.95507c0.458606 0 0.894934 0.08843 1.294922 0.246094l-2.294922 2.753906v1l4.464844-0.992188c0.022317 0.160944 0.035156 0.324722 0.035156 0.492188 0 1.944837-1.555163 3.5-3.5 3.5s-3.5-1.555163-3.5-3.5 1.555163-3.5 3.5-3.5zm2.597656 1.144531c0.111607 0.12309 0.215362 0.252311 0.308594 0.390625l-1.800781 0.675782z" color="#000000" fill="#4d4d4d" stroke-linecap="round" stroke-linejoin="round" style="-inkscape-stroke:none"/>
</svg>
