<svg version="1.1" viewBox="0 0 64 64" xmlns="http://www.w3.org/2000/svg">
 <g fill="#808080">
  <path d="m6 7h34l-8 13h-26l-2 2v-13z" fill="#808080" stroke-opacity=".546554" stroke-width="2"/>
 </g>
 <g stroke-opacity=".546554">
  <path d="m10 13h27l-5 7h-22z" fill="#e6e6e6" stroke-width="2"/>
  <g stroke-width="17.5204">
   <path d="m38 7-6.769531 11h-27.230469v4l2-2h26l8-13z" fill="#000000" opacity=".310827"/>
   <path d="m6 20h26l8-13h18l2 2v47l-2 2h-52l-2-2v-34z" fill="#ffec9c"/>
   <path d="m44.644531 23.009766c-7.812575 0.150893-15.253965 4.669635-18.724609 12.220703-0.665054 1.446954-1.15155 2.93168-1.466797 4.429687l-6.453125 0.339844 6.009766 4.207031c1.89e-4 0.015588-2.25e-4 0.03129 0 0.046875l0.052734-0.009765 3.9375 2.755859 9-8-6.244141 0.328125c0.176831-0.534945 0.374114-1.067191 0.615235-1.591797 3.474527-7.559514 12.333061-10.839762 19.892578-7.365234 5.33878 2.453827 8.538235 7.59398 8.736328 13.064453v-14.119141c-1.743604-1.788234-3.832016-3.2941-6.230469-4.396484-2.954765-1.358079-6.067905-1.969202-9.125-1.910156zm15.355469 21.578125c-0.078589 1.904542-0.522204 3.828854-1.371094 5.675781-1.70297 3.705144-4.700265 6.378652-8.203125 7.736328h7.574219l2-2v-11.412109zm-27.796875 7.267578-6.144531 1.167969c0.853211 1.795833 1.963743 3.473912 3.302734 4.976562h10.261719c-0.296913-0.114645-0.593328-0.236245-0.886719-0.371094-2.813569-1.29318-5.032886-3.333004-6.533203-5.773437z" fill="#808080"/>
  </g>
 </g>
 <path d="m42 30v14.857422 0.142578h0.357422l8.927734 3.570312 1.484375-3.71289-6.769531-2.708984v-12.148438h-4z" fill="#808080"/>
</svg>
