<svg version="1.1" viewBox="0 0 16 16" xmlns="http://www.w3.org/2000/svg">
 <g transform="matrix(-1,0,0,1,15.999944,0)">
  <path d="m13.999944 3v6h-12v-6" fill="none" stroke="#e6e6e6" stroke-linecap="round" stroke-linejoin="round" stroke-width="2"/>
  <g>
   <rect transform="scale(-1,1)" x="-11.999944" y="10" width="8" height="5" fill="#ffec9c"/>
   <rect transform="scale(-1,1)" x="-11.999944" y="1" width="8" height="1" fill="#ffec9c"/>
   <rect transform="scale(-1,1)" x="-12.999944" y="6" width="2" height="2" fill="#ffffff"/>
  </g>
 </g>
</svg>
