{
    "env": {
        "compiler": "bit.envs/compilers/react@0.0.14"
    },
    "dependencies": {},
    "componentsDefaultDirectory": "src/components/{namespace}/{name}",
    "packageManager": "yarn",
    "resolveModules": {
        "modulesDirectories": [
            "src"
        ]
    }
}