%YAML 1.1
%TAG !u! tag:unity3d.com,2011:
--- !u!114 &11400000
MonoBehaviour:
  m_ObjectHideFlags: 0
  m_CorrespondingSourceObject: {fileID: 0}
  m_PrefabInstance: {fileID: 0}
  m_PrefabAsset: {fileID: 0}
  m_GameObject: {fileID: 0}
  m_Enabled: 1
  m_EditorHideFlags: 0
  m_Script: {fileID: 11500000, guid: 468a46d0ae32c3544b7d98094e6448a9, type: 3}
  m_Name: AddressableAssetSettings
  m_EditorClassIdentifier: 
  m_DefaultGroup: 0522248287b133242925495faad658a9
  m_BuildRemoteCatalog: 0
  m_BundleLocalCatalog: 0
  m_DisableCatalogUpdateOnStart: 0
  m_UniqueBundleIds: 0
  m_RemoteCatalogBuildPath:
    m_Id: 
  m_RemoteCatalogLoadPath:
    m_Id: 
  m_overridePlayerVersion: 
  m_GroupAssets:
  - {fileID: 11400000, guid: d1917948b715dce4fb7ffc6dc6813d17, type: 2}
  - {fileID: 11400000, guid: f24151c1176392548a6ecae65e554c3f, type: 2}
  m_BuildSettings:
    m_CompileScriptsInVirtualMode: 0
    m_CleanupStreamingAssetsAfterBuilds: 1
    m_LogResourceManagerExceptions: 1
    m_BundleBuildPath: Temp/com.unity.addressables/AssetBundles
  m_ProfileSettings:
    m_Profiles:
    - m_InheritedParent: 
      m_Id: d32cd9d577a09ee46b528449729e0f18
      m_ProfileName: Default
      m_Values:
      - m_Id: 41a7a15ca50b026439825f9697e5aee7
        m_Value: '[UnityEditor.EditorUserBuildSettings.activeBuildTarget]'
      - m_Id: 708fac241053de3478590453b08e9ba2
        m_Value: '[UnityEngine.AddressableAssets.Addressables.BuildPath]/[BuildTarget]'
      - m_Id: 3d2c1c794728e844b8bfdfe45b27982b
        m_Value: '{UnityEngine.AddressableAssets.Addressables.RuntimePath}/[BuildTarget]'
      - m_Id: a441ab310cd4bba4d9ad08f7058b63f8
        m_Value: ServerData/[BuildTarget]
      - m_Id: d6c197ca22cd81944a319a5555197617
        m_Value: http://localhost/[BuildTarget]
    m_ProfileEntryNames:
    - m_Id: 41a7a15ca50b026439825f9697e5aee7
      m_Name: BuildTarget
      m_InlineUsage: 0
    - m_Id: 708fac241053de3478590453b08e9ba2
      m_Name: LocalBuildPath
      m_InlineUsage: 0
    - m_Id: 3d2c1c794728e844b8bfdfe45b27982b
      m_Name: LocalLoadPath
      m_InlineUsage: 0
    - m_Id: a441ab310cd4bba4d9ad08f7058b63f8
      m_Name: RemoteBuildPath
      m_InlineUsage: 0
    - m_Id: d6c197ca22cd81944a319a5555197617
      m_Name: RemoteLoadPath
      m_InlineUsage: 0
    m_ProfileVersion: 1
  m_LabelTable:
    m_LabelNames:
    - default
  m_SchemaTemplates: []
  m_GroupTemplateObjects:
  - {fileID: 11400000, guid: 2b9675199179d32469d83a02e7db35e9, type: 2}
  m_InitializationObjects: []
  m_CertificateHandlerType:
    m_AssemblyName: 
    m_ClassName: 
  m_ActivePlayerDataBuilderIndex: 3
  m_DataBuilders:
  - {fileID: 11400000, guid: 8ed5c3a465c15a44ba2b0928d6d64f30, type: 2}
  - {fileID: 11400000, guid: 5a8a6b04e594a644c81236bdab6d2807, type: 2}
  - {fileID: 11400000, guid: d2523952626ac70499e5c1df58beef2c, type: 2}
  - {fileID: 11400000, guid: 2c0dff16811c0014c8fffcd8d5a5c7e3, type: 2}
  m_ActiveProfileId: d32cd9d577a09ee46b528449729e0f18
  m_HostingServicesManager:
    m_HostingServiceInfos: []
    m_Settings: {fileID: 11400000}
    m_NextInstanceId: 0
    m_RegisteredServiceTypeRefs: []
