{
    "contenu_adulte": "false",
    "display_season_title": "true",
    "deco_color": "lightcoral",
    "poster_tmdb": "w342",
    "backdrop_tmdb": "w1280",
    "active-view": "false",
    "history-view": "true",
    "bstoken": "",
    "meta-view": "false",
    "tmdb_account": "",
    "tmdb_session": "",
    "api_tmdb": "b7cf9324cbeb6f4fb811144aa9397093",
    "pastebin_nbItemParPage": "",
    "pastebin_cacheDuration": "",
    "pastebin_url":"",
    "hoster_alldebrid_premium": "false",
    "hoster_alldebrid_token": "",
    "urlmain_alldebrid": "",
    "hoster_darkibox_premium": "false",
    "hoster_darkibox_token": "",
    "hoster_debridlink_premium": "false",
    "hoster_debridlink_ID": "",
    "hoster_debridlink_token": "",
    "hoster_debridlink_tokenrefresh": "",
    "hoster_uptobox_premium": "false",
    "hoster_uptobox_username": "",
    "hoster_uptobox_password": "",
    "hoster_uptobox_token": "",
    "hoster_uptobox_mode_default": "0",
    "hoster_onefichier_premium": "false",
    "hoster_onefichier_username": "",
    "hoster_onefichier_password": "",
    "hoster_realdebrid_premium": "false",
    "hoster_realdebrid_token": "",
    "hoster_uploaded_premium": "false",
    "hoster_uploaded_username": "",
    "hoster_uploaded_password": ""
}