{
    "servers": [
        {
            "graphics_url": "http://www.iptvplayer.gitlab.io/update2/",
            "name": "www.iptvplayer.gitlab.io",
            "url": "http://www.iptvplayer.gitlab.io/update2/2018.11.03.01_python2.6.tar.gz",
            "pyver": "2.6",
            "packagetype": "precompiled",
            "subdir": "iptvplayer-for-e2.git/",
            "version": "2018.11.03.01",
            "commit_stamp": "aea83667c2016dbf43c1c2a5652f3abd449c75bb",
            "icons_url": "http://www.iptvplayer.gitlab.io/update2/"
        },
        {
            "graphics_url": "http://www.iptvplayer.gitlab.io/update2/",
            "name": "www.iptvplayer.gitlab.io",
            "url": "http://www.iptvplayer.gitlab.io/update2/2018.11.03.01_python2.7.tar.gz",
            "pyver": "2.7",
            "packagetype": "precompiled",
            "subdir": "iptvplayer-for-e2.git/",
            "version": "2018.11.03.01",
            "commit_stamp": "aea83667c2016dbf43c1c2a5652f3abd449c75bb",
            "icons_url": "http://www.iptvplayer.gitlab.io/update2/"
        },
        {
            "graphics_url": "http://www.iptvplayer.gitlab.io/update2/",
            "name": "www.iptvplayer.gitlab.io",
            "url": "http://www.iptvplayer.gitlab.io/update2/2018.11.03.01_pythonX.X.tar.gz",
            "pyver": "X.X",
            "packagetype": "sourcecode",
            "subdir": "iptvplayer-for-e2.git/",
            "version": "2018.11.03.01",
            "commit_stamp": "aea83667c2016dbf43c1c2a5652f3abd449c75bb",
            "icons_url": "http://www.iptvplayer.gitlab.io/update2/"
        },
        {
            "graphics_url": "http://www.iptvplayer.gitlab.io/update2/",
            "name": "www.iptvplayer.gitlab.io",
            "url": "http://www.iptvplayer.gitlab.io/update2/2018.11.03.02_python2.6.tar.gz",
            "pyver": "2.6",
            "packagetype": "precompiled",
            "subdir": "iptvplayer-for-e2.git/",
            "version": "2018.11.03.02",
            "commit_stamp": "32b78b5189744df86c4c49f299ce6a2edfb3b637",
            "icons_url": "http://www.iptvplayer.gitlab.io/update2/"
        },
        {
            "graphics_url": "http://www.iptvplayer.gitlab.io/update2/",
            "name": "www.iptvplayer.gitlab.io",
            "url": "http://www.iptvplayer.gitlab.io/update2/2018.11.03.02_python2.7.tar.gz",
            "pyver": "2.7",
            "packagetype": "precompiled",
            "subdir": "iptvplayer-for-e2.git/",
            "version": "2018.11.03.02",
            "commit_stamp": "32b78b5189744df86c4c49f299ce6a2edfb3b637",
            "icons_url": "http://www.iptvplayer.gitlab.io/update2/"
        },
        {
            "graphics_url": "http://www.iptvplayer.gitlab.io/update2/",
            "name": "www.iptvplayer.gitlab.io",
            "url": "http://www.iptvplayer.gitlab.io/update2/2018.11.03.02_pythonX.X.tar.gz",
            "pyver": "X.X",
            "packagetype": "sourcecode",
            "subdir": "iptvplayer-for-e2.git/",
            "version": "2018.11.03.02",
            "commit_stamp": "32b78b5189744df86c4c49f299ce6a2edfb3b637",
            "icons_url": "http://www.iptvplayer.gitlab.io/update2/"
        },
        {
            "graphics_url": "http://www.iptvplayer.gitlab.io/update2/",
            "name": "www.iptvplayer.gitlab.io",
            "url": "http://www.iptvplayer.gitlab.io/update2/2018.11.03.03_python2.6.tar.gz",
            "pyver": "2.6",
            "packagetype": "precompiled",
            "subdir": "iptvplayer-for-e2.git/",
            "version": "2018.11.03.03",
            "commit_stamp": "4e00b2be8ae8b9492d7908ccbca09047614d8975",
            "icons_url": "http://www.iptvplayer.gitlab.io/update2/"
        },
        {
            "graphics_url": "http://www.iptvplayer.gitlab.io/update2/",
            "name": "www.iptvplayer.gitlab.io",
            "url": "http://www.iptvplayer.gitlab.io/update2/2018.11.03.03_python2.7.tar.gz",
            "pyver": "2.7",
            "packagetype": "precompiled",
            "subdir": "iptvplayer-for-e2.git/",
            "version": "2018.11.03.03",
            "commit_stamp": "4e00b2be8ae8b9492d7908ccbca09047614d8975",
            "icons_url": "http://www.iptvplayer.gitlab.io/update2/"
        },
        {
            "graphics_url": "http://www.iptvplayer.gitlab.io/update2/",
            "name": "www.iptvplayer.gitlab.io",
            "url": "http://www.iptvplayer.gitlab.io/update2/2018.11.03.03_pythonX.X.tar.gz",
            "pyver": "X.X",
            "packagetype": "sourcecode",
            "subdir": "iptvplayer-for-e2.git/",
            "version": "2018.11.03.03",
            "commit_stamp": "4e00b2be8ae8b9492d7908ccbca09047614d8975",
            "icons_url": "http://www.iptvplayer.gitlab.io/update2/"
        },
        {
            "graphics_url": "http://www.iptvplayer.gitlab.io/update2/",
            "name": "www.iptvplayer.gitlab.io",
            "url": "http://www.iptvplayer.gitlab.io/update2/2018.11.03.04_python2.6.tar.gz",
            "pyver": "2.6",
            "packagetype": "precompiled",
            "subdir": "iptvplayer-for-e2.git/",
            "version": "2018.11.03.04",
            "commit_stamp": "39f32fb9c6b0d03a609cec874b6cac89d74f8ec9",
            "icons_url": "http://www.iptvplayer.gitlab.io/update2/"
        },
        {
            "graphics_url": "http://www.iptvplayer.gitlab.io/update2/",
            "name": "www.iptvplayer.gitlab.io",
            "url": "http://www.iptvplayer.gitlab.io/update2/2018.11.03.04_python2.7.tar.gz",
            "pyver": "2.7",
            "packagetype": "precompiled",
            "subdir": "iptvplayer-for-e2.git/",
            "version": "2018.11.03.04",
            "commit_stamp": "39f32fb9c6b0d03a609cec874b6cac89d74f8ec9",
            "icons_url": "http://www.iptvplayer.gitlab.io/update2/"
        },
        {
            "graphics_url": "http://www.iptvplayer.gitlab.io/update2/",
            "name": "www.iptvplayer.gitlab.io",
            "url": "http://www.iptvplayer.gitlab.io/update2/2018.11.03.04_pythonX.X.tar.gz",
            "pyver": "X.X",
            "packagetype": "sourcecode",
            "subdir": "iptvplayer-for-e2.git/",
            "version": "2018.11.03.04",
            "commit_stamp": "39f32fb9c6b0d03a609cec874b6cac89d74f8ec9",
            "icons_url": "http://www.iptvplayer.gitlab.io/update2/"
        },
        {
            "graphics_url": "http://www.iptvplayer.gitlab.io/update2/",
            "name": "www.iptvplayer.gitlab.io",
            "url": "http://www.iptvplayer.gitlab.io/update2/2018.11.03.05_python2.6.tar.gz",
            "pyver": "2.6",
            "packagetype": "precompiled",
            "subdir": "iptvplayer-for-e2.git/",
            "version": "2018.11.03.05",
            "commit_stamp": "ab3292684ceb5e434612ef68ec8852006d5cf9cb",
            "icons_url": "http://www.iptvplayer.gitlab.io/update2/"
        },
        {
            "graphics_url": "http://www.iptvplayer.gitlab.io/update2/",
            "name": "www.iptvplayer.gitlab.io",
            "url": "http://www.iptvplayer.gitlab.io/update2/2018.11.03.05_python2.7.tar.gz",
            "pyver": "2.7",
            "packagetype": "precompiled",
            "subdir": "iptvplayer-for-e2.git/",
            "version": "2018.11.03.05",
            "commit_stamp": "ab3292684ceb5e434612ef68ec8852006d5cf9cb",
            "icons_url": "http://www.iptvplayer.gitlab.io/update2/"
        },
        {
            "graphics_url": "http://www.iptvplayer.gitlab.io/update2/",
            "name": "www.iptvplayer.gitlab.io",
            "url": "http://www.iptvplayer.gitlab.io/update2/2018.11.03.05_pythonX.X.tar.gz",
            "pyver": "X.X",
            "packagetype": "sourcecode",
            "subdir": "iptvplayer-for-e2.git/",
            "version": "2018.11.03.05",
            "commit_stamp": "ab3292684ceb5e434612ef68ec8852006d5cf9cb",
            "icons_url": "http://www.iptvplayer.gitlab.io/update2/"
        },
        {
            "graphics_url": "http://www.iptvplayer.gitlab.io/update2/",
            "name": "www.iptvplayer.gitlab.io",
            "url": "http://www.iptvplayer.gitlab.io/update2/2018.11.04.01_python2.6.tar.gz",
            "pyver": "2.6",
            "packagetype": "precompiled",
            "subdir": "iptvplayer-for-e2.git/",
            "version": "2018.11.04.01",
            "commit_stamp": "bc40b5c428b9a626f9db46e02d00abd50729e3fd",
            "icons_url": "http://www.iptvplayer.gitlab.io/update2/"
        },
        {
            "graphics_url": "http://www.iptvplayer.gitlab.io/update2/",
            "name": "www.iptvplayer.gitlab.io",
            "url": "http://www.iptvplayer.gitlab.io/update2/2018.11.04.01_python2.7.tar.gz",
            "pyver": "2.7",
            "packagetype": "precompiled",
            "subdir": "iptvplayer-for-e2.git/",
            "version": "2018.11.04.01",
            "commit_stamp": "bc40b5c428b9a626f9db46e02d00abd50729e3fd",
            "icons_url": "http://www.iptvplayer.gitlab.io/update2/"
        },
        {
            "graphics_url": "http://www.iptvplayer.gitlab.io/update2/",
            "name": "www.iptvplayer.gitlab.io",
            "url": "http://www.iptvplayer.gitlab.io/update2/2018.11.04.01_pythonX.X.tar.gz",
            "pyver": "X.X",
            "packagetype": "sourcecode",
            "subdir": "iptvplayer-for-e2.git/",
            "version": "2018.11.04.01",
            "commit_stamp": "bc40b5c428b9a626f9db46e02d00abd50729e3fd",
            "icons_url": "http://www.iptvplayer.gitlab.io/update2/"
        },
        {
            "graphics_url": "http://www.iptvplayer.gitlab.io/update2/",
            "name": "www.iptvplayer.gitlab.io",
            "url": "http://www.iptvplayer.gitlab.io/update2/2018.11.04.02_python2.6.tar.gz",
            "pyver": "2.6",
            "packagetype": "precompiled",
            "subdir": "iptvplayer-for-e2.git/",
            "version": "2018.11.04.02",
            "commit_stamp": "b819a80019a76494f1ca81f62692a76cf6be3353",
            "icons_url": "http://www.iptvplayer.gitlab.io/update2/"
        },
        {
            "graphics_url": "http://www.iptvplayer.gitlab.io/update2/",
            "name": "www.iptvplayer.gitlab.io",
            "url": "http://www.iptvplayer.gitlab.io/update2/2018.11.04.02_python2.7.tar.gz",
            "pyver": "2.7",
            "packagetype": "precompiled",
            "subdir": "iptvplayer-for-e2.git/",
            "version": "2018.11.04.02",
            "commit_stamp": "b819a80019a76494f1ca81f62692a76cf6be3353",
            "icons_url": "http://www.iptvplayer.gitlab.io/update2/"
        },
        {
            "graphics_url": "http://www.iptvplayer.gitlab.io/update2/",
            "name": "www.iptvplayer.gitlab.io",
            "url": "http://www.iptvplayer.gitlab.io/update2/2018.11.04.02_pythonX.X.tar.gz",
            "pyver": "X.X",
            "packagetype": "sourcecode",
            "subdir": "iptvplayer-for-e2.git/",
            "version": "2018.11.04.02",
            "commit_stamp": "b819a80019a76494f1ca81f62692a76cf6be3353",
            "icons_url": "http://www.iptvplayer.gitlab.io/update2/"
        },
        {
            "graphics_url": "http://www.iptvplayer.gitlab.io/update2/",
            "name": "www.iptvplayer.gitlab.io",
            "url": "http://www.iptvplayer.gitlab.io/update2/2018.11.04.03_python2.6.tar.gz",
            "pyver": "2.6",
            "packagetype": "precompiled",
            "subdir": "iptvplayer-for-e2.git/",
            "version": "2018.11.04.03",
            "commit_stamp": "5518400349690f5f0cd787e40cf094452677b241",
            "icons_url": "http://www.iptvplayer.gitlab.io/update2/"
        },
        {
            "graphics_url": "http://www.iptvplayer.gitlab.io/update2/",
            "name": "www.iptvplayer.gitlab.io",
            "url": "http://www.iptvplayer.gitlab.io/update2/2018.11.04.03_python2.7.tar.gz",
            "pyver": "2.7",
            "packagetype": "precompiled",
            "subdir": "iptvplayer-for-e2.git/",
            "version": "2018.11.04.03",
            "commit_stamp": "5518400349690f5f0cd787e40cf094452677b241",
            "icons_url": "http://www.iptvplayer.gitlab.io/update2/"
        },
        {
            "graphics_url": "http://www.iptvplayer.gitlab.io/update2/",
            "name": "www.iptvplayer.gitlab.io",
            "url": "http://www.iptvplayer.gitlab.io/update2/2018.11.04.03_pythonX.X.tar.gz",
            "pyver": "X.X",
            "packagetype": "sourcecode",
            "subdir": "iptvplayer-for-e2.git/",
            "version": "2018.11.04.03",
            "commit_stamp": "5518400349690f5f0cd787e40cf094452677b241",
            "icons_url": "http://www.iptvplayer.gitlab.io/update2/"
        },
        {
            "graphics_url": "http://www.iptvplayer.gitlab.io/update2/",
            "name": "www.iptvplayer.gitlab.io",
            "url": "http://www.iptvplayer.gitlab.io/update2/2018.11.04.04_python2.6.tar.gz",
            "pyver": "2.6",
            "packagetype": "precompiled",
            "subdir": "iptvplayer-for-e2.git/",
            "version": "2018.11.04.04",
            "commit_stamp": "56712f95086b10d9b3be5b8b3732740f43d1b60d",
            "icons_url": "http://www.iptvplayer.gitlab.io/update2/"
        },
        {
            "graphics_url": "http://www.iptvplayer.gitlab.io/update2/",
            "name": "www.iptvplayer.gitlab.io",
            "url": "http://www.iptvplayer.gitlab.io/update2/2018.11.04.04_python2.7.tar.gz",
            "pyver": "2.7",
            "packagetype": "precompiled",
            "subdir": "iptvplayer-for-e2.git/",
            "version": "2018.11.04.04",
            "commit_stamp": "56712f95086b10d9b3be5b8b3732740f43d1b60d",
            "icons_url": "http://www.iptvplayer.gitlab.io/update2/"
        },
        {
            "graphics_url": "http://www.iptvplayer.gitlab.io/update2/",
            "name": "www.iptvplayer.gitlab.io",
            "url": "http://www.iptvplayer.gitlab.io/update2/2018.11.04.04_pythonX.X.tar.gz",
            "pyver": "X.X",
            "packagetype": "sourcecode",
            "subdir": "iptvplayer-for-e2.git/",
            "version": "2018.11.04.04",
            "commit_stamp": "56712f95086b10d9b3be5b8b3732740f43d1b60d",
            "icons_url": "http://www.iptvplayer.gitlab.io/update2/"
        },
        {
            "graphics_url": "http://www.iptvplayer.gitlab.io/update2/",
            "name": "www.iptvplayer.gitlab.io",
            "url": "http://www.iptvplayer.gitlab.io/update2/2018.11.04.05_python2.6.tar.gz",
            "pyver": "2.6",
            "packagetype": "precompiled",
            "subdir": "iptvplayer-for-e2.git/",
            "version": "2018.11.04.05",
            "commit_stamp": "008d7626a98207687e88270c4bcec53115c27699",
            "icons_url": "http://www.iptvplayer.gitlab.io/update2/"
        },
        {
            "graphics_url": "http://www.iptvplayer.gitlab.io/update2/",
            "name": "www.iptvplayer.gitlab.io",
            "url": "http://www.iptvplayer.gitlab.io/update2/2018.11.04.05_python2.7.tar.gz",
            "pyver": "2.7",
            "packagetype": "precompiled",
            "subdir": "iptvplayer-for-e2.git/",
            "version": "2018.11.04.05",
            "commit_stamp": "008d7626a98207687e88270c4bcec53115c27699",
            "icons_url": "http://www.iptvplayer.gitlab.io/update2/"
        },
        {
            "graphics_url": "http://www.iptvplayer.gitlab.io/update2/",
            "name": "www.iptvplayer.gitlab.io",
            "url": "http://www.iptvplayer.gitlab.io/update2/2018.11.04.05_pythonX.X.tar.gz",
            "pyver": "X.X",
            "packagetype": "sourcecode",
            "subdir": "iptvplayer-for-e2.git/",
            "version": "2018.11.04.05",
            "commit_stamp": "008d7626a98207687e88270c4bcec53115c27699",
            "icons_url": "http://www.iptvplayer.gitlab.io/update2/"
        },
        {
            "graphics_url": "http://www.iptvplayer.gitlab.io/update2/",
            "name": "www.iptvplayer.gitlab.io",
            "url": "http://www.iptvplayer.gitlab.io/update2/2018.11.05.01_python2.6.tar.gz",
            "pyver": "2.6",
            "packagetype": "precompiled",
            "subdir": "iptvplayer-for-e2.git/",
            "version": "2018.11.05.01",
            "commit_stamp": "ed4492a941a1fef3367ca967d1703777c84de56d",
            "icons_url": "http://www.iptvplayer.gitlab.io/update2/"
        },
        {
            "graphics_url": "http://www.iptvplayer.gitlab.io/update2/",
            "name": "www.iptvplayer.gitlab.io",
            "url": "http://www.iptvplayer.gitlab.io/update2/2018.11.05.01_python2.7.tar.gz",
            "pyver": "2.7",
            "packagetype": "precompiled",
            "subdir": "iptvplayer-for-e2.git/",
            "version": "2018.11.05.01",
            "commit_stamp": "ed4492a941a1fef3367ca967d1703777c84de56d",
            "icons_url": "http://www.iptvplayer.gitlab.io/update2/"
        },
        {
            "graphics_url": "http://www.iptvplayer.gitlab.io/update2/",
            "name": "www.iptvplayer.gitlab.io",
            "url": "http://www.iptvplayer.gitlab.io/update2/2018.11.05.01_pythonX.X.tar.gz",
            "pyver": "X.X",
            "packagetype": "sourcecode",
            "subdir": "iptvplayer-for-e2.git/",
            "version": "2018.11.05.01",
            "commit_stamp": "ed4492a941a1fef3367ca967d1703777c84de56d",
            "icons_url": "http://www.iptvplayer.gitlab.io/update2/"
        },
        {
            "graphics_url": "http://www.iptvplayer.gitlab.io/update2/",
            "name": "www.iptvplayer.gitlab.io",
            "url": "http://www.iptvplayer.gitlab.io/update2/2018.11.05.03_python2.6.tar.gz",
            "pyver": "2.6",
            "packagetype": "precompiled",
            "subdir": "iptvplayer-for-e2.git/",
            "version": "2018.11.05.03",
            "commit_stamp": "5b04475931e1f1ece3dd25f38f1a892bb45fda71",
            "icons_url": "http://www.iptvplayer.gitlab.io/update2/"
        },
        {
            "graphics_url": "http://www.iptvplayer.gitlab.io/update2/",
            "name": "www.iptvplayer.gitlab.io",
            "url": "http://www.iptvplayer.gitlab.io/update2/2018.11.05.03_python2.7.tar.gz",
            "pyver": "2.7",
            "packagetype": "precompiled",
            "subdir": "iptvplayer-for-e2.git/",
            "version": "2018.11.05.03",
            "commit_stamp": "5b04475931e1f1ece3dd25f38f1a892bb45fda71",
            "icons_url": "http://www.iptvplayer.gitlab.io/update2/"
        },
        {
            "graphics_url": "http://www.iptvplayer.gitlab.io/update2/",
            "name": "www.iptvplayer.gitlab.io",
            "url": "http://www.iptvplayer.gitlab.io/update2/2018.11.05.03_pythonX.X.tar.gz",
            "pyver": "X.X",
            "packagetype": "sourcecode",
            "subdir": "iptvplayer-for-e2.git/",
            "version": "2018.11.05.03",
            "commit_stamp": "5b04475931e1f1ece3dd25f38f1a892bb45fda71",
            "icons_url": "http://www.iptvplayer.gitlab.io/update2/"
        },
        {
            "graphics_url": "http://www.iptvplayer.gitlab.io/update2/",
            "name": "www.iptvplayer.gitlab.io",
            "url": "http://www.iptvplayer.gitlab.io/update2/2018.11.07.01_python2.6.tar.gz",
            "pyver": "2.6",
            "packagetype": "precompiled",
            "subdir": "iptvplayer-for-e2.git/",
            "version": "2018.11.07.01",
            "commit_stamp": "ac12c055c57c3d5189bbad7740d7f56eb6ab8340",
            "icons_url": "http://www.iptvplayer.gitlab.io/update2/"
        },
        {
            "graphics_url": "http://www.iptvplayer.gitlab.io/update2/",
            "name": "www.iptvplayer.gitlab.io",
            "url": "http://www.iptvplayer.gitlab.io/update2/2018.11.07.01_python2.7.tar.gz",
            "pyver": "2.7",
            "packagetype": "precompiled",
            "subdir": "iptvplayer-for-e2.git/",
            "version": "2018.11.07.01",
            "commit_stamp": "ac12c055c57c3d5189bbad7740d7f56eb6ab8340",
            "icons_url": "http://www.iptvplayer.gitlab.io/update2/"
        },
        {
            "graphics_url": "http://www.iptvplayer.gitlab.io/update2/",
            "name": "www.iptvplayer.gitlab.io",
            "url": "http://www.iptvplayer.gitlab.io/update2/2018.11.07.01_pythonX.X.tar.gz",
            "pyver": "X.X",
            "packagetype": "sourcecode",
            "subdir": "iptvplayer-for-e2.git/",
            "version": "2018.11.07.01",
            "commit_stamp": "ac12c055c57c3d5189bbad7740d7f56eb6ab8340",
            "icons_url": "http://www.iptvplayer.gitlab.io/update2/"
        },
        {
            "graphics_url": "http://www.iptvplayer.gitlab.io/update2/",
            "name": "www.iptvplayer.gitlab.io",
            "url": "http://www.iptvplayer.gitlab.io/update2/2018.11.07.02_python2.6.tar.gz",
            "pyver": "2.6",
            "packagetype": "precompiled",
            "subdir": "iptvplayer-for-e2.git/",
            "version": "2018.11.07.02",
            "commit_stamp": "c74bea3428514da5f41c717d65d63b65e00e16fb",
            "icons_url": "http://www.iptvplayer.gitlab.io/update2/"
        },
        {
            "graphics_url": "http://www.iptvplayer.gitlab.io/update2/",
            "name": "www.iptvplayer.gitlab.io",
            "url": "http://www.iptvplayer.gitlab.io/update2/2018.11.07.02_python2.7.tar.gz",
            "pyver": "2.7",
            "packagetype": "precompiled",
            "subdir": "iptvplayer-for-e2.git/",
            "version": "2018.11.07.02",
            "commit_stamp": "c74bea3428514da5f41c717d65d63b65e00e16fb",
            "icons_url": "http://www.iptvplayer.gitlab.io/update2/"
        },
        {
            "graphics_url": "http://www.iptvplayer.gitlab.io/update2/",
            "name": "www.iptvplayer.gitlab.io",
            "url": "http://www.iptvplayer.gitlab.io/update2/2018.11.07.02_pythonX.X.tar.gz",
            "pyver": "X.X",
            "packagetype": "sourcecode",
            "subdir": "iptvplayer-for-e2.git/",
            "version": "2018.11.07.02",
            "commit_stamp": "c74bea3428514da5f41c717d65d63b65e00e16fb",
            "icons_url": "http://www.iptvplayer.gitlab.io/update2/"
        },
        {
            "graphics_url": "http://www.iptvplayer.gitlab.io/update2/",
            "name": "www.iptvplayer.gitlab.io",
            "url": "http://www.iptvplayer.gitlab.io/update2/2018.11.07.03_python2.6.tar.gz",
            "pyver": "2.6",
            "packagetype": "precompiled",
            "subdir": "iptvplayer-for-e2.git/",
            "version": "2018.11.07.03",
            "commit_stamp": "a773a7d3d68fe8fe3b1ab207dac977c603cd8aba",
            "icons_url": "http://www.iptvplayer.gitlab.io/update2/"
        },
        {
            "graphics_url": "http://www.iptvplayer.gitlab.io/update2/",
            "name": "www.iptvplayer.gitlab.io",
            "url": "http://www.iptvplayer.gitlab.io/update2/2018.11.07.03_python2.7.tar.gz",
            "pyver": "2.7",
            "packagetype": "precompiled",
            "subdir": "iptvplayer-for-e2.git/",
            "version": "2018.11.07.03",
            "commit_stamp": "a773a7d3d68fe8fe3b1ab207dac977c603cd8aba",
            "icons_url": "http://www.iptvplayer.gitlab.io/update2/"
        },
        {
            "graphics_url": "http://www.iptvplayer.gitlab.io/update2/",
            "name": "www.iptvplayer.gitlab.io",
            "url": "http://www.iptvplayer.gitlab.io/update2/2018.11.07.03_pythonX.X.tar.gz",
            "pyver": "X.X",
            "packagetype": "sourcecode",
            "subdir": "iptvplayer-for-e2.git/",
            "version": "2018.11.07.03",
            "commit_stamp": "a773a7d3d68fe8fe3b1ab207dac977c603cd8aba",
            "icons_url": "http://www.iptvplayer.gitlab.io/update2/"
        },
        {
            "graphics_url": "http://www.iptvplayer.gitlab.io/update2/",
            "name": "www.iptvplayer.gitlab.io",
            "url": "http://www.iptvplayer.gitlab.io/update2/2018.11.07.04_python2.6.tar.gz",
            "pyver": "2.6",
            "packagetype": "precompiled",
            "subdir": "iptvplayer-for-e2.git/",
            "version": "2018.11.07.04",
            "commit_stamp": "29edc73b60df18cfee36d95f73abea6c39107319",
            "icons_url": "http://www.iptvplayer.gitlab.io/update2/"
        },
        {
            "graphics_url": "http://www.iptvplayer.gitlab.io/update2/",
            "name": "www.iptvplayer.gitlab.io",
            "url": "http://www.iptvplayer.gitlab.io/update2/2018.11.07.04_python2.7.tar.gz",
            "pyver": "2.7",
            "packagetype": "precompiled",
            "subdir": "iptvplayer-for-e2.git/",
            "version": "2018.11.07.04",
            "commit_stamp": "29edc73b60df18cfee36d95f73abea6c39107319",
            "icons_url": "http://www.iptvplayer.gitlab.io/update2/"
        },
        {
            "graphics_url": "http://www.iptvplayer.gitlab.io/update2/",
            "name": "www.iptvplayer.gitlab.io",
            "url": "http://www.iptvplayer.gitlab.io/update2/2018.11.07.04_pythonX.X.tar.gz",
            "pyver": "X.X",
            "packagetype": "sourcecode",
            "subdir": "iptvplayer-for-e2.git/",
            "version": "2018.11.07.04",
            "commit_stamp": "29edc73b60df18cfee36d95f73abea6c39107319",
            "icons_url": "http://www.iptvplayer.gitlab.io/update2/"
        },
        {
            "graphics_url": "http://www.iptvplayer.gitlab.io/update2/",
            "name": "www.iptvplayer.gitlab.io",
            "url": "http://www.iptvplayer.gitlab.io/update2/2018.11.08.01_python2.6.tar.gz",
            "pyver": "2.6",
            "packagetype": "precompiled",
            "subdir": "iptvplayer-for-e2.git/",
            "version": "2018.11.08.01",
            "commit_stamp": "10fe33723f6ece973c78ff18cc5a7aa9ff85a385",
            "icons_url": "http://www.iptvplayer.gitlab.io/update2/"
        },
        {
            "graphics_url": "http://www.iptvplayer.gitlab.io/update2/",
            "name": "www.iptvplayer.gitlab.io",
            "url": "http://www.iptvplayer.gitlab.io/update2/2018.11.08.01_python2.7.tar.gz",
            "pyver": "2.7",
            "packagetype": "precompiled",
            "subdir": "iptvplayer-for-e2.git/",
            "version": "2018.11.08.01",
            "commit_stamp": "10fe33723f6ece973c78ff18cc5a7aa9ff85a385",
            "icons_url": "http://www.iptvplayer.gitlab.io/update2/"
        },
        {
            "graphics_url": "http://www.iptvplayer.gitlab.io/update2/",
            "name": "www.iptvplayer.gitlab.io",
            "url": "http://www.iptvplayer.gitlab.io/update2/2018.11.08.01_pythonX.X.tar.gz",
            "pyver": "X.X",
            "packagetype": "sourcecode",
            "subdir": "iptvplayer-for-e2.git/",
            "version": "2018.11.08.01",
            "commit_stamp": "10fe33723f6ece973c78ff18cc5a7aa9ff85a385",
            "icons_url": "http://www.iptvplayer.gitlab.io/update2/"
        },
        {
            "graphics_url": "http://www.iptvplayer.gitlab.io/update2/",
            "name": "www.iptvplayer.gitlab.io",
            "url": "http://www.iptvplayer.gitlab.io/update2/2018.11.09.01_python2.6.tar.gz",
            "pyver": "2.6",
            "packagetype": "precompiled",
            "subdir": "iptvplayer-for-e2.git/",
            "version": "2018.11.09.01",
            "commit_stamp": "f22b82c44681443a4500b3971fb91b2d8aef5ed9",
            "icons_url": "http://www.iptvplayer.gitlab.io/update2/"
        },
        {
            "graphics_url": "http://www.iptvplayer.gitlab.io/update2/",
            "name": "www.iptvplayer.gitlab.io",
            "url": "http://www.iptvplayer.gitlab.io/update2/2018.11.09.01_python2.7.tar.gz",
            "pyver": "2.7",
            "packagetype": "precompiled",
            "subdir": "iptvplayer-for-e2.git/",
            "version": "2018.11.09.01",
            "commit_stamp": "f22b82c44681443a4500b3971fb91b2d8aef5ed9",
            "icons_url": "http://www.iptvplayer.gitlab.io/update2/"
        },
        {
            "graphics_url": "http://www.iptvplayer.gitlab.io/update2/",
            "name": "www.iptvplayer.gitlab.io",
            "url": "http://www.iptvplayer.gitlab.io/update2/2018.11.09.01_pythonX.X.tar.gz",
            "pyver": "X.X",
            "packagetype": "sourcecode",
            "subdir": "iptvplayer-for-e2.git/",
            "version": "2018.11.09.01",
            "commit_stamp": "f22b82c44681443a4500b3971fb91b2d8aef5ed9",
            "icons_url": "http://www.iptvplayer.gitlab.io/update2/"
        },
        {
            "graphics_url": "http://www.iptvplayer.gitlab.io/update2/",
            "name": "www.iptvplayer.gitlab.io",
            "url": "http://www.iptvplayer.gitlab.io/update2/2018.11.09.02_python2.6.tar.gz",
            "pyver": "2.6",
            "packagetype": "precompiled",
            "subdir": "iptvplayer-for-e2.git/",
            "version": "2018.11.09.02",
            "commit_stamp": "2a7076bafa531c64b2d49231fd9ba82a2b5fedf0",
            "icons_url": "http://www.iptvplayer.gitlab.io/update2/"
        },
        {
            "graphics_url": "http://www.iptvplayer.gitlab.io/update2/",
            "name": "www.iptvplayer.gitlab.io",
            "url": "http://www.iptvplayer.gitlab.io/update2/2018.11.09.02_python2.7.tar.gz",
            "pyver": "2.7",
            "packagetype": "precompiled",
            "subdir": "iptvplayer-for-e2.git/",
            "version": "2018.11.09.02",
            "commit_stamp": "2a7076bafa531c64b2d49231fd9ba82a2b5fedf0",
            "icons_url": "http://www.iptvplayer.gitlab.io/update2/"
        },
        {
            "graphics_url": "http://www.iptvplayer.gitlab.io/update2/",
            "name": "www.iptvplayer.gitlab.io",
            "url": "http://www.iptvplayer.gitlab.io/update2/2018.11.09.02_pythonX.X.tar.gz",
            "pyver": "X.X",
            "packagetype": "sourcecode",
            "subdir": "iptvplayer-for-e2.git/",
            "version": "2018.11.09.02",
            "commit_stamp": "2a7076bafa531c64b2d49231fd9ba82a2b5fedf0",
            "icons_url": "http://www.iptvplayer.gitlab.io/update2/"
        },
        {
            "graphics_url": "http://www.iptvplayer.gitlab.io/update2/",
            "name": "www.iptvplayer.gitlab.io",
            "url": "http://www.iptvplayer.gitlab.io/update2/2018.11.09.03_python2.6.tar.gz",
            "pyver": "2.6",
            "packagetype": "precompiled",
            "subdir": "iptvplayer-for-e2.git/",
            "version": "2018.11.09.03",
            "commit_stamp": "9e5b6214b429f678508d6d008962265357e8a52e",
            "icons_url": "http://www.iptvplayer.gitlab.io/update2/"
        },
        {
            "graphics_url": "http://www.iptvplayer.gitlab.io/update2/",
            "name": "www.iptvplayer.gitlab.io",
            "url": "http://www.iptvplayer.gitlab.io/update2/2018.11.09.03_python2.7.tar.gz",
            "pyver": "2.7",
            "packagetype": "precompiled",
            "subdir": "iptvplayer-for-e2.git/",
            "version": "2018.11.09.03",
            "commit_stamp": "9e5b6214b429f678508d6d008962265357e8a52e",
            "icons_url": "http://www.iptvplayer.gitlab.io/update2/"
        },
        {
            "graphics_url": "http://www.iptvplayer.gitlab.io/update2/",
            "name": "www.iptvplayer.gitlab.io",
            "url": "http://www.iptvplayer.gitlab.io/update2/2018.11.09.03_pythonX.X.tar.gz",
            "pyver": "X.X",
            "packagetype": "sourcecode",
            "subdir": "iptvplayer-for-e2.git/",
            "version": "2018.11.09.03",
            "commit_stamp": "9e5b6214b429f678508d6d008962265357e8a52e",
            "icons_url": "http://www.iptvplayer.gitlab.io/update2/"
        },
        {
            "graphics_url": "http://www.iptvplayer.gitlab.io/update2/",
            "name": "www.iptvplayer.gitlab.io",
            "url": "http://www.iptvplayer.gitlab.io/update2/2018.11.09.04_python2.6.tar.gz",
            "pyver": "2.6",
            "packagetype": "precompiled",
            "subdir": "iptvplayer-for-e2.git/",
            "version": "2018.11.09.04",
            "commit_stamp": "3fa963507423791e1324a983ffbd45e2ef64bc07",
            "icons_url": "http://www.iptvplayer.gitlab.io/update2/"
        },
        {
            "graphics_url": "http://www.iptvplayer.gitlab.io/update2/",
            "name": "www.iptvplayer.gitlab.io",
            "url": "http://www.iptvplayer.gitlab.io/update2/2018.11.09.04_python2.7.tar.gz",
            "pyver": "2.7",
            "packagetype": "precompiled",
            "subdir": "iptvplayer-for-e2.git/",
            "version": "2018.11.09.04",
            "commit_stamp": "3fa963507423791e1324a983ffbd45e2ef64bc07",
            "icons_url": "http://www.iptvplayer.gitlab.io/update2/"
        },
        {
            "graphics_url": "http://www.iptvplayer.gitlab.io/update2/",
            "name": "www.iptvplayer.gitlab.io",
            "url": "http://www.iptvplayer.gitlab.io/update2/2018.11.09.04_pythonX.X.tar.gz",
            "pyver": "X.X",
            "packagetype": "sourcecode",
            "subdir": "iptvplayer-for-e2.git/",
            "version": "2018.11.09.04",
            "commit_stamp": "3fa963507423791e1324a983ffbd45e2ef64bc07",
            "icons_url": "http://www.iptvplayer.gitlab.io/update2/"
        },
        {
            "graphics_url": "http://www.iptvplayer.gitlab.io/update2/",
            "name": "www.iptvplayer.gitlab.io",
            "url": "http://www.iptvplayer.gitlab.io/update2/2018.11.09.05_python2.6.tar.gz",
            "pyver": "2.6",
            "packagetype": "precompiled",
            "subdir": "iptvplayer-for-e2.git/",
            "version": "2018.11.09.05",
            "commit_stamp": "0e7504cc4b9894787868dbd489dac0f05f555d88",
            "icons_url": "http://www.iptvplayer.gitlab.io/update2/"
        },
        {
            "graphics_url": "http://www.iptvplayer.gitlab.io/update2/",
            "name": "www.iptvplayer.gitlab.io",
            "url": "http://www.iptvplayer.gitlab.io/update2/2018.11.09.05_python2.7.tar.gz",
            "pyver": "2.7",
            "packagetype": "precompiled",
            "subdir": "iptvplayer-for-e2.git/",
            "version": "2018.11.09.05",
            "commit_stamp": "0e7504cc4b9894787868dbd489dac0f05f555d88",
            "icons_url": "http://www.iptvplayer.gitlab.io/update2/"
        },
        {
            "graphics_url": "http://www.iptvplayer.gitlab.io/update2/",
            "name": "www.iptvplayer.gitlab.io",
            "url": "http://www.iptvplayer.gitlab.io/update2/2018.11.09.05_pythonX.X.tar.gz",
            "pyver": "X.X",
            "packagetype": "sourcecode",
            "subdir": "iptvplayer-for-e2.git/",
            "version": "2018.11.09.05",
            "commit_stamp": "0e7504cc4b9894787868dbd489dac0f05f555d88",
            "icons_url": "http://www.iptvplayer.gitlab.io/update2/"
        },
        {
            "graphics_url": "http://www.iptvplayer.gitlab.io/update2/",
            "name": "www.iptvplayer.gitlab.io",
            "url": "http://www.iptvplayer.gitlab.io/update2/2018.11.09.06_python2.6.tar.gz",
            "pyver": "2.6",
            "packagetype": "precompiled",
            "subdir": "iptvplayer-for-e2.git/",
            "version": "2018.11.09.06",
            "commit_stamp": "c4fbb013cea617c7eaa774bd3ed12bb9fb79c537",
            "icons_url": "http://www.iptvplayer.gitlab.io/update2/"
        },
        {
            "graphics_url": "http://www.iptvplayer.gitlab.io/update2/",
            "name": "www.iptvplayer.gitlab.io",
            "url": "http://www.iptvplayer.gitlab.io/update2/2018.11.09.06_python2.7.tar.gz",
            "pyver": "2.7",
            "packagetype": "precompiled",
            "subdir": "iptvplayer-for-e2.git/",
            "version": "2018.11.09.06",
            "commit_stamp": "c4fbb013cea617c7eaa774bd3ed12bb9fb79c537",
            "icons_url": "http://www.iptvplayer.gitlab.io/update2/"
        },
        {
            "graphics_url": "http://www.iptvplayer.gitlab.io/update2/",
            "name": "www.iptvplayer.gitlab.io",
            "url": "http://www.iptvplayer.gitlab.io/update2/2018.11.09.06_pythonX.X.tar.gz",
            "pyver": "X.X",
            "packagetype": "sourcecode",
            "subdir": "iptvplayer-for-e2.git/",
            "version": "2018.11.09.06",
            "commit_stamp": "c4fbb013cea617c7eaa774bd3ed12bb9fb79c537",
            "icons_url": "http://www.iptvplayer.gitlab.io/update2/"
        },
        {
            "graphics_url": "http://www.iptvplayer.gitlab.io/update2/",
            "name": "www.iptvplayer.gitlab.io",
            "url": "http://www.iptvplayer.gitlab.io/update2/2018.11.09.07_python2.6.tar.gz",
            "pyver": "2.6",
            "packagetype": "precompiled",
            "subdir": "iptvplayer-for-e2.git/",
            "version": "2018.11.09.07",
            "commit_stamp": "6736cc0d39c9cf205d8ea7ef792aab83499f79fb",
            "icons_url": "http://www.iptvplayer.gitlab.io/update2/"
        },
        {
            "graphics_url": "http://www.iptvplayer.gitlab.io/update2/",
            "name": "www.iptvplayer.gitlab.io",
            "url": "http://www.iptvplayer.gitlab.io/update2/2018.11.09.07_python2.7.tar.gz",
            "pyver": "2.7",
            "packagetype": "precompiled",
            "subdir": "iptvplayer-for-e2.git/",
            "version": "2018.11.09.07",
            "commit_stamp": "6736cc0d39c9cf205d8ea7ef792aab83499f79fb",
            "icons_url": "http://www.iptvplayer.gitlab.io/update2/"
        },
        {
            "graphics_url": "http://www.iptvplayer.gitlab.io/update2/",
            "name": "www.iptvplayer.gitlab.io",
            "url": "http://www.iptvplayer.gitlab.io/update2/2018.11.09.07_pythonX.X.tar.gz",
            "pyver": "X.X",
            "packagetype": "sourcecode",
            "subdir": "iptvplayer-for-e2.git/",
            "version": "2018.11.09.07",
            "commit_stamp": "6736cc0d39c9cf205d8ea7ef792aab83499f79fb",
            "icons_url": "http://www.iptvplayer.gitlab.io/update2/"
        },
        {
            "graphics_url": "http://www.iptvplayer.gitlab.io/update2/",
            "name": "www.iptvplayer.gitlab.io",
            "url": "http://www.iptvplayer.gitlab.io/update2/2018.11.10.01_python2.6.tar.gz",
            "pyver": "2.6",
            "packagetype": "precompiled",
            "subdir": "iptvplayer-for-e2.git/",
            "version": "2018.11.10.01",
            "commit_stamp": "e43cdb657b239c649bea9b4532bfa53477e6ded6",
            "icons_url": "http://www.iptvplayer.gitlab.io/update2/"
        },
        {
            "graphics_url": "http://www.iptvplayer.gitlab.io/update2/",
            "name": "www.iptvplayer.gitlab.io",
            "url": "http://www.iptvplayer.gitlab.io/update2/2018.11.10.01_python2.7.tar.gz",
            "pyver": "2.7",
            "packagetype": "precompiled",
            "subdir": "iptvplayer-for-e2.git/",
            "version": "2018.11.10.01",
            "commit_stamp": "e43cdb657b239c649bea9b4532bfa53477e6ded6",
            "icons_url": "http://www.iptvplayer.gitlab.io/update2/"
        },
        {
            "graphics_url": "http://www.iptvplayer.gitlab.io/update2/",
            "name": "www.iptvplayer.gitlab.io",
            "url": "http://www.iptvplayer.gitlab.io/update2/2018.11.10.01_pythonX.X.tar.gz",
            "pyver": "X.X",
            "packagetype": "sourcecode",
            "subdir": "iptvplayer-for-e2.git/",
            "version": "2018.11.10.01",
            "commit_stamp": "e43cdb657b239c649bea9b4532bfa53477e6ded6",
            "icons_url": "http://www.iptvplayer.gitlab.io/update2/"
        },
        {
            "graphics_url": "http://www.iptvplayer.gitlab.io/update2/",
            "name": "www.iptvplayer.gitlab.io",
            "url": "http://www.iptvplayer.gitlab.io/update2/2018.11.11.01_python2.6.tar.gz",
            "pyver": "2.6",
            "packagetype": "precompiled",
            "subdir": "iptvplayer-for-e2.git/",
            "version": "2018.11.11.01",
            "commit_stamp": "a762566966f182f69476eadee9ca079d572bb792",
            "icons_url": "http://www.iptvplayer.gitlab.io/update2/"
        },
        {
            "graphics_url": "http://www.iptvplayer.gitlab.io/update2/",
            "name": "www.iptvplayer.gitlab.io",
            "url": "http://www.iptvplayer.gitlab.io/update2/2018.11.11.01_python2.7.tar.gz",
            "pyver": "2.7",
            "packagetype": "precompiled",
            "subdir": "iptvplayer-for-e2.git/",
            "version": "2018.11.11.01",
            "commit_stamp": "a762566966f182f69476eadee9ca079d572bb792",
            "icons_url": "http://www.iptvplayer.gitlab.io/update2/"
        },
        {
            "graphics_url": "http://www.iptvplayer.gitlab.io/update2/",
            "name": "www.iptvplayer.gitlab.io",
            "url": "http://www.iptvplayer.gitlab.io/update2/2018.11.11.01_pythonX.X.tar.gz",
            "pyver": "X.X",
            "packagetype": "sourcecode",
            "subdir": "iptvplayer-for-e2.git/",
            "version": "2018.11.11.01",
            "commit_stamp": "a762566966f182f69476eadee9ca079d572bb792",
            "icons_url": "http://www.iptvplayer.gitlab.io/update2/"
        },
        {
            "graphics_url": "http://www.iptvplayer.gitlab.io/update2/",
            "name": "www.iptvplayer.gitlab.io",
            "url": "http://www.iptvplayer.gitlab.io/update2/2018.11.12.01_python2.6.tar.gz",
            "pyver": "2.6",
            "packagetype": "precompiled",
            "subdir": "iptvplayer-for-e2.git/",
            "version": "2018.11.12.01",
            "commit_stamp": "2ef8148f0392d1ab8a3fca57996d8fb39165f690",
            "icons_url": "http://www.iptvplayer.gitlab.io/update2/"
        },
        {
            "graphics_url": "http://www.iptvplayer.gitlab.io/update2/",
            "name": "www.iptvplayer.gitlab.io",
            "url": "http://www.iptvplayer.gitlab.io/update2/2018.11.12.01_python2.7.tar.gz",
            "pyver": "2.7",
            "packagetype": "precompiled",
            "subdir": "iptvplayer-for-e2.git/",
            "version": "2018.11.12.01",
            "commit_stamp": "2ef8148f0392d1ab8a3fca57996d8fb39165f690",
            "icons_url": "http://www.iptvplayer.gitlab.io/update2/"
        },
        {
            "graphics_url": "http://www.iptvplayer.gitlab.io/update2/",
            "name": "www.iptvplayer.gitlab.io",
            "url": "http://www.iptvplayer.gitlab.io/update2/2018.11.12.01_pythonX.X.tar.gz",
            "pyver": "X.X",
            "packagetype": "sourcecode",
            "subdir": "iptvplayer-for-e2.git/",
            "version": "2018.11.12.01",
            "commit_stamp": "2ef8148f0392d1ab8a3fca57996d8fb39165f690",
            "icons_url": "http://www.iptvplayer.gitlab.io/update2/"
        },
        {
            "graphics_url": "http://www.iptvplayer.gitlab.io/update2/",
            "name": "www.iptvplayer.gitlab.io",
            "url": "http://www.iptvplayer.gitlab.io/update2/2018.11.14.01_python2.6.tar.gz",
            "pyver": "2.6",
            "packagetype": "precompiled",
            "subdir": "iptvplayer-for-e2.git/",
            "version": "2018.11.14.01",
            "commit_stamp": "7e7a95388569e12bb7b2be1c1b904b3364f7d812",
            "icons_url": "http://www.iptvplayer.gitlab.io/update2/"
        },
        {
            "graphics_url": "http://www.iptvplayer.gitlab.io/update2/",
            "name": "www.iptvplayer.gitlab.io",
            "url": "http://www.iptvplayer.gitlab.io/update2/2018.11.14.01_python2.7.tar.gz",
            "pyver": "2.7",
            "packagetype": "precompiled",
            "subdir": "iptvplayer-for-e2.git/",
            "version": "2018.11.14.01",
            "commit_stamp": "7e7a95388569e12bb7b2be1c1b904b3364f7d812",
            "icons_url": "http://www.iptvplayer.gitlab.io/update2/"
        },
        {
            "graphics_url": "http://www.iptvplayer.gitlab.io/update2/",
            "name": "www.iptvplayer.gitlab.io",
            "url": "http://www.iptvplayer.gitlab.io/update2/2018.11.14.01_pythonX.X.tar.gz",
            "pyver": "X.X",
            "packagetype": "sourcecode",
            "subdir": "iptvplayer-for-e2.git/",
            "version": "2018.11.14.01",
            "commit_stamp": "7e7a95388569e12bb7b2be1c1b904b3364f7d812",
            "icons_url": "http://www.iptvplayer.gitlab.io/update2/"
        },
        {
            "graphics_url": "http://www.iptvplayer.gitlab.io/update2/",
            "name": "www.iptvplayer.gitlab.io",
            "url": "http://www.iptvplayer.gitlab.io/update2/2018.11.16.02_python2.6.tar.gz",
            "pyver": "2.6",
            "packagetype": "precompiled",
            "subdir": "iptvplayer-for-e2.git/",
            "version": "2018.11.16.02",
            "commit_stamp": "6dd3e036da9d7b88d9447a2c0ff386834b89fc0f",
            "icons_url": "http://www.iptvplayer.gitlab.io/update2/"
        },
        {
            "graphics_url": "http://www.iptvplayer.gitlab.io/update2/",
            "name": "www.iptvplayer.gitlab.io",
            "url": "http://www.iptvplayer.gitlab.io/update2/2018.11.16.02_python2.7.tar.gz",
            "pyver": "2.7",
            "packagetype": "precompiled",
            "subdir": "iptvplayer-for-e2.git/",
            "version": "2018.11.16.02",
            "commit_stamp": "6dd3e036da9d7b88d9447a2c0ff386834b89fc0f",
            "icons_url": "http://www.iptvplayer.gitlab.io/update2/"
        },
        {
            "graphics_url": "http://www.iptvplayer.gitlab.io/update2/",
            "name": "www.iptvplayer.gitlab.io",
            "url": "http://www.iptvplayer.gitlab.io/update2/2018.11.16.02_pythonX.X.tar.gz",
            "pyver": "X.X",
            "packagetype": "sourcecode",
            "subdir": "iptvplayer-for-e2.git/",
            "version": "2018.11.16.02",
            "commit_stamp": "6dd3e036da9d7b88d9447a2c0ff386834b89fc0f",
            "icons_url": "http://www.iptvplayer.gitlab.io/update2/"
        },
        {
            "graphics_url": "http://www.iptvplayer.gitlab.io/update2/",
            "name": "www.iptvplayer.gitlab.io",
            "url": "http://www.iptvplayer.gitlab.io/update2/2018.12.16.03_python2.6.tar.gz",
            "packagetype": "precompiled",
            "pyver": "2.6",
            "version": "2018.12.16.03",
            "subdir": "iptvplayer-for-e2.git/",
            "commit_stamp": "5bf5a7f6496603508f37635a7dfedf6685fedecb",
            "icons_url": "http://www.iptvplayer.gitlab.io/update2/"
        },
        {
            "graphics_url": "http://www.iptvplayer.gitlab.io/update2/",
            "name": "www.iptvplayer.gitlab.io",
            "url": "http://www.iptvplayer.gitlab.io/update2/2018.12.16.03_python2.7.tar.gz",
            "packagetype": "precompiled",
            "pyver": "2.7",
            "version": "2018.12.16.03",
            "subdir": "iptvplayer-for-e2.git/",
            "commit_stamp": "5bf5a7f6496603508f37635a7dfedf6685fedecb",
            "icons_url": "http://www.iptvplayer.gitlab.io/update2/"
        },
        {
            "graphics_url": "http://www.iptvplayer.gitlab.io/update2/",
            "name": "www.iptvplayer.gitlab.io",
            "url": "http://www.iptvplayer.gitlab.io/update2/2018.12.16.03_pythonX.X.tar.gz",
            "packagetype": "sourcecode",
            "pyver": "X.X",
            "version": "2018.12.16.03",
            "subdir": "iptvplayer-for-e2.git/",
            "commit_stamp": "5bf5a7f6496603508f37635a7dfedf6685fedecb",
            "icons_url": "http://www.iptvplayer.gitlab.io/update2/"
        }
    ]
}