2021-03-10 09:51:43.369 +02:00 [INF] Application Is Starting
2021-03-10 09:51:49.702 +02:00 [INF] User profile is available. Using 'C:\Users\nourm\AppData\Local\ASP.NET\DataProtection-Keys' as key repository and Windows DPAPI to encrypt keys at rest.
2021-03-10 09:51:50.329 +02:00 [INF] Application started. Press Ctrl+C to shut down.
2021-03-10 09:51:50.329 +02:00 [INF] Hosting environment: Development
2021-03-10 09:51:50.330 +02:00 [INF] Content root path: C:\Users\nourm\Desktop\Wasel\Wasel.API
2021-03-10 09:51:50.432 +02:00 [INF] Request starting HTTP/2 GET https://localhost:44305/swagger - -
2021-03-10 09:51:50.507 +02:00 [INF] Request starting HTTP/2 GET https://localhost:44305/swagger/index.html - -
2021-03-10 09:51:50.516 +02:00 [INF] Request finished HTTP/2 GET https://localhost:44305/swagger - - - 301 - - 87.3242ms
2021-03-10 09:51:50.680 +02:00 [INF] Request finished HTTP/2 GET https://localhost:44305/swagger/index.html - - - 200 - text/html;charset=utf-8 172.8581ms
2021-03-10 09:51:50.732 +02:00 [INF] Request starting HTTP/2 GET https://localhost:44305/swagger/swagger-ui.css - -
2021-03-10 09:51:50.734 +02:00 [INF] Request starting HTTP/2 GET https://localhost:44305/swagger/swagger-ui-bundle.js - -
2021-03-10 09:51:50.735 +02:00 [INF] Request starting HTTP/2 GET https://localhost:44305/swagger/swagger-ui-standalone-preset.js - -
2021-03-10 09:51:50.833 +02:00 [INF] Sending file. Request path: '/swagger-ui.css'. Physical path: 'N/A'
2021-03-10 09:51:50.833 +02:00 [INF] Sending file. Request path: '/swagger-ui-standalone-preset.js'. Physical path: 'N/A'
2021-03-10 09:51:50.833 +02:00 [INF] Sending file. Request path: '/swagger-ui-bundle.js'. Physical path: 'N/A'
2021-03-10 09:51:50.856 +02:00 [INF] Request finished HTTP/2 GET https://localhost:44305/swagger/swagger-ui-standalone-preset.js - - - 200 311804 application/javascript 121.6500ms
2021-03-10 09:51:50.857 +02:00 [INF] Request finished HTTP/2 GET https://localhost:44305/swagger/swagger-ui.css - - - 200 142933 text/css 124.9396ms
2021-03-10 09:51:50.888 +02:00 [INF] Request finished HTTP/2 GET https://localhost:44305/swagger/swagger-ui-bundle.js - - - 200 986342 application/javascript 153.6756ms
2021-03-10 09:51:51.196 +02:00 [INF] Request starting HTTP/2 GET https://localhost:44305/swagger/v1/swagger.json - -
2021-03-10 09:51:51.263 +02:00 [INF] Request starting HTTP/2 GET https://localhost:44305/swagger/favicon-32x32.png - -
2021-03-10 09:51:51.264 +02:00 [INF] Sending file. Request path: '/favicon-32x32.png'. Physical path: 'N/A'
2021-03-10 09:51:51.267 +02:00 [INF] Request finished HTTP/2 GET https://localhost:44305/swagger/favicon-32x32.png - - - 200 628 image/png 1.6878ms
2021-03-10 09:51:51.392 +02:00 [INF] Request finished HTTP/2 GET https://localhost:44305/swagger/v1/swagger.json - - - 200 - application/json;charset=utf-8 195.6485ms
2021-03-10 11:14:20.083 +02:00 [INF] Application Is Starting
2021-03-10 11:14:24.454 +02:00 [INF] User profile is available. Using 'C:\Users\nourm\AppData\Local\ASP.NET\DataProtection-Keys' as key repository and Windows DPAPI to encrypt keys at rest.
2021-03-10 11:14:24.980 +02:00 [INF] Application started. Press Ctrl+C to shut down.
2021-03-10 11:14:24.980 +02:00 [INF] Hosting environment: Development
2021-03-10 11:14:24.980 +02:00 [INF] Content root path: C:\Users\nourm\Desktop\BehindPixel\Projects\Wasel\Wasel.API
2021-03-10 11:14:25.064 +02:00 [INF] Request starting HTTP/2 GET https://localhost:44305/swagger/index.html - -
2021-03-10 11:14:25.263 +02:00 [INF] Request finished HTTP/2 GET https://localhost:44305/swagger/index.html - - - 200 - text/html;charset=utf-8 201.1474ms
2021-03-10 11:14:25.745 +02:00 [INF] Request starting HTTP/2 GET https://localhost:44305/swagger/v1/swagger.json - -
2021-03-10 11:14:25.929 +02:00 [INF] Request finished HTTP/2 GET https://localhost:44305/swagger/v1/swagger.json - - - 200 - application/json;charset=utf-8 183.5146ms
2021-03-10 11:15:21.238 +02:00 [INF] Request starting HTTP/2 POST https://localhost:44305/api/Account/register application/json-patch+json 156
2021-03-10 11:15:21.260 +02:00 [INF] CORS policy execution successful.
2021-03-10 11:15:21.443 +02:00 [INF] Checking for conditional GET/HEAD.
2021-03-10 11:15:21.450 +02:00 [INF] Not valid - method isn't GET or HEAD.
2021-03-10 11:15:21.450 +02:00 [INF] Don't generate 304 - Not Modified.  Continue.
2021-03-10 11:15:21.452 +02:00 [INF] Checking for conditional PUT/PATCH.
2021-03-10 11:15:21.452 +02:00 [INF] Not valid - method isn't PUT or PATCH.
2021-03-10 11:15:21.453 +02:00 [INF] Don't generate 412 - Precondition Failed.  Continue.
2021-03-10 11:15:21.587 +02:00 [INF] Executing endpoint 'Wasel.API.Controllers.AccountController.Register (Wasel.API)'
2021-03-10 11:15:21.643 +02:00 [INF] Route matched with {action = "Register", controller = "Account"}. Executing controller action with signature System.Threading.Tasks.Task`1[Microsoft.AspNetCore.Mvc.IActionResult] Register(Wasel.Core.OutputDTOs.UserDTO) on controller Wasel.API.Controllers.AccountController (Wasel.API).
2021-03-10 11:15:22.954 +02:00 [INF] Executing action method Wasel.API.Controllers.AccountController.Register (Wasel.API) - Validation state: "Valid"
2021-03-10 11:15:22.959 +02:00 [INF] Registration Attempt for nour@example.com 
2021-03-10 11:15:23.936 +02:00 [INF] Entity Framework Core 5.0.3 initialized 'DBAccessContext' using provider 'Pomelo.EntityFrameworkCore.MySql' with options: MaxPoolSize=128 ServerVersion 8.0.23-mysql 
2021-03-10 11:15:24.497 +02:00 [INF] Executed DbCommand (69ms) [Parameters=[@__normalizedUserName_0='?' (Size = 256)], CommandType='"Text"', CommandTimeout='30']
SELECT `u`.`Id`, `u`.`AccessFailedCount`, `u`.`ConcurrencyStamp`, `u`.`Email`, `u`.`EmailConfirmed`, `u`.`FirstName`, `u`.`LastName`, `u`.`LockoutEnabled`, `u`.`LockoutEnd`, `u`.`NormalizedEmail`, `u`.`NormalizedUserName`, `u`.`PasswordHash`, `u`.`PhoneNumber`, `u`.`PhoneNumberConfirmed`, `u`.`SecurityStamp`, `u`.`TwoFactorEnabled`, `u`.`UserName`
FROM `Users` AS `u`
WHERE `u`.`NormalizedUserName` = @__normalizedUserName_0
LIMIT 1
2021-03-10 11:15:24.578 +02:00 [INF] Executed DbCommand (9ms) [Parameters=[@__normalizedEmail_0='?' (Size = 256)], CommandType='"Text"', CommandTimeout='30']
SELECT `u`.`Id`, `u`.`AccessFailedCount`, `u`.`ConcurrencyStamp`, `u`.`Email`, `u`.`EmailConfirmed`, `u`.`FirstName`, `u`.`LastName`, `u`.`LockoutEnabled`, `u`.`LockoutEnd`, `u`.`NormalizedEmail`, `u`.`NormalizedUserName`, `u`.`PasswordHash`, `u`.`PhoneNumber`, `u`.`PhoneNumberConfirmed`, `u`.`SecurityStamp`, `u`.`TwoFactorEnabled`, `u`.`UserName`
FROM `Users` AS `u`
WHERE `u`.`NormalizedEmail` = @__normalizedEmail_0
LIMIT 2
2021-03-10 11:15:24.867 +02:00 [INF] Executed DbCommand (5ms) [Parameters=[@p0='?' (DbType = Int32), @p1='?' (Size = 4000), @p2='?' (Size = 256), @p3='?' (DbType = Boolean), @p4='?' (Size = 4000), @p5='?' (Size = 4000), @p6='?' (DbType = Boolean), @p7='?' (DbType = DateTimeOffset), @p8='?' (Size = 256), @p9='?' (Size = 256), @p10='?' (Size = 4000), @p11='?' (Size = 4000), @p12='?' (DbType = Boolean), @p13='?' (Size = 4000), @p14='?' (DbType = Boolean), @p15='?' (Size = 256)], CommandType='"Text"', CommandTimeout='30']
INSERT INTO `Users` (`AccessFailedCount`, `ConcurrencyStamp`, `Email`, `EmailConfirmed`, `FirstName`, `LastName`, `LockoutEnabled`, `LockoutEnd`, `NormalizedEmail`, `NormalizedUserName`, `PasswordHash`, `PhoneNumber`, `PhoneNumberConfirmed`, `SecurityStamp`, `TwoFactorEnabled`, `UserName`)
VALUES (@p0, @p1, @p2, @p3, @p4, @p5, @p6, @p7, @p8, @p9, @p10, @p11, @p12, @p13, @p14, @p15);
SELECT `Id`
FROM `Users`
WHERE ROW_COUNT() = 1 AND `Id` = LAST_INSERT_ID();
2021-03-10 11:15:24.967 +02:00 [INF] Executed DbCommand (2ms) [Parameters=[@__normalizedRoleName_0='?' (Size = 256)], CommandType='"Text"', CommandTimeout='30']
SELECT `r`.`Id`, `r`.`ConcurrencyStamp`, `r`.`Name`, `r`.`NormalizedName`
FROM `Roles` AS `r`
WHERE `r`.`NormalizedName` = @__normalizedRoleName_0
LIMIT 2
2021-03-10 11:15:25.012 +02:00 [INF] Executed DbCommand (3ms) [Parameters=[@__p_0='?' (DbType = Int32), @__p_1='?' (DbType = Int32)], CommandType='"Text"', CommandTimeout='30']
SELECT `u`.`UserId`, `u`.`RoleId`
FROM `UserRoles` AS `u`
WHERE (`u`.`UserId` = @__p_0) AND (`u`.`RoleId` = @__p_1)
LIMIT 1
2021-03-10 11:15:25.024 +02:00 [INF] Executed DbCommand (3ms) [Parameters=[@__normalizedRoleName_0='?' (Size = 256)], CommandType='"Text"', CommandTimeout='30']
SELECT `r`.`Id`, `r`.`ConcurrencyStamp`, `r`.`Name`, `r`.`NormalizedName`
FROM `Roles` AS `r`
WHERE `r`.`NormalizedName` = @__normalizedRoleName_0
LIMIT 2
2021-03-10 11:15:25.049 +02:00 [INF] Executed DbCommand (2ms) [Parameters=[@__normalizedUserName_0='?' (Size = 256)], CommandType='"Text"', CommandTimeout='30']
SELECT `u`.`Id`, `u`.`AccessFailedCount`, `u`.`ConcurrencyStamp`, `u`.`Email`, `u`.`EmailConfirmed`, `u`.`FirstName`, `u`.`LastName`, `u`.`LockoutEnabled`, `u`.`LockoutEnd`, `u`.`NormalizedEmail`, `u`.`NormalizedUserName`, `u`.`PasswordHash`, `u`.`PhoneNumber`, `u`.`PhoneNumberConfirmed`, `u`.`SecurityStamp`, `u`.`TwoFactorEnabled`, `u`.`UserName`
FROM `Users` AS `u`
WHERE `u`.`NormalizedUserName` = @__normalizedUserName_0
LIMIT 1
2021-03-10 11:15:25.057 +02:00 [INF] Executed DbCommand (2ms) [Parameters=[@__normalizedEmail_0='?' (Size = 256)], CommandType='"Text"', CommandTimeout='30']
SELECT `u`.`Id`, `u`.`AccessFailedCount`, `u`.`ConcurrencyStamp`, `u`.`Email`, `u`.`EmailConfirmed`, `u`.`FirstName`, `u`.`LastName`, `u`.`LockoutEnabled`, `u`.`LockoutEnd`, `u`.`NormalizedEmail`, `u`.`NormalizedUserName`, `u`.`PasswordHash`, `u`.`PhoneNumber`, `u`.`PhoneNumberConfirmed`, `u`.`SecurityStamp`, `u`.`TwoFactorEnabled`, `u`.`UserName`
FROM `Users` AS `u`
WHERE `u`.`NormalizedEmail` = @__normalizedEmail_0
LIMIT 2
2021-03-10 11:15:25.087 +02:00 [INF] Executed DbCommand (3ms) [Parameters=[@p0='?' (DbType = Int32), @p1='?' (DbType = Int32)], CommandType='"Text"', CommandTimeout='30']
INSERT INTO `UserRoles` (`RoleId`, `UserId`)
VALUES (@p0, @p1);
2021-03-10 11:15:25.093 +02:00 [INF] Executed DbCommand (2ms) [Parameters=[@p16='?' (DbType = Int32), @p0='?' (DbType = Int32), @p1='?' (Size = 4000), @p17='?' (Size = 4000), @p2='?' (Size = 256), @p3='?' (DbType = Boolean), @p4='?' (Size = 4000), @p5='?' (Size = 4000), @p6='?' (DbType = Boolean), @p7='?' (DbType = DateTimeOffset), @p8='?' (Size = 256), @p9='?' (Size = 256), @p10='?' (Size = 4000), @p11='?' (Size = 4000), @p12='?' (DbType = Boolean), @p13='?' (Size = 4000), @p14='?' (DbType = Boolean), @p15='?' (Size = 256)], CommandType='"Text"', CommandTimeout='30']
UPDATE `Users` SET `AccessFailedCount` = @p0, `ConcurrencyStamp` = @p1, `Email` = @p2, `EmailConfirmed` = @p3, `FirstName` = @p4, `LastName` = @p5, `LockoutEnabled` = @p6, `LockoutEnd` = @p7, `NormalizedEmail` = @p8, `NormalizedUserName` = @p9, `PasswordHash` = @p10, `PhoneNumber` = @p11, `PhoneNumberConfirmed` = @p12, `SecurityStamp` = @p13, `TwoFactorEnabled` = @p14, `UserName` = @p15
WHERE `Id` = @p16 AND `ConcurrencyStamp` = @p17;
SELECT ROW_COUNT();
2021-03-10 11:15:25.110 +02:00 [INF] Executed action method Wasel.API.Controllers.AccountController.Register (Wasel.API), returned result Microsoft.AspNetCore.Mvc.AcceptedResult in 2144.7762ms.
2021-03-10 11:15:25.122 +02:00 [INF] Executing AcceptedResult, writing value of type 'null'.
2021-03-10 11:15:25.131 +02:00 [INF] Executed action Wasel.API.Controllers.AccountController.Register (Wasel.API) in 3480.6284ms
2021-03-10 11:15:25.132 +02:00 [INF] Executed endpoint 'Wasel.API.Controllers.AccountController.Register (Wasel.API)'
2021-03-10 11:15:25.136 +02:00 [INF] Generating expiration headers.
2021-03-10 11:15:25.138 +02:00 [INF] Expiration headers generated. Expires: Wed, 10 Mar 2021 09:17:25 GMT. Cache-Control: private,max-age=120,must-revalidate.
2021-03-10 11:15:25.141 +02:00 [INF] Generating Validation headers.
2021-03-10 11:15:25.153 +02:00 [INF] Validation headers generated. ETag: Strong, "F52EB6F13067F4FDF7847EDE934D5D59". Last-Modified: Wed, 10 Mar 2021 09:15:25 GMT
2021-03-10 11:15:25.154 +02:00 [INF] Generating Vary header.
2021-03-10 11:15:25.154 +02:00 [INF] Vary header generated: Accept, Accept-Language, Accept-Encoding.
2021-03-10 11:15:25.178 +02:00 [INF] Request finished HTTP/2 POST https://localhost:44305/api/Account/register application/json-patch+json 156 - 202 0 - 3940.5601ms
2021-03-10 11:15:46.437 +02:00 [INF] Request starting HTTP/2 POST https://localhost:44305/api/Account/login application/json-patch+json 47
2021-03-10 11:15:46.440 +02:00 [INF] CORS policy execution successful.
2021-03-10 11:15:46.454 +02:00 [INF] Checking for conditional GET/HEAD.
2021-03-10 11:15:46.466 +02:00 [INF] Not valid - method isn't GET or HEAD.
2021-03-10 11:15:46.466 +02:00 [INF] Don't generate 304 - Not Modified.  Continue.
2021-03-10 11:15:46.466 +02:00 [INF] Checking for conditional PUT/PATCH.
2021-03-10 11:15:46.466 +02:00 [INF] Not valid - method isn't PUT or PATCH.
2021-03-10 11:15:46.466 +02:00 [INF] Don't generate 412 - Precondition Failed.  Continue.
2021-03-10 11:15:46.484 +02:00 [INF] Executing endpoint 'Wasel.API.Controllers.AccountController.Login (Wasel.API)'
2021-03-10 11:15:46.488 +02:00 [INF] Route matched with {action = "Login", controller = "Account"}. Executing controller action with signature System.Threading.Tasks.Task`1[Microsoft.AspNetCore.Mvc.IActionResult] Login(Wasel.DAL.InputDTOs.LoginUserDTO) on controller Wasel.API.Controllers.AccountController (Wasel.API).
2021-03-10 11:15:46.527 +02:00 [INF] Executing action method Wasel.API.Controllers.AccountController.Login (Wasel.API) - Validation state: "Valid"
2021-03-10 11:15:46.529 +02:00 [INF] Login Attempt for 123456789 
2021-03-10 11:15:46.565 +02:00 [INF] Executed DbCommand (17ms) [Parameters=[@__normalizedUserName_0='?' (Size = 256)], CommandType='"Text"', CommandTimeout='30']
SELECT `u`.`Id`, `u`.`AccessFailedCount`, `u`.`ConcurrencyStamp`, `u`.`Email`, `u`.`EmailConfirmed`, `u`.`FirstName`, `u`.`LastName`, `u`.`LockoutEnabled`, `u`.`LockoutEnd`, `u`.`NormalizedEmail`, `u`.`NormalizedUserName`, `u`.`PasswordHash`, `u`.`PhoneNumber`, `u`.`PhoneNumberConfirmed`, `u`.`SecurityStamp`, `u`.`TwoFactorEnabled`, `u`.`UserName`
FROM `Users` AS `u`
WHERE `u`.`NormalizedUserName` = @__normalizedUserName_0
LIMIT 1
2021-03-10 11:15:46.686 +02:00 [INF] Executed DbCommand (3ms) [Parameters=[@__userId_0='?' (DbType = Int32)], CommandType='"Text"', CommandTimeout='30']
SELECT `r`.`Name`
FROM `UserRoles` AS `u`
INNER JOIN `Roles` AS `r` ON `u`.`RoleId` = `r`.`Id`
WHERE `u`.`UserId` = @__userId_0
2021-03-10 11:15:46.859 +02:00 [INF] Executed action method Wasel.API.Controllers.AccountController.Login (Wasel.API), returned result Microsoft.AspNetCore.Mvc.AcceptedResult in 330.9464ms.
2021-03-10 11:15:46.859 +02:00 [INF] Executing AcceptedResult, writing value of type '<>f__AnonymousType0`1[[System.String, System.Private.CoreLib, Version=5.0.0.0, Culture=neutral, PublicKeyToken=7cec85d7bea7798e]]'.
2021-03-10 11:15:46.915 +02:00 [INF] Executed action Wasel.API.Controllers.AccountController.Login (Wasel.API) in 427.5736ms
2021-03-10 11:15:46.916 +02:00 [INF] Executed endpoint 'Wasel.API.Controllers.AccountController.Login (Wasel.API)'
2021-03-10 11:15:46.916 +02:00 [INF] Generating expiration headers.
2021-03-10 11:15:46.916 +02:00 [INF] Expiration headers generated. Expires: Wed, 10 Mar 2021 09:17:46 GMT. Cache-Control: private,max-age=120,must-revalidate.
2021-03-10 11:15:46.916 +02:00 [INF] Generating Validation headers.
2021-03-10 11:15:46.916 +02:00 [INF] Validation headers generated. ETag: Strong, "022510690A490CE21DD7F170C9641B89". Last-Modified: Wed, 10 Mar 2021 09:15:46 GMT
2021-03-10 11:15:46.916 +02:00 [INF] Generating Vary header.
2021-03-10 11:15:46.916 +02:00 [INF] Vary header generated: Accept, Accept-Language, Accept-Encoding.
2021-03-10 11:15:46.919 +02:00 [INF] Request finished HTTP/2 POST https://localhost:44305/api/Account/login application/json-patch+json 47 - 202 331 application/json;+charset=utf-8 481.9059ms
2021-03-10 13:24:23.801 +02:00 [INF] Application Is Starting
2021-03-10 13:24:28.201 +02:00 [INF] User profile is available. Using 'C:\Users\nourm\AppData\Local\ASP.NET\DataProtection-Keys' as key repository and Windows DPAPI to encrypt keys at rest.
2021-03-10 13:24:29.079 +02:00 [INF] Application started. Press Ctrl+C to shut down.
2021-03-10 13:24:29.079 +02:00 [INF] Hosting environment: Development
2021-03-10 13:24:29.079 +02:00 [INF] Content root path: C:\Users\nourm\Desktop\BehindPixel\Projects\Wasel\Wasel.API
2021-03-10 13:24:29.243 +02:00 [INF] Request starting HTTP/2 GET https://localhost:44305/swagger/index.html - -
2021-03-10 13:24:29.753 +02:00 [INF] Request finished HTTP/2 GET https://localhost:44305/swagger/index.html - - - 200 - text/html;charset=utf-8 511.0242ms
2021-03-10 13:24:30.111 +02:00 [INF] Request starting HTTP/2 GET https://localhost:44305/swagger/v1/swagger.json - -
2021-03-10 13:24:30.427 +02:00 [INF] Request finished HTTP/2 GET https://localhost:44305/swagger/v1/swagger.json - - - 200 - application/json;charset=utf-8 315.7186ms
2021-03-10 15:35:49.906 +02:00 [INF] Application Is Starting
2021-03-10 15:35:54.423 +02:00 [INF] User profile is available. Using 'C:\Users\nourm\AppData\Local\ASP.NET\DataProtection-Keys' as key repository and Windows DPAPI to encrypt keys at rest.
2021-03-10 15:35:57.871 +02:00 [INF] Application started. Press Ctrl+C to shut down.
2021-03-10 15:35:57.871 +02:00 [INF] Hosting environment: Development
2021-03-10 15:35:57.871 +02:00 [INF] Content root path: C:\Users\nourm\Desktop\BehindPixel\Projects\Wasel\Wasel.API
2021-03-10 15:35:58.752 +02:00 [INF] Request starting HTTP/2 GET https://localhost:44305/swagger/index.html - -
2021-03-10 15:35:59.886 +02:00 [INF] Request finished HTTP/2 GET https://localhost:44305/swagger/index.html - - - 200 - text/html;charset=utf-8 1140.1008ms
2021-03-10 15:36:00.944 +02:00 [INF] Request starting HTTP/2 GET https://localhost:44305/swagger/v1/swagger.json - -
2021-03-10 15:36:01.555 +02:00 [INF] Request finished HTTP/2 GET https://localhost:44305/swagger/v1/swagger.json - - - 200 - application/json;charset=utf-8 610.7324ms
2021-03-10 15:36:40.687 +02:00 [INF] Application Is Starting
2021-03-10 15:36:44.832 +02:00 [INF] User profile is available. Using 'C:\Users\nourm\AppData\Local\ASP.NET\DataProtection-Keys' as key repository and Windows DPAPI to encrypt keys at rest.
2021-03-10 15:36:45.600 +02:00 [INF] Application started. Press Ctrl+C to shut down.
2021-03-10 15:36:45.601 +02:00 [INF] Hosting environment: Development
2021-03-10 15:36:45.601 +02:00 [INF] Content root path: C:\Users\nourm\Desktop\BehindPixel\Projects\Wasel\Wasel.API
2021-03-10 15:36:45.707 +02:00 [INF] Request starting HTTP/2 GET https://localhost:44305/swagger/index.html - -
2021-03-10 15:36:45.992 +02:00 [INF] Request finished HTTP/2 GET https://localhost:44305/swagger/index.html - - - 200 - text/html;charset=utf-8 286.9664ms
2021-03-10 15:36:46.948 +02:00 [INF] Request starting HTTP/2 GET https://localhost:44305/swagger/v1/swagger.json - -
2021-03-10 15:36:47.157 +02:00 [INF] Request finished HTTP/2 GET https://localhost:44305/swagger/v1/swagger.json - - - 200 - application/json;charset=utf-8 209.4205ms
