<svg xmlns="http://www.w3.org/2000/svg" xmlns:xlink="http://www.w3.org/1999/xlink" width="1024" height="1024" viewBox="0 0 1024 1024">
  <defs>
    <clipPath id="clip-logo">
      <rect width="1024" height="1024"/>
    </clipPath>
  </defs>
  <g id="logo" clip-path="url(#clip-logo)">
    <rect width="1024" height="1024"/>
    <g id="Rectangle_1785" data-name="Rectangle 1785" transform="translate(22.448 148.448)" fill="#a5a5a5" stroke="#fff" stroke-width="20">
      <rect width="672" height="672" rx="30" stroke="none"/>
      <rect x="10" y="10" width="652" height="652" rx="20" fill="none"/>
    </g>
    <g id="Rectangle_1784" data-name="Rectangle 1784" transform="matrix(0.966, -0.259, 0.259, 0.966, 86.934, 246.86)" fill="#ec2f53" stroke="#fff" stroke-width="30">
      <rect width="749" height="749" rx="40" stroke="none"/>
      <rect x="15" y="15" width="719" height="719" rx="25" fill="none"/>
    </g>
    <path id="Path_694" data-name="Path 694" d="M385.562,4505.64s21,75.26,24.716,91.447a15.49,15.49,0,0,0,20.172,11.6c5.232-1.7,12.693-3.468,8.663-20.662-10.125-43.2-23.775-91.46-23.775-91.46s-5.236-21.885-24.862-26.324c-9.424-2.134-33.631-1.5-36.561,15.112-8.775,49.724-6.337,29.25-6.337,29.25l-20.962,6.337s-1.462-49.236,20.962-59.96,35.586-19.987,75.073,7.312c9.99,6.907,7.073,20.152,11.212,27.787,11.813,21.786,24.374,91.947,24.374,91.947s7.312,27.486-22.424,40.648c-12.965,5.739-26.55-1.32-34.611-9.262a49.19,49.19,0,0,1-12.675-22.324l-21.449-86.873Z" transform="translate(-5 -4334)" fill="#fff"/>
    <text id="NC" transform="translate(592.415 643.806) rotate(-17)" fill="#fff" font-size="360" font-family="Poppins-Bold, Poppins" font-weight="700"><tspan x="-270.54" y="0">NC</tspan></text>
  </g>
</svg>
