{
  "files": {
    "main.css": "/static/css/main.b867f149.chunk.css",
    "main.js": "/static/js/main.cc7942fb.chunk.js",
    "main.js.map": "/static/js/main.cc7942fb.chunk.js.map",
    "runtime-main.js": "/static/js/runtime-main.00f8bb36.js",
    "runtime-main.js.map": "/static/js/runtime-main.00f8bb36.js.map",
    "static/js/2.b4e6efa8.chunk.js": "/static/js/2.b4e6efa8.chunk.js",
    "static/js/2.b4e6efa8.chunk.js.map": "/static/js/2.b4e6efa8.chunk.js.map",
    "index.html": "/index.html",
    "precache-manifest.98e41a598ccb9c40d5580b0ad91a2019.js": "/precache-manifest.98e41a598ccb9c40d5580b0ad91a2019.js",
    "service-worker.js": "/service-worker.js",
    "static/css/main.b867f149.chunk.css.map": "/static/css/main.b867f149.chunk.css.map",
    "static/js/2.b4e6efa8.chunk.js.LICENSE.txt": "/static/js/2.b4e6efa8.chunk.js.LICENSE.txt",
    "static/media/logo.svg": "/static/media/logo.5d5d9eef.svg"
  },
  "entrypoints": [
    "static/js/runtime-main.00f8bb36.js",
    "static/js/2.b4e6efa8.chunk.js",
    "static/css/main.b867f149.chunk.css",
    "static/js/main.cc7942fb.chunk.js"
  ]
}